"kenteken","voertuigsoort","merk","handelsbenaming","vervaldatum_apk","datum_tenaamstelling","bruto_bpm","inrichting","aantal_zitplaatsen","eerste_kleur","tweede_kleur","aantal_cilinders","cilinderinhoud","massa_ledig_voertuig","toegestane_maximum_massa_voertuig","massa_rijklaar","maximum_massa_trekken_ongeremd","maximum_trekken_massa_geremd","datum_eerste_toelating","datum_eerste_tenaamstelling_in_nederland","wacht_op_keuren","catalogusprijs","wam_verzekerd","maximale_constructiesnelheid","laadvermogen","oplegger_geremd","aanhangwagen_autonoom_geremd","aanhangwagen_middenas_geremd","aantal_staanplaatsen","aantal_deuren","aantal_wielen","afstand_hart_koppeling_tot_achterzijde_voertuig","afstand_voorzijde_voertuig_tot_hart_koppeling","afwijkende_maximum_snelheid","lengte","breedte","europese_voertuigcategorie","europese_voertuigcategorie_toevoeging","europese_uitvoeringcategorie_toevoeging","plaats_chassisnummer","technische_max_massa_voertuig","type","type_gasinstallatie","typegoedkeuringsnummer","variant","uitvoering","volgnummer_wijziging_eu_typegoedkeuring","vermogen_massarijklaar","wielbasis","export_indicator","openstaande_terugroepactie_indicator","vervaldatum_tachograaf","taxi_indicator","maximum_massa_samenstelling","aantal_rolstoelplaatsen","maximum_ondersteunende_snelheid","jaar_laatste_registratie_tellerstand","tellerstandoordeel","code_toelichting_tellerstandoordeel","tenaamstellen_mogelijk","vervaldatum_apk_dt","datum_tenaamstelling_dt","datum_eerste_toelating_dt","datum_eerste_tenaamstelling_in_nederland_dt","vervaldatum_tachograaf_dt","maximum_last_onder_de_vooras_sen_tezamen_koppeling","type_remsysteem_voertuig_code","rupsonderstelconfiguratiecode","wielbasis_voertuig_minimum","wielbasis_voertuig_maximum","lengte_voertuig_minimum","lengte_voertuig_maximum","breedte_voertuig_minimum","breedte_voertuig_maximum","hoogte_voertuig","hoogte_voertuig_minimum","hoogte_voertuig_maximum","massa_bedrijfsklaar_minimaal","massa_bedrijfsklaar_maximaal","technisch_toelaatbaar_massa_koppelpunt","maximum_massa_technisch_maximaal","maximum_massa_technisch_minimaal","subcategorie_nederland","verticale_belasting_koppelpunt_getrokken_voertuig","zuinigheidsclassificatie","registratie_datum_goedkeuring_afschrijvingsmoment_bpm","registratie_datum_goedkeuring_afschrijvingsmoment_bpm_dt","gem_lading_wrde","aerodyn_voorz","massa_alt_aandr","verl_cab_ind","api_gekentekende_voertuigen_assen","api_gekentekende_voertuigen_brandstof","api_gekentekende_voertuigen_carrosserie","api_gekentekende_voertuigen_carrosserie_specifiek","api_gekentekende_voertuigen_voertuigklasse"
"5ZSK94","Personenauto","MERCEDES-BENZ","CLS 220 BLUETEC","20241123","20180124","9405","stationwagen","5","GRIJS","Niet geregistreerd","4","2143","1745","2370","1845","750","2100","20150318","20150318","Geen verstrekking in Open Data","80388","Ja",,,,,,,"4","4","0","0",,"0","0","M1",,,"r. voorzitting","2370","218",,"e1*2007/46*0485*12","G20RP0","CZCCB521","0","0.07","287","Nee","Nee",,"Nee","4570","0","0.00","2023","Logisch","00","Ja","2024-11-23T00:00:00.000","2018-01-24T00:00:00.000","2015-03-18T00:00:00.000","2015-03-18T00:00:00.000",,,,,,,,,,,,,,,,,,,,,"B",,,,,,,"https://opendata.rdw.nl/resource/3huj-srit.json","https://opendata.rdw.nl/resource/8ys7-d773.json","https://opendata.rdw.nl/resource/vezc-m2t6.json","https://opendata.rdw.nl/resource/jhie-znh9.json","https://opendata.rdw.nl/resource/kmfi-hrps.json"
"GH206G","Personenauto","MERCEDES-BENZ","CLS 220 BLUETEC","20241013","20230327","8811","stationwagen","5","BLAUW","Niet geregistreerd","4","2143","1745","2370","1845","750","2100","20150605","20150605","Geen verstrekking in Open Data","68898","Ja",,,,,,,"4","4","0","0",,"0","0","M1",,,"r. voorzitting","2370","218",,"e1*2007/46*0485*13","G20RP0","CZCCB502","0","0.07","287","Nee","Nee",,"Nee","4570","0","0.00","2023","Onlogisch","04","Ja","2024-10-13T00:00:00.000","2023-03-27T00:00:00.000","2015-06-05T00:00:00.000","2015-06-05T00:00:00.000",,,,,,,,,,,,,,,,,,,,,"B",,,,,,,"https://opendata.rdw.nl/resource/3huj-srit.json","https://opendata.rdw.nl/resource/8ys7-d773.json","https://opendata.rdw.nl/resource/vezc-m2t6.json","https://opendata.rdw.nl/resource/jhie-znh9.json","https://opendata.rdw.nl/resource/kmfi-hrps.json"
"GK937V","Personenauto","MERCEDES-BENZ","CLS 220 BLUETEC","20240720","20230913","8415","sedan","4","ZWART","Niet geregistreerd","4","2143","1690","2275","1790",,,"20150625","20150625","Geen verstrekking in Open Data","73108","Ja",,,,,,,"4","4","0","0",,"0","0","M1",,,"r. voorzitting","2275","218",,"e1*2007/46*0485*12","G30RP0","CZCCB401","0","0.07","287","Nee","Nee",,"Nee","0","0","0.00","2023","Logisch","00","Ja","2024-07-20T00:00:00.000","2023-09-13T00:00:00.000","2015-06-25T00:00:00.000","2015-06-25T00:00:00.000",,,,,,,,,,,,,,,,,,,,,"B",,,,,,,"https://opendata.rdw.nl/resource/3huj-srit.json","https://opendata.rdw.nl/resource/8ys7-d773.json","https://opendata.rdw.nl/resource/vezc-m2t6.json","https://opendata.rdw.nl/resource/jhie-znh9.json","https://opendata.rdw.nl/resource/kmfi-hrps.json"
"GR813K","Personenauto","MERCEDES-BENZ","CLS 220 BLUETEC","20240829","20190802","9207","stationwagen","5","GRIJS","Niet geregistreerd","4","2143","1745","2370","1845","750","2100","20150803","20150803","Geen verstrekking in Open Data","80521","Ja",,,,,,,"4","4","0","0",,"0","0","M1",,,"r. voorzitting","2370","218",,"e1*2007/46*0485*13","G20RP0","CZCCB524","0","0.07","287","Nee","Nee",,"Nee","4570","0","0.00","2023","Logisch","00","Ja","2024-08-29T00:00:00.000","2019-08-02T00:00:00.000","2015-08-03T00:00:00.000","2015-08-03T00:00:00.000",,,,,,,,,,,,,,,,,,,,,"B",,,,,,,"https://opendata.rdw.nl/resource/3huj-srit.json","https://opendata.rdw.nl/resource/8ys7-d773.json","https://opendata.rdw.nl/resource/vezc-m2t6.json","https://opendata.rdw.nl/resource/jhie-znh9.json","https://opendata.rdw.nl/resource/kmfi-hrps.json"
"GS795K","Personenauto","MERCEDES-BENZ","CLS 220 BLUETEC","20240916","20231030","8487","stationwagen","5","GRIJS","Niet geregistreerd","4","2143","1745","2410","1845","750","2100","20140916","20150730","Geen verstrekking in Open Data","86913","Ja",,,,,,,"4","4",,,,,,"M1",,,"r. voorzitting","2410",,,,,,,"0.07","287","Nee","Nee",,"Nee","4570",,,"2023","Geen oordeel","05","Ja","2024-09-16T00:00:00.000","2023-10-30T00:00:00.000","2014-09-16T00:00:00.000","2015-07-30T00:00:00.000",,,,,,,,,,,,,,,,,,,,,,,,,,,,"https://opendata.rdw.nl/resource/3huj-srit.json","https://opendata.rdw.nl/resource/8ys7-d773.json","https://opendata.rdw.nl/resource/vezc-m2t6.json","https://opendata.rdw.nl/resource/jhie-znh9.json","https://opendata.rdw.nl/resource/kmfi-hrps.json"
"GZ297G","Personenauto","MERCEDES-BENZ","CLS 220 BLUETEC","20250409","20240209","6418","stationwagen","5","ZWART","Niet geregistreerd","4","2143","1745","2370","1845","750","2100","20141017","20150925","Geen verstrekking in Open Data","83658","Ja",,,,,,,"4","4","0","0",,"0","0","M1",,,"r. voorzitting","2370","218",,"e1*2007/46*0485*12","G20RP0","CZCCB521","0","0.07","287","Nee","Nee",,"Nee","4570","0","0.00","2024","Geen oordeel","05","Ja","2025-04-09T00:00:00.000","2024-02-09T00:00:00.000","2014-10-17T00:00:00.000","2015-09-25T00:00:00.000",,,,,,,,,,,,,,,,,,,,,"B",,,,,,,"https://opendata.rdw.nl/resource/3huj-srit.json","https://opendata.rdw.nl/resource/8ys7-d773.json","https://opendata.rdw.nl/resource/vezc-m2t6.json","https://opendata.rdw.nl/resource/jhie-znh9.json","https://opendata.rdw.nl/resource/kmfi-hrps.json"
"HK551V","Personenauto","MERCEDES-BENZ","CLS 220 BLUETEC","20240816","20210205","5453","sedan","4","WIT","Niet geregistreerd","4","2143","1690","2275","1790",,,"20141022","20151121","Geen verstrekking in Open Data","78061","Ja",,,,,,,"4","4","0","0",,"0","0","M1",,,"r. voorzitting","2275","218",,"e1*2007/46*0485*12","G30RP0","CZCCB401","0","0.07","287","Nee","Nee",,"Nee","0","0","0.00","2023","Geen oordeel","05","Ja","2024-08-16T00:00:00.000","2021-02-05T00:00:00.000","2014-10-22T00:00:00.000","2015-11-21T00:00:00.000",,,,,,,,,,,,,,,,,,,,,"B",,,,,,,"https://opendata.rdw.nl/resource/3huj-srit.json","https://opendata.rdw.nl/resource/8ys7-d773.json","https://opendata.rdw.nl/resource/vezc-m2t6.json","https://opendata.rdw.nl/resource/jhie-znh9.json","https://opendata.rdw.nl/resource/kmfi-hrps.json"
"HZ945D","Personenauto","MERCEDES-BENZ","CLS 220 BLUETEC","20250117","20220119","6641","stationwagen","5","GRIJS","Niet geregistreerd","4","2143","1745","2370","1845","750","2100","20150604","20160109","Geen verstrekking in Open Data","78162","Ja",,,,,,,"4","4","0","0",,"0","0","M1",,,"r. voorzitting","2370","218",,"e1*2007/46*0485*12","G20RP0","CZCCB521","0","0.07","287","Nee","Nee",,"Nee","4570","0","0.00","2024","Geen oordeel","05","Ja","2025-01-17T00:00:00.000","2022-01-19T00:00:00.000","2015-06-04T00:00:00.000","2016-01-09T00:00:00.000",,,,,,,,,,,,,,,,,,,,,"B",,,,,,,"https://opendata.rdw.nl/resource/3huj-srit.json","https://opendata.rdw.nl/resource/8ys7-d773.json","https://opendata.rdw.nl/resource/vezc-m2t6.json","https://opendata.rdw.nl/resource/jhie-znh9.json","https://opendata.rdw.nl/resource/kmfi-hrps.json"
"RL210F","Personenauto","MERCEDES-BENZ","CLS 220 BLUETEC","20241212","20171220","6314","sedan","4","WIT","Niet geregistreerd","4","2143","1690","2275","1790",,,"20150122","20171220","Geen verstrekking in Open Data","79609","Ja",,,,,,,"4","4",,,,,,"M1",,,"r. voorzitting","2275","218",,,,,,"0.07","287","Nee","Nee",,"Nee",,,,"2023","Geen oordeel","05","Ja","2024-12-12T00:00:00.000","2017-12-20T00:00:00.000","2015-01-22T00:00:00.000","2017-12-20T00:00:00.000",,,,,,,,,,,,,,,,,,,,,,,,,,,,"https://opendata.rdw.nl/resource/3huj-srit.json","https://opendata.rdw.nl/resource/8ys7-d773.json","https://opendata.rdw.nl/resource/vezc-m2t6.json","https://opendata.rdw.nl/resource/jhie-znh9.json","https://opendata.rdw.nl/resource/kmfi-hrps.json"
"S117SZ","Personenauto","MERCEDES-BENZ","CLS 220 BLUETEC","20250105","20230407","4317","sedan","4","ZWART","Niet geregistreerd","4","2143","1690","2275","1790",,,"20150528","20230407","Geen verstrekking in Open Data","70260","Ja","226",,,,,,"4","4",,,,,"188","M1",,,,"2275","218",,"e1*2007/46*0485*13","G30RP0","CZCCB404","0","0.07","287","Nee","Nee",,"Nee",,,,"2024","Geen oordeel","05","Ja","2025-01-05T00:00:00.000","2023-04-07T00:00:00.000","2015-05-28T00:00:00.000","2023-04-07T00:00:00.000",,,,,,,,,,,,,,,,,,,,,,"20230306","2023-03-06T00:00:00.000",,,,,"https://opendata.rdw.nl/resource/3huj-srit.json","https://opendata.rdw.nl/resource/8ys7-d773.json","https://opendata.rdw.nl/resource/vezc-m2t6.json","https://opendata.rdw.nl/resource/jhie-znh9.json","https://opendata.rdw.nl/resource/kmfi-hrps.json"
