"kenteken","voertuigsoort","merk","handelsbenaming","vervaldatum_apk","datum_tenaamstelling","bruto_bpm","inrichting","aantal_zitplaatsen","eerste_kleur","tweede_kleur","aantal_cilinders","cilinderinhoud","massa_ledig_voertuig","toegestane_maximum_massa_voertuig","massa_rijklaar","maximum_massa_trekken_ongeremd","maximum_trekken_massa_geremd","datum_eerste_toelating","datum_eerste_tenaamstelling_in_nederland","wacht_op_keuren","catalogusprijs","wam_verzekerd","maximale_constructiesnelheid","laadvermogen","oplegger_geremd","aanhangwagen_autonoom_geremd","aanhangwagen_middenas_geremd","aantal_staanplaatsen","aantal_deuren","aantal_wielen","afstand_hart_koppeling_tot_achterzijde_voertuig","afstand_voorzijde_voertuig_tot_hart_koppeling","afwijkende_maximum_snelheid","lengte","breedte","europese_voertuigcategorie","europese_voertuigcategorie_toevoeging","europese_uitvoeringcategorie_toevoeging","plaats_chassisnummer","technische_max_massa_voertuig","type","type_gasinstallatie","typegoedkeuringsnummer","variant","uitvoering","volgnummer_wijziging_eu_typegoedkeuring","vermogen_massarijklaar","wielbasis","export_indicator","openstaande_terugroepactie_indicator","vervaldatum_tachograaf","taxi_indicator","maximum_massa_samenstelling","aantal_rolstoelplaatsen","maximum_ondersteunende_snelheid","jaar_laatste_registratie_tellerstand","tellerstandoordeel","code_toelichting_tellerstandoordeel","tenaamstellen_mogelijk","vervaldatum_apk_dt","datum_tenaamstelling_dt","datum_eerste_toelating_dt","datum_eerste_tenaamstelling_in_nederland_dt","vervaldatum_tachograaf_dt","maximum_last_onder_de_vooras_sen_tezamen_koppeling","type_remsysteem_voertuig_code","rupsonderstelconfiguratiecode","wielbasis_voertuig_minimum","wielbasis_voertuig_maximum","lengte_voertuig_minimum","lengte_voertuig_maximum","breedte_voertuig_minimum","breedte_voertuig_maximum","hoogte_voertuig","hoogte_voertuig_minimum","hoogte_voertuig_maximum","massa_bedrijfsklaar_minimaal","massa_bedrijfsklaar_maximaal","technisch_toelaatbaar_massa_koppelpunt","maximum_massa_technisch_maximaal","maximum_massa_technisch_minimaal","subcategorie_nederland","verticale_belasting_koppelpunt_getrokken_voertuig","zuinigheidsclassificatie","registratie_datum_goedkeuring_afschrijvingsmoment_bpm","registratie_datum_goedkeuring_afschrijvingsmoment_bpm_dt","gem_lading_wrde","aerodyn_voorz","massa_alt_aandr","verl_cab_ind","api_gekentekende_voertuigen_assen","api_gekentekende_voertuigen_brandstof","api_gekentekende_voertuigen_carrosserie","api_gekentekende_voertuigen_carrosserie_specifiek","api_gekentekende_voertuigen_voertuigklasse"
"4XNZ60","Personenauto","MERCEDES-AMG","S63 AMG 4MATIC","20240926","20140926","34551","coupe","4","WIT","Niet geregistreerd","8","5461","1970","2545","2070",,,"20140926","20140926","Geen verstrekking in Open Data","259139","Ja",,,,,,,"2","4","0","0",,"504","0","M1",,,"by zywand r. voorzitting","2545","221 AMG",,"e1*2001/116*0396*12","P37UP1","RZBBR43B","0","0.21","295","Nee","Ja",,"Nee","0","0",,"2023","Logisch","00","Ja","2024-09-26T00:00:00.000","2014-09-26T00:00:00.000","2014-09-26T00:00:00.000","2014-09-26T00:00:00.000",,,,,,,,,,,,,,,,,,,,,"G",,,,,,,"https://opendata.rdw.nl/resource/3huj-srit.json","https://opendata.rdw.nl/resource/8ys7-d773.json","https://opendata.rdw.nl/resource/vezc-m2t6.json","https://opendata.rdw.nl/resource/jhie-znh9.json","https://opendata.rdw.nl/resource/kmfi-hrps.json"
"4XVK62","Personenauto","MERCEDES-AMG","S63 AMG 4MATIC","20241120","20160429","34551","coupe","4","ZWART","Niet geregistreerd","8","5461","1970","2545","2070",,,"20141120","20141120","Geen verstrekking in Open Data","264003","Ja",,,,,,,"2","4","0","0",,"504","0","M1",,,"by zywand r. voorzitting","2545","221 AMG",,"e1*2001/116*0396*12","P37UP1","RZBBR43B","0","0.21","295","Nee","Nee",,"Nee","0","0",,"2023","Logisch","00","Ja","2024-11-20T00:00:00.000","2016-04-29T00:00:00.000","2014-11-20T00:00:00.000","2014-11-20T00:00:00.000",,,,,,,,,,,,,,,,,,,,,"G",,,,,,,"https://opendata.rdw.nl/resource/3huj-srit.json","https://opendata.rdw.nl/resource/8ys7-d773.json","https://opendata.rdw.nl/resource/vezc-m2t6.json","https://opendata.rdw.nl/resource/jhie-znh9.json","https://opendata.rdw.nl/resource/kmfi-hrps.json"
"6XRV78","Personenauto","MERCEDES-AMG","S63 AMG 4MATIC","20240604","20210401","34551","coupe","4","GRIJS","Niet geregistreerd","8","5461","1970","2545","2070",,,"20141015","20141015","Geen verstrekking in Open Data","259653","Ja",,,,,,,"2","4","0","0",,"504","0","M1",,,"by zywand r. voorzitting","2545","221 AMG",,"e1*2001/116*0396*13","P37UP1","RZBBR43B","0","0.21","295","Nee","Nee",,"Nee","0","0",,"2023","Logisch","00","Ja","2024-06-04T00:00:00.000","2021-04-01T00:00:00.000","2014-10-15T00:00:00.000","2014-10-15T00:00:00.000",,,,,,,,,,,,,,,,,,,,,"G",,,,,,,"https://opendata.rdw.nl/resource/3huj-srit.json","https://opendata.rdw.nl/resource/8ys7-d773.json","https://opendata.rdw.nl/resource/vezc-m2t6.json","https://opendata.rdw.nl/resource/jhie-znh9.json","https://opendata.rdw.nl/resource/kmfi-hrps.json"
"6ZNS53","Personenauto","MERCEDES-AMG","S63 AMG 4MATIC","20241019","20150209","30045","coupe","4","GRIJS","Niet geregistreerd","8","5461","1970","2545","2070",,,"20140917","20150209","Geen verstrekking in Open Data","222743","Ja",,,,,,,"2","4","0","0",,"504","0","M1",,,"by zywand r. voorzitting","2545","221 AMG",,"e1*2001/116*0396*12","P37UP1","RZBBR43B","0","0.21","295","Nee","Nee",,"Nee","0","0",,"2024","Geen oordeel","05","Ja","2024-10-19T00:00:00.000","2015-02-09T00:00:00.000","2014-09-17T00:00:00.000","2015-02-09T00:00:00.000",,,,,,,,,,,,,,,,,,,,,"G",,,,,,,"https://opendata.rdw.nl/resource/3huj-srit.json","https://opendata.rdw.nl/resource/8ys7-d773.json","https://opendata.rdw.nl/resource/vezc-m2t6.json","https://opendata.rdw.nl/resource/jhie-znh9.json","https://opendata.rdw.nl/resource/kmfi-hrps.json"
"7ZFV07","Personenauto","MERCEDES-AMG","S63 AMG 4MATIC","20250102","20240506","34551","coupe","4","ZWART","Niet geregistreerd","8","5461","1970","2545","2070",,,"20150102","20150102","Geen verstrekking in Open Data","258243","Ja",,,,,,,"2","4","0","0",,"504","0","M1",,,"by zywand r. voorzitting","2545","221 AMG",,"e1*2001/116*0396*12","P37UP1","RZBBR43B","0","0.21","295","Nee","Nee",,"Nee","0","0",,"2024","Logisch","00","Ja","2025-01-02T00:00:00.000","2024-05-06T00:00:00.000","2015-01-02T00:00:00.000","2015-01-02T00:00:00.000",,,,,,,,,,,,,,,,,,,,,"G",,,,,,,"https://opendata.rdw.nl/resource/3huj-srit.json","https://opendata.rdw.nl/resource/8ys7-d773.json","https://opendata.rdw.nl/resource/vezc-m2t6.json","https://opendata.rdw.nl/resource/jhie-znh9.json","https://opendata.rdw.nl/resource/kmfi-hrps.json"
"7ZTL13","Personenauto","MERCEDES-AMG","S63 AMG 4MATIC","20241019","20240209","39447","coupe","4","GRIJS","Niet geregistreerd","8","5461","1970","2545","2070",,,"20150318","20150326","Geen verstrekking in Open Data","245493","Ja",,,,,,,"2","4","0","0",,"504","0","M1",,,"by zywand r. voorzitting","2545","221 AMG",,"e1*2001/116*0396*12","P37UP1","RZBBR40B","0","0.21","295","Nee","Ja",,"Nee","0","0",,"2024","Logisch","00","Ja","2024-10-19T00:00:00.000","2024-02-09T00:00:00.000","2015-03-18T00:00:00.000","2015-03-26T00:00:00.000",,,,,,,,,,,,,,,,,,,,,"G",,,,,,,"https://opendata.rdw.nl/resource/3huj-srit.json","https://opendata.rdw.nl/resource/8ys7-d773.json","https://opendata.rdw.nl/resource/vezc-m2t6.json","https://opendata.rdw.nl/resource/jhie-znh9.json","https://opendata.rdw.nl/resource/kmfi-hrps.json"
"8ZSR50","Personenauto","MERCEDES-AMG","S63 AMG 4MATIC","20230407","20230630","22501","coupe","4","GRIJS","Niet geregistreerd","8","5461","1970","2545","2070",,,"20150318","20150318","Geen verstrekking in Open Data","229624","Ja",,,,,,,"2","4","0","0",,"504","0","M1",,,"by zywand r. voorzitting","2545","221 AMG",,"e1*2001/116*0396*14","P37UP1","RZBBR43B","0","0.21","295","Nee","Nee",,"Nee","0","0",,"2023","Geen oordeel","05","Ja","2023-04-07T00:00:00.000","2023-06-30T00:00:00.000","2015-03-18T00:00:00.000","2015-03-18T00:00:00.000",,,,,,,,,,,,,,,,,,,,,"G",,,,,,,"https://opendata.rdw.nl/resource/3huj-srit.json","https://opendata.rdw.nl/resource/8ys7-d773.json","https://opendata.rdw.nl/resource/vezc-m2t6.json","https://opendata.rdw.nl/resource/jhie-znh9.json","https://opendata.rdw.nl/resource/kmfi-hrps.json"
"9XNT37","Personenauto","MERCEDES-AMG","S63 AMG 4MATIC","20241006","20210909","34551","coupe","4","ZWART","Niet geregistreerd","8","5461","1970","2545","2070",,,"20140926","20140926","Geen verstrekking in Open Data","240444","Ja",,,,,,,"2","4","0","0",,"504","0","M1",,,"by zywand r. voorzitting","2545","221 AMG",,"e1*2001/116*0396*12","P37UP1","RZBBR40B","0","0.21","295","Nee","Nee",,"Nee","0","0",,"2023","Logisch","00","Ja","2024-10-06T00:00:00.000","2021-09-09T00:00:00.000","2014-09-26T00:00:00.000","2014-09-26T00:00:00.000",,,,,,,,,,,,,,,,,,,,,"G",,,,,,,"https://opendata.rdw.nl/resource/3huj-srit.json","https://opendata.rdw.nl/resource/8ys7-d773.json","https://opendata.rdw.nl/resource/vezc-m2t6.json","https://opendata.rdw.nl/resource/jhie-znh9.json","https://opendata.rdw.nl/resource/kmfi-hrps.json"
"GD965Z","Personenauto","MERCEDES-AMG","S63 AMG 4MATIC","20210124","20210908","25372","coupe","4","GRIJS","Niet geregistreerd","8","5461","1970","2545","2070",,,"20150108","20150425","Geen verstrekking in Open Data","262744","Ja",,,,,,,"2","4","0","0",,"504","0","M1",,,"by zywand r. voorzitting","2545","221 AMG",,"e1*2001/116*0396*13","P37UP1","RZBBR43B","0","0.21","295","Nee","Nee",,"Nee","0","0",,"2021","Geen oordeel","05","Ja","2021-01-24T00:00:00.000","2021-09-08T00:00:00.000","2015-01-08T00:00:00.000","2015-04-25T00:00:00.000",,,,,,,,,,,,,,,,,,,,,"G",,,,,,,"https://opendata.rdw.nl/resource/3huj-srit.json","https://opendata.rdw.nl/resource/8ys7-d773.json","https://opendata.rdw.nl/resource/vezc-m2t6.json","https://opendata.rdw.nl/resource/jhie-znh9.json","https://opendata.rdw.nl/resource/kmfi-hrps.json"
"GG248V","Personenauto","MERCEDES-AMG","S63 AMG 4MATIC","20250528","20210226","39447","coupe","4","ZWART","Niet geregistreerd","8","5461","1970","2545","2070",,,"20150528","20150528","Geen verstrekking in Open Data","270345","Ja",,,,,,,"2","4","0","0",,"504","0","M1",,,"by zywand r. voorzitting","2545","221 AMG",,"e1*2001/116*0396*15","P37UP1","RZBBR40B","0","0.21","295","Nee","Nee",,"Nee","0","0",,"2024","Logisch","00","Ja","2025-05-28T00:00:00.000","2021-02-26T00:00:00.000","2015-05-28T00:00:00.000","2015-05-28T00:00:00.000",,,,,,,,,,,,,,,,,,,,,"G",,,,,,,"https://opendata.rdw.nl/resource/3huj-srit.json","https://opendata.rdw.nl/resource/8ys7-d773.json","https://opendata.rdw.nl/resource/vezc-m2t6.json","https://opendata.rdw.nl/resource/jhie-znh9.json","https://opendata.rdw.nl/resource/kmfi-hrps.json"
"GG734H","Personenauto","MERCEDES-AMG","S63 AMG 4MATIC","20250513","20220520","39447","coupe","4","ZWART","Niet geregistreerd","8","5461","1970","2545","2070",,,"20150513","20150513","Geen verstrekking in Open Data","252963","Ja",,,,,,,"2","4","0","0",,"504","0","M1",,,"by zywand r. voorzitting","2545","221 AMG",,"e1*2001/116*0396*12","P37UP1","RZBBR43B","0","0.21","295","Nee","Nee",,"Nee","0","0",,"2024","Logisch","00","Ja","2025-05-13T00:00:00.000","2022-05-20T00:00:00.000","2015-05-13T00:00:00.000","2015-05-13T00:00:00.000",,,,,,,,,,,,,,,,,,,,,"G",,,,,,,"https://opendata.rdw.nl/resource/3huj-srit.json","https://opendata.rdw.nl/resource/8ys7-d773.json","https://opendata.rdw.nl/resource/vezc-m2t6.json","https://opendata.rdw.nl/resource/jhie-znh9.json","https://opendata.rdw.nl/resource/kmfi-hrps.json"
"GK862B","Personenauto","MERCEDES-AMG","S63 AMG 4MATIC","20250328","20210325","30059","coupe","4","ZWART","Niet geregistreerd","8","5461","1970","2545","2070",,,"20150105","20150611","Geen verstrekking in Open Data","231475","Ja",,,,,,,"2","4","0","0",,"504","0","M1",,,"by zywand r. voorzitting","2545","221 AMG",,"e1*2001/116*0396*13","P37UP1","RZBBR40B","0","0.21","295","Nee","Nee",,"Nee","0","0",,"2024","Geen oordeel","05","Ja","2025-03-28T00:00:00.000","2021-03-25T00:00:00.000","2015-01-05T00:00:00.000","2015-06-11T00:00:00.000",,,,,,,,,,,,,,,,,,,,,"G",,,,,,,"https://opendata.rdw.nl/resource/3huj-srit.json","https://opendata.rdw.nl/resource/8ys7-d773.json","https://opendata.rdw.nl/resource/vezc-m2t6.json","https://opendata.rdw.nl/resource/jhie-znh9.json","https://opendata.rdw.nl/resource/kmfi-hrps.json"
"GN147D","Personenauto","MERCEDES-AMG","S63 AMG 4MATIC","20240801","20211216","39447","coupe","4","ZWART","Niet geregistreerd","8","5461","1970","2545","2070",,,"20150629","20150629","Geen verstrekking in Open Data","270327","Ja",,,,,,,"2","4","0","0",,"504","0","M1",,,"by zywand r. voorzitting","2545","221 AMG",,"e1*2001/116*0396*13","P37UP1","RZBBR43B","0","0.21","295","Nee","Nee",,"Nee","0","0",,"2023","Logisch","00","Ja","2024-08-01T00:00:00.000","2021-12-16T00:00:00.000","2015-06-29T00:00:00.000","2015-06-29T00:00:00.000",,,,,,,,,,,,,,,,,,,,,"G",,,,,,,"https://opendata.rdw.nl/resource/3huj-srit.json","https://opendata.rdw.nl/resource/8ys7-d773.json","https://opendata.rdw.nl/resource/vezc-m2t6.json","https://opendata.rdw.nl/resource/jhie-znh9.json","https://opendata.rdw.nl/resource/kmfi-hrps.json"
"GP364N","Personenauto","MERCEDES-AMG","S63 AMG 4MATIC","20240608","20210608","28119","coupe","4","ZWART","Niet geregistreerd","8","5461","1970","2545","2070",,,"20141027","20150727","Geen verstrekking in Open Data","237835","Ja",,,,,,,"2","4","0","0",,"504","0","M1",,,"by zywand r. voorzitting","2545","221 AMG",,"e1*2001/116*0396*12","P37UP1","RZBBR43B","0","0.21","295","Nee","Ja",,"Nee","0","0",,"2023","Geen oordeel","05","Ja","2024-06-08T00:00:00.000","2021-06-08T00:00:00.000","2014-10-27T00:00:00.000","2015-07-27T00:00:00.000",,,,,,,,,,,,,,,,,,,,,"G",,,,,,,"https://opendata.rdw.nl/resource/3huj-srit.json","https://opendata.rdw.nl/resource/8ys7-d773.json","https://opendata.rdw.nl/resource/vezc-m2t6.json","https://opendata.rdw.nl/resource/jhie-znh9.json","https://opendata.rdw.nl/resource/kmfi-hrps.json"
"HD908R","Personenauto","MERCEDES-AMG","S63 AMG 4MATIC","20250212","20220923","39447","coupe","4","WIT","Niet geregistreerd","8","5461","1970","2545","2070",,,"20151010","20151010","Geen verstrekking in Open Data","258602","Ja",,,,,,,"2","4","0","0",,"504","0","M1",,,"by zywand r. voorzitting","2545","221 AMG",,"e1*2001/116*0396*16","P37UP1","RZBBR40B","0","0.21","295","Nee","Nee",,"Nee","0","0",,"2024","Logisch","00","Ja","2025-02-12T00:00:00.000","2022-09-23T00:00:00.000","2015-10-10T00:00:00.000","2015-10-10T00:00:00.000",,,,,,,,,,,,,,,,,,,,,"G",,,,,,,"https://opendata.rdw.nl/resource/3huj-srit.json","https://opendata.rdw.nl/resource/8ys7-d773.json","https://opendata.rdw.nl/resource/vezc-m2t6.json","https://opendata.rdw.nl/resource/jhie-znh9.json","https://opendata.rdw.nl/resource/kmfi-hrps.json"
"J556DF","Personenauto","MERCEDES-AMG","S63 AMG 4MATIC","20240713","20200630","21896","coupe","4","GRIJS","Niet geregistreerd","8","5461","1970","2545","2070",,,"20150522","20200630","Geen verstrekking in Open Data","243563","Ja",,,,,,,"2","4",,,,"504","191","M1",,,"l. by r. achterzitting in pers.ruimte","2545","221 AMG",,"e1*2001/116*0396*15","P37UP1","RZBBR43B","0","0.21","295","Nee","Nee",,"Nee",,,,"2023","Geen oordeel","05","Ja","2024-07-13T00:00:00.000","2020-06-30T00:00:00.000","2015-05-22T00:00:00.000","2020-06-30T00:00:00.000",,,,,,,,,,,"142",,,,,,,,,,"G",,,,,,,"https://opendata.rdw.nl/resource/3huj-srit.json","https://opendata.rdw.nl/resource/8ys7-d773.json","https://opendata.rdw.nl/resource/vezc-m2t6.json","https://opendata.rdw.nl/resource/jhie-znh9.json","https://opendata.rdw.nl/resource/kmfi-hrps.json"
"JH966V","Personenauto","MERCEDES-AMG","S63 AMG 4MATIC","20250207","20220915","28029","coupe","4","ZWART","Niet geregistreerd","8","5461","1970","2545","2070",,,"20141205","20160324","Geen verstrekking in Open Data","223808","Ja",,,,,,,"2","4","0","0",,"504","0","M1",,,"by zywand r. voorzitting","2545","221 AMG",,"e1*2001/116*0396*13","P37UP1","RZBBR40B","0","0.21","295","Nee","Nee",,"Nee","0","0",,"2024","Geen oordeel","05","Ja","2025-02-07T00:00:00.000","2022-09-15T00:00:00.000","2014-12-05T00:00:00.000","2016-03-24T00:00:00.000",,,,,,,,,,,,,,,,,,,,,"G",,,,,,,"https://opendata.rdw.nl/resource/3huj-srit.json","https://opendata.rdw.nl/resource/8ys7-d773.json","https://opendata.rdw.nl/resource/vezc-m2t6.json","https://opendata.rdw.nl/resource/jhie-znh9.json","https://opendata.rdw.nl/resource/kmfi-hrps.json"
"K863NF","Personenauto","MERCEDES-AMG","S63 AMG 4MATIC","20240331","20240229","4200","coupe","4","ZWART","Niet geregistreerd","8","5461","1970","2545","2070",,,"20140402","20210106","Geen verstrekking in Open Data","232367","Ja","300",,,,,,"2","4","0","0",,"504","191","M1",,,"l. by r. achterzitting in pers.ruimte","2545","221 AMG",,"e1*2001/116*0396*12","P37UP1","RZBBR40B","0","0.21","295","Nee","Nee",,"Nee","0","0",,"2024","Geen oordeel","05","Ja","2024-03-31T00:00:00.000","2024-02-29T00:00:00.000","2014-04-02T00:00:00.000","2021-01-06T00:00:00.000",,,,,,,,,,,,,,,,,,,,,"G",,,,,,,"https://opendata.rdw.nl/resource/3huj-srit.json","https://opendata.rdw.nl/resource/8ys7-d773.json","https://opendata.rdw.nl/resource/vezc-m2t6.json","https://opendata.rdw.nl/resource/jhie-znh9.json","https://opendata.rdw.nl/resource/kmfi-hrps.json"
"KN838R","Personenauto","MERCEDES-AMG","S63 AMG 4MATIC","20240929","20161025","28811","coupe","4","ZWART","Niet geregistreerd","8","5461","1970","2545","2070",,,"20150929","20161025","Geen verstrekking in Open Data","257855","Ja",,,,,,,"2","4","0","0",,"504","0","M1",,,"by zywand r. voorzitting","2545","221 AMG",,"e1*2001/116*0396*16","P37UP1","RZBBR40B","0","0.21","295","Nee","Nee",,"Nee","0","0",,"2023","Geen oordeel","05","Ja","2024-09-29T00:00:00.000","2016-10-25T00:00:00.000","2015-09-29T00:00:00.000","2016-10-25T00:00:00.000",,,,,,,,,,,,,,,,,,,,,"G",,,,,,,"https://opendata.rdw.nl/resource/3huj-srit.json","https://opendata.rdw.nl/resource/8ys7-d773.json","https://opendata.rdw.nl/resource/vezc-m2t6.json","https://opendata.rdw.nl/resource/jhie-znh9.json","https://opendata.rdw.nl/resource/kmfi-hrps.json"
"P717JD","Personenauto","MERCEDES-AMG","S63 AMG 4MATIC","20250508","20220909","32058","coupe","4","GRIJS","Niet geregistreerd","8","5461","1970","2545","2070",,,"20150326","20220321","Geen verstrekking in Open Data","243714","Ja","300",,,,,,"2","4","0","0",,"504","191","M1",,,,"2545","221 AMG",,"e1*2001/116*0396*15","P37UP1","RZBBR40B","0","0.21","295","Nee","Nee",,"Nee","0","0",,"2024","Geen oordeel","05","Ja","2025-05-08T00:00:00.000","2022-09-09T00:00:00.000","2015-03-26T00:00:00.000","2022-03-21T00:00:00.000",,,,,,,,,,,,,,,,,,,,,,"20220104","2022-01-04T00:00:00.000",,,,,"https://opendata.rdw.nl/resource/3huj-srit.json","https://opendata.rdw.nl/resource/8ys7-d773.json","https://opendata.rdw.nl/resource/vezc-m2t6.json","https://opendata.rdw.nl/resource/jhie-znh9.json","https://opendata.rdw.nl/resource/kmfi-hrps.json"
"P927NV","Personenauto","MERCEDES-AMG","S63 AMG 4MATIC","20250208","20231016","20403","coupe","4","GRIJS","Niet geregistreerd","8","5461","1970","2545","2070",,,"20150121","20220428","Geen verstrekking in Open Data","234578","Ja","300",,,,,,"2","4","0","0",,"504","191","M1",,,"l. by r. achterzitting in pers.ruimte","2545","221 AMG",,"e1*2001/116*0396*13","P37UP1","RZBBR43B","0","0.21","295","Nee","Nee",,"Nee","0","0",,"2024","Geen oordeel","05","Ja","2025-02-08T00:00:00.000","2023-10-16T00:00:00.000","2015-01-21T00:00:00.000","2022-04-28T00:00:00.000",,,,,,,,,,,,,,,,,,,,,,"20220413","2022-04-13T00:00:00.000",,,,,"https://opendata.rdw.nl/resource/3huj-srit.json","https://opendata.rdw.nl/resource/8ys7-d773.json","https://opendata.rdw.nl/resource/vezc-m2t6.json","https://opendata.rdw.nl/resource/jhie-znh9.json","https://opendata.rdw.nl/resource/kmfi-hrps.json"
"PX470N","Personenauto","MERCEDES-AMG","S63 AMG 4MATIC","20241207","20170928","30541","coupe","4","GRIJS","Niet geregistreerd","8","5461","1970","2545","2070",,,"20151207","20170928","Geen verstrekking in Open Data","258591","Ja",,,,,,,"2","4","0","0",,"504","0","M1",,,"by zywand r. voorzitting","2545","221 AMG",,"e1*2001/116*0396*16","P37UP1","RZBBR40B","0","0.21","295","Nee","Nee",,"Nee","0","0",,"2023","Geen oordeel","05","Ja","2024-12-07T00:00:00.000","2017-09-28T00:00:00.000","2015-12-07T00:00:00.000","2017-09-28T00:00:00.000",,,,,,,,,,,,,,,,,,,,,"G",,,,,,,"https://opendata.rdw.nl/resource/3huj-srit.json","https://opendata.rdw.nl/resource/8ys7-d773.json","https://opendata.rdw.nl/resource/vezc-m2t6.json","https://opendata.rdw.nl/resource/jhie-znh9.json","https://opendata.rdw.nl/resource/kmfi-hrps.json"
"TF695R","Personenauto","MERCEDES-AMG","S63 AMG 4MATIC","20240824","20230819","14152","coupe","4","GRIJS","Niet geregistreerd","8","5461","1970","2545","2070",,,"20160421","20180716","Geen verstrekking in Open Data","235127","Ja",,,,,,,"2","4","0","0",,"504","0","M1",,,"l. by r. achterzitting in pers.ruimte","2545","221 AMG",,"e1*2001/116*0396*16","P37UP1","RZBBR43B","0","0.21","295","Nee","Nee",,"Nee","0","0","0.00","2024","Geen oordeel","05","Ja","2024-08-24T00:00:00.000","2023-08-19T00:00:00.000","2016-04-21T00:00:00.000","2018-07-16T00:00:00.000",,,,,,,,,,,,,,,,,,,,,"G",,,,,,,"https://opendata.rdw.nl/resource/3huj-srit.json","https://opendata.rdw.nl/resource/8ys7-d773.json","https://opendata.rdw.nl/resource/vezc-m2t6.json","https://opendata.rdw.nl/resource/jhie-znh9.json","https://opendata.rdw.nl/resource/kmfi-hrps.json"
"TJ365J","Personenauto","MERCEDES-AMG","S63 AMG 4MATIC","20250504","20180809","27940","coupe","4","ZWART","Niet geregistreerd","8","5461","1970","2545","2070",,,"20150901","20180809","Geen verstrekking in Open Data","257995","Ja",,,,,,,"2","4","0","0",,"504","0","M1",,,"by zywand r. voorzitting","2545","221 AMG",,"e1*2001/116*0396*16","P37UP1","RZBBR43B","0","0.21","295","Nee","Nee",,"Nee","0","0","0.00","2024","Geen oordeel","05","Ja","2025-05-04T00:00:00.000","2018-08-09T00:00:00.000","2015-09-01T00:00:00.000","2018-08-09T00:00:00.000",,,,,,,,,,,,,,,,,,,,,"G",,,,,,,"https://opendata.rdw.nl/resource/3huj-srit.json","https://opendata.rdw.nl/resource/8ys7-d773.json","https://opendata.rdw.nl/resource/vezc-m2t6.json","https://opendata.rdw.nl/resource/jhie-znh9.json","https://opendata.rdw.nl/resource/kmfi-hrps.json"
"X735ZZ","Personenauto","MERCEDES-AMG","S63 AMG 4MATIC","20250228","20240228","24725","coupe","4","WIT","Niet geregistreerd","8","5461","1970","2545","2070",,,"20150526","20240228","Geen verstrekking in Open Data","242843","Ja","300",,,,,,"2","4","0","0",,"504","191","M1",,,,"2545","221 AMG",,"e1*2001/116*0396*12","P37UP1","RZBBR40B","0","0.21","295","Nee","Nee",,"Nee","0","0",,"2024","Geen oordeel","05","Ja","2025-02-28T00:00:00.000","2024-02-28T00:00:00.000","2015-05-26T00:00:00.000","2024-02-28T00:00:00.000",,,,,,,,,,,,,,,,,,,,,,"20240223","2024-02-23T00:00:00.000",,,,,"https://opendata.rdw.nl/resource/3huj-srit.json","https://opendata.rdw.nl/resource/8ys7-d773.json","https://opendata.rdw.nl/resource/vezc-m2t6.json","https://opendata.rdw.nl/resource/jhie-znh9.json","https://opendata.rdw.nl/resource/kmfi-hrps.json"
"XF092X","Personenauto","MERCEDES-AMG","S63 AMG 4MATIC","20250321","20181218","13037","coupe","4","ZWART","Niet geregistreerd","8","5461","1970","2545","2070",,,"20150128","20181218","Geen verstrekking in Open Data","239330","Ja",,,,,,,"2","4",,,,,,"M1",,,"by zywand r. voorzitting","2545","221 AMG",,,,,,"0.21","295","Nee","Nee",,"Nee",,,,"2024","Geen oordeel","05","Ja","2025-03-21T00:00:00.000","2018-12-18T00:00:00.000","2015-01-28T00:00:00.000","2018-12-18T00:00:00.000",,,,,,,,,,,,,,,,,,,,,,,,,,,,"https://opendata.rdw.nl/resource/3huj-srit.json","https://opendata.rdw.nl/resource/8ys7-d773.json","https://opendata.rdw.nl/resource/vezc-m2t6.json","https://opendata.rdw.nl/resource/jhie-znh9.json","https://opendata.rdw.nl/resource/kmfi-hrps.json"