"kenteken","voertuigsoort","merk","handelsbenaming","vervaldatum_apk","datum_tenaamstelling","bruto_bpm","inrichting","aantal_zitplaatsen","eerste_kleur","tweede_kleur","aantal_cilinders","cilinderinhoud","massa_ledig_voertuig","toegestane_maximum_massa_voertuig","massa_rijklaar","maximum_massa_trekken_ongeremd","maximum_trekken_massa_geremd","datum_eerste_toelating","datum_eerste_tenaamstelling_in_nederland","wacht_op_keuren","catalogusprijs","wam_verzekerd","maximale_constructiesnelheid","laadvermogen","oplegger_geremd","aanhangwagen_autonoom_geremd","aanhangwagen_middenas_geremd","aantal_staanplaatsen","aantal_deuren","aantal_wielen","afstand_hart_koppeling_tot_achterzijde_voertuig","afstand_voorzijde_voertuig_tot_hart_koppeling","afwijkende_maximum_snelheid","lengte","breedte","europese_voertuigcategorie","europese_voertuigcategorie_toevoeging","europese_uitvoeringcategorie_toevoeging","plaats_chassisnummer","technische_max_massa_voertuig","type","type_gasinstallatie","typegoedkeuringsnummer","variant","uitvoering","volgnummer_wijziging_eu_typegoedkeuring","vermogen_massarijklaar","wielbasis","export_indicator","openstaande_terugroepactie_indicator","vervaldatum_tachograaf","taxi_indicator","maximum_massa_samenstelling","aantal_rolstoelplaatsen","maximum_ondersteunende_snelheid","jaar_laatste_registratie_tellerstand","tellerstandoordeel","code_toelichting_tellerstandoordeel","tenaamstellen_mogelijk","vervaldatum_apk_dt","datum_tenaamstelling_dt","datum_eerste_toelating_dt","datum_eerste_tenaamstelling_in_nederland_dt","vervaldatum_tachograaf_dt","maximum_last_onder_de_vooras_sen_tezamen_koppeling","type_remsysteem_voertuig_code","rupsonderstelconfiguratiecode","wielbasis_voertuig_minimum","wielbasis_voertuig_maximum","lengte_voertuig_minimum","lengte_voertuig_maximum","breedte_voertuig_minimum","breedte_voertuig_maximum","hoogte_voertuig","hoogte_voertuig_minimum","hoogte_voertuig_maximum","massa_bedrijfsklaar_minimaal","massa_bedrijfsklaar_maximaal","technisch_toelaatbaar_massa_koppelpunt","maximum_massa_technisch_maximaal","maximum_massa_technisch_minimaal","subcategorie_nederland","verticale_belasting_koppelpunt_getrokken_voertuig","zuinigheidsclassificatie","registratie_datum_goedkeuring_afschrijvingsmoment_bpm","registratie_datum_goedkeuring_afschrijvingsmoment_bpm_dt","gem_lading_wrde","aerodyn_voorz","massa_alt_aandr","verl_cab_ind","api_gekentekende_voertuigen_assen","api_gekentekende_voertuigen_brandstof","api_gekentekende_voertuigen_carrosserie","api_gekentekende_voertuigen_carrosserie_specifiek","api_gekentekende_voertuigen_voertuigklasse"
"H413GF","Personenauto","MERCEDES-AMG","AMG C 63 S","20241206","20201102","15316","cabriolet","4","WIT","Niet geregistreerd","8","3982","1825","2300","1925",,,"20161201","20200327","Geen verstrekking in Open Data","138046","Ja","280",,,,,,"2","4","0","0",,"0","188","M1",,,"r. bodemplaat by voorzitting","2300","204 AMG",,"e1*2001/116*0464*20","R487P0","RRAAB4HL","0","0.19","284","Nee","Nee",,"Nee","0","0","0.00","2023","Geen oordeel","05","Ja","2024-12-06T00:00:00.000","2020-11-02T00:00:00.000","2016-12-01T00:00:00.000","2020-03-27T00:00:00.000",,,,,,,,,,,,,,,,,,,,,"G",,,,,,,"https://opendata.rdw.nl/resource/3huj-srit.json","https://opendata.rdw.nl/resource/8ys7-d773.json","https://opendata.rdw.nl/resource/vezc-m2t6.json","https://opendata.rdw.nl/resource/jhie-znh9.json","https://opendata.rdw.nl/resource/kmfi-hrps.json"
"J067SJ","Personenauto","MERCEDES-AMG","AMG C 63 S","20241214","20230907","20392","cabriolet","4","ZWART","Niet geregistreerd","8","3982","1825","2300","1925",,,"20161027","20201005","Geen verstrekking in Open Data","144024","Ja","250",,,,,,"2","4","0","0",,"0","188","M1",,,"r. bodemplaat by voorzitting","2300","204 AMG",,"e1*2001/116*0464*20","R487P0","RLAAB4HL","0","0.19","284","Nee","Ja",,"Nee","0","0","0.00","2023","Geen oordeel","05","Ja","2024-12-14T00:00:00.000","2023-09-07T00:00:00.000","2016-10-27T00:00:00.000","2020-10-05T00:00:00.000",,,,,,,,,,,,,,,,,,,,,"G",,,,,,,"https://opendata.rdw.nl/resource/3huj-srit.json","https://opendata.rdw.nl/resource/8ys7-d773.json","https://opendata.rdw.nl/resource/vezc-m2t6.json","https://opendata.rdw.nl/resource/jhie-znh9.json","https://opendata.rdw.nl/resource/kmfi-hrps.json"
"J518FZ","Personenauto","MERCEDES-AMG","AMG C 63 S","20240708","20210403","18075","cabriolet","4","ZWART","Niet geregistreerd","8","3982","1825","2300","1925",,,"20170201","20200731","Geen verstrekking in Open Data","159115","Ja","280",,,,,,"2","4","0","0",,"0","188","M1",,,"r. bodemplaat by voorzitting","2300","204 AMG",,"e1*2001/116*0464*20","R487P0","RRAAB4HL","0","0.19","284","Nee","Ja",,"Nee","0","0","0.00","2023","Geen oordeel","05","Ja","2024-07-08T00:00:00.000","2021-04-03T00:00:00.000","2017-02-01T00:00:00.000","2020-07-31T00:00:00.000",,,,,,,,,,,,,,,,,,,,,"G",,,,,,,"https://opendata.rdw.nl/resource/3huj-srit.json","https://opendata.rdw.nl/resource/8ys7-d773.json","https://opendata.rdw.nl/resource/vezc-m2t6.json","https://opendata.rdw.nl/resource/jhie-znh9.json","https://opendata.rdw.nl/resource/kmfi-hrps.json"
"J600FZ","Personenauto","MERCEDES-AMG","AMG C 63 S","20250624","20210508","23670","cabriolet","4","BLAUW","Niet geregistreerd","8","3982","1825","2300","1925",,,"20170606","20200721","Geen verstrekking in Open Data","161839","Ja","280",,,,,,"2","4","0","0",,"0","188","M1",,,"r. bodemplaat by voorzitting","2300","204 AMG",,"e1*2001/116*0464*21","R487P0","RRAAB4HL","0","0.19","284","Nee","Ja",,"Nee","0","0","0.00","2023","Geen oordeel","05","Ja","2025-06-24T00:00:00.000","2021-05-08T00:00:00.000","2017-06-06T00:00:00.000","2020-07-21T00:00:00.000",,,,,,,,,,,,,,,,,,,,,"G",,,,,,,"https://opendata.rdw.nl/resource/3huj-srit.json","https://opendata.rdw.nl/resource/8ys7-d773.json","https://opendata.rdw.nl/resource/vezc-m2t6.json","https://opendata.rdw.nl/resource/jhie-znh9.json","https://opendata.rdw.nl/resource/kmfi-hrps.json"
"J757ZJ","Personenauto","MERCEDES-AMG","AMG C 63 S","20250329","20210616","7658","cabriolet","4","WIT","Niet geregistreerd","8","3982","1825","2300","1925",,,"20170316","20210616","Geen verstrekking in Open Data","145122","Nee","250",,,,,,"2","4","0","0",,"0","188","M1",,,"r. bodemplaat by voorzitting","2300","204 AMG",,"e1*2001/116*0464*20","R487P0","RLAAB4HL","0","0.19","284","Nee","Ja",,"Nee","0","0","0.00","2024","Geen oordeel","05","Ja","2025-03-29T00:00:00.000","2021-06-16T00:00:00.000","2017-03-16T00:00:00.000","2021-06-16T00:00:00.000",,,,,,,,,,,,,,,,,,,,,"G",,,,,,,"https://opendata.rdw.nl/resource/3huj-srit.json","https://opendata.rdw.nl/resource/8ys7-d773.json","https://opendata.rdw.nl/resource/vezc-m2t6.json","https://opendata.rdw.nl/resource/jhie-znh9.json","https://opendata.rdw.nl/resource/kmfi-hrps.json"
"J802GJ","Personenauto","MERCEDES-AMG","AMG C 63 S","20250731","20201202","15495","cabriolet","4","GRIJS","Niet geregistreerd","8","3982","1825","2300","1925",,,"20170626","20200722","Geen verstrekking in Open Data","149514","Ja",,,,,,,"2","4","0","0",,"0","188","M1",,,"r. bodemplaat by voorzitting","2300","204 AMG",,"e1*2001/116*0464*22","R487P0","RRAAB4HL","0","0.19","284","Nee","Nee",,"Nee","0","0","0.00","2023","Geen oordeel","05","Ja","2025-07-31T00:00:00.000","2020-12-02T00:00:00.000","2017-06-26T00:00:00.000","2020-07-22T00:00:00.000",,,,,,,,,,,,,,,,,,,,,"G",,,,,,,"https://opendata.rdw.nl/resource/3huj-srit.json","https://opendata.rdw.nl/resource/8ys7-d773.json","https://opendata.rdw.nl/resource/vezc-m2t6.json","https://opendata.rdw.nl/resource/jhie-znh9.json","https://opendata.rdw.nl/resource/kmfi-hrps.json"
"L695JX","Personenauto","MERCEDES-AMG","AMG C 63 S","20250713","20210607","7759","cabriolet","4","WIT","Niet geregistreerd","8","3982","1825","2300","1925",,,"20161025","20210607","Geen verstrekking in Open Data","137513","Nee","280",,,,,,"2","4","0","0",,"0","188","M1",,,"r. bodemplaat by voorzitting","2300","204 AMG",,"e1*2001/116*0464*20","R487P0","RRAAB4HL","0","0.19","284","Nee","Ja",,"Nee","0","0","0.00","2023","Geen oordeel","05","Ja","2025-07-13T00:00:00.000","2021-06-07T00:00:00.000","2016-10-25T00:00:00.000","2021-06-07T00:00:00.000",,,,,,,,,,,,,,,,,,,,,,,,,,,,"https://opendata.rdw.nl/resource/3huj-srit.json","https://opendata.rdw.nl/resource/8ys7-d773.json","https://opendata.rdw.nl/resource/vezc-m2t6.json","https://opendata.rdw.nl/resource/jhie-znh9.json","https://opendata.rdw.nl/resource/kmfi-hrps.json"
"N144BX","Personenauto","MERCEDES-AMG","AMG C 63 S","20251004","20210928","26854","cabriolet","4","BLAUW","Niet geregistreerd","8","3982","1825","2300","1925",,,"20171004","20210928","Geen verstrekking in Open Data","153737","Ja","280",,,,,,"2","4","0","0",,"0","188","M1",,,"r. bodemplaat by voorzitting","2300","204 AMG",,"e1*2001/116*0464*22","R487P0","RRAAB4HL","0","0.19","284","Nee","Nee",,"Nee","0","0","0.00","2023","Geen oordeel","05","Ja","2025-10-04T00:00:00.000","2021-09-28T00:00:00.000","2017-10-04T00:00:00.000","2021-09-28T00:00:00.000",,,,,,,,,,,,,,,,,,,,,,,,,,,,"https://opendata.rdw.nl/resource/3huj-srit.json","https://opendata.rdw.nl/resource/8ys7-d773.json","https://opendata.rdw.nl/resource/vezc-m2t6.json","https://opendata.rdw.nl/resource/jhie-znh9.json","https://opendata.rdw.nl/resource/kmfi-hrps.json"
"N404RV","Personenauto","MERCEDES-AMG","AMG C 63 S","20250117","20240420","12049","cabriolet","4","GRIJS","Niet geregistreerd","8","3982","1825","2300","1925",,,"20161028","20211210","Geen verstrekking in Open Data","149553","Ja","280",,,,,,"2","4","0","0",,"0","188","M1",,,"r. bodemplaat by voorzitting","2300","204 AMG",,"e1*2001/116*0464*20","R487P0","RRAAB4HL","0","0.19","284","Nee","Ja",,"Nee","0","0","0.00","2024","Geen oordeel","05","Ja","2025-01-17T00:00:00.000","2024-04-20T00:00:00.000","2016-10-28T00:00:00.000","2021-12-10T00:00:00.000",,,,,,,,,,,,,,,,,,,,,,"20211207","2021-12-07T00:00:00.000",,,,,"https://opendata.rdw.nl/resource/3huj-srit.json","https://opendata.rdw.nl/resource/8ys7-d773.json","https://opendata.rdw.nl/resource/vezc-m2t6.json","https://opendata.rdw.nl/resource/jhie-znh9.json","https://opendata.rdw.nl/resource/kmfi-hrps.json"
"NK130J","Personenauto","MERCEDES-AMG","AMG C 63 S","20251006","20201023","32465","cabriolet","4","ZWART","Niet geregistreerd","8","3982","1825","2300","1925",,,"20170218","20170218","Geen verstrekking in Open Data","162250","Ja",,,,,,,"2","4","0","0",,"475","188","M1",,,"onder r. voorzitting","2300","204 AMG",,"e1*2001/116*0464*20","R487P0","RRAAB4HL","0","0.19","284","Nee","Nee",,"Nee","0","0","0.00","2024","Logisch","00","Ja","2025-10-06T00:00:00.000","2020-10-23T00:00:00.000","2017-02-18T00:00:00.000","2017-02-18T00:00:00.000",,,,,,,,,,,"141",,,,,,,,,,"G",,,,,,,"https://opendata.rdw.nl/resource/3huj-srit.json","https://opendata.rdw.nl/resource/8ys7-d773.json","https://opendata.rdw.nl/resource/vezc-m2t6.json","https://opendata.rdw.nl/resource/jhie-znh9.json","https://opendata.rdw.nl/resource/kmfi-hrps.json"
"P845FZ","Personenauto","MERCEDES-AMG","AMG C 63 S","20260415","20240223","13905","cabriolet","4","GRIJS","Niet geregistreerd","8","3982","1825","2300","1925",,,"20170407","20220412","Geen verstrekking in Open Data","149340","Ja","280",,,,,,"2","4","0","0",,"0","188","M1",,,,"2300","204 AMG",,"e1*2001/116*0464*21","R487P0","RRAAB4HL","0","0.19","284","Nee","Ja",,"Nee","0","0","0.00","2024","Geen oordeel","05","Ja","2026-04-15T00:00:00.000","2024-02-23T00:00:00.000","2017-04-07T00:00:00.000","2022-04-12T00:00:00.000",,,,,,,,,,,,,,,,,,,,,,"20220107","2022-01-07T00:00:00.000",,,,,"https://opendata.rdw.nl/resource/3huj-srit.json","https://opendata.rdw.nl/resource/8ys7-d773.json","https://opendata.rdw.nl/resource/vezc-m2t6.json","https://opendata.rdw.nl/resource/jhie-znh9.json","https://opendata.rdw.nl/resource/kmfi-hrps.json"
"PF405D","Personenauto","MERCEDES-AMG","AMG C 63 S","20260524","20170609","37215","cabriolet","4","ZWART","Niet geregistreerd","8","3982","1825","2300","1925",,,"20170609","20170609","Geen verstrekking in Open Data","171397","Ja",,,,,,,"2","4","0","0",,"476","188","M1",,,"onder r. voorzitting","2300","204 AMG",,"e1*2001/116*0464*21","R487P0","RRAAB4HN","0","0.19","284","Nee","Ja",,"Nee","0","0","0.00","2024","Logisch","00","Ja","2026-05-24T00:00:00.000","2017-06-09T00:00:00.000","2017-06-09T00:00:00.000","2017-06-09T00:00:00.000",,,,,,,,,,,"141",,,,,,,,,,"G",,,,,,,"https://opendata.rdw.nl/resource/3huj-srit.json","https://opendata.rdw.nl/resource/8ys7-d773.json","https://opendata.rdw.nl/resource/vezc-m2t6.json","https://opendata.rdw.nl/resource/jhie-znh9.json","https://opendata.rdw.nl/resource/kmfi-hrps.json"
"PH927H","Personenauto","MERCEDES-AMG","AMG C 63 S","20250125","20170706","24730","cabriolet","4","GRIJS","Niet geregistreerd","8","3982","1825","2300","1925",,,"20170116","20170628","Geen verstrekking in Open Data","151721","Ja",,,,,,,"2","4",,,,,,"M1",,,"r. balk by voorzitting","2300","204",,,,,,"0.19","284","Nee","Nee",,"Nee",,,,"2023","Geen oordeel","05","Ja","2025-01-25T00:00:00.000","2017-07-06T00:00:00.000","2017-01-16T00:00:00.000","2017-06-28T00:00:00.000",,,,,,,,,,,,,,,,,,,,,,,,,,,,"https://opendata.rdw.nl/resource/3huj-srit.json","https://opendata.rdw.nl/resource/8ys7-d773.json","https://opendata.rdw.nl/resource/vezc-m2t6.json","https://opendata.rdw.nl/resource/jhie-znh9.json","https://opendata.rdw.nl/resource/kmfi-hrps.json"
"PX253R","Personenauto","MERCEDES-AMG","AMG C 63 S","20250725","20230727","32465","cabriolet","4","WIT","Niet geregistreerd","8","3982","1825","2300","1925",,,"20171002","20171002","Geen verstrekking in Open Data","161747","Ja",,,,,,,"2","4","0","0",,"476","188","M1",,,"onder r. voorzitting","2300","204 AMG",,"e1*2001/116*0464*22","R487P0","RRAAB4HL","0","0.19","284","Nee","Nee",,"Nee","0","0","0.00","2023","Logisch","00","Ja","2025-07-25T00:00:00.000","2023-07-27T00:00:00.000","2017-10-02T00:00:00.000","2017-10-02T00:00:00.000",,,,,,,,,,,"141",,,,,,,,,,"G",,,,,,,"https://opendata.rdw.nl/resource/3huj-srit.json","https://opendata.rdw.nl/resource/8ys7-d773.json","https://opendata.rdw.nl/resource/vezc-m2t6.json","https://opendata.rdw.nl/resource/jhie-znh9.json","https://opendata.rdw.nl/resource/kmfi-hrps.json"
"PX654F","Personenauto","MERCEDES-AMG","AMG C 63 S","20250620","20190716","9566","cabriolet","4","WIT","Niet geregistreerd","8","3982","1825","2300","1925",,,"20170515","20170927","Geen verstrekking in Open Data","153704","Ja",,,,,,,"2","4","0","0",,"0","0","M1",,,"r. bodemplaat by voorzitting","2300","204 AMG",,"e1*2001/116*0464*21","R487P0","RRAAB4HL","0","0.19","284","Nee","Nee",,"Nee","0","0","0.00","2024","Geen oordeel","05","Ja","2025-06-20T00:00:00.000","2019-07-16T00:00:00.000","2017-05-15T00:00:00.000","2017-09-27T00:00:00.000",,,,,,,,,,,,,,,,,,,,,"G",,,,,,,"https://opendata.rdw.nl/resource/3huj-srit.json","https://opendata.rdw.nl/resource/8ys7-d773.json","https://opendata.rdw.nl/resource/vezc-m2t6.json","https://opendata.rdw.nl/resource/jhie-znh9.json","https://opendata.rdw.nl/resource/kmfi-hrps.json"
"R305LG","Personenauto","MERCEDES-AMG","AMG C 63 S","20241116","20220929","32465","cabriolet","4","BLAUW","Niet geregistreerd","8","3982","1825","2300","1925",,,"20170508","20220929","Geen verstrekking in Open Data","148594","Ja","280",,,,,,"2","4","0","0",,"0","188","M1",,,"r. bodemplaat by voorzitting","2300","204 AMG",,"e1*2001/116*0464*21","R487P0","RRAAB4HL","0","0.19","284","Nee","Nee",,"Nee","0","0","0.00","2022","Geen oordeel","05","Ja","2024-11-16T00:00:00.000","2022-09-29T00:00:00.000","2017-05-08T00:00:00.000","2022-09-29T00:00:00.000",,,,,,,,,,,,,,,,,,,,,,"20221116","2022-11-16T00:00:00.000",,,,,"https://opendata.rdw.nl/resource/3huj-srit.json","https://opendata.rdw.nl/resource/8ys7-d773.json","https://opendata.rdw.nl/resource/vezc-m2t6.json","https://opendata.rdw.nl/resource/jhie-znh9.json","https://opendata.rdw.nl/resource/kmfi-hrps.json"
"RJ107N","Personenauto","MERCEDES-AMG","AMG C 63 S","20251011","20220610","28990","cabriolet","4","WIT","Niet geregistreerd","8","3982","1825","2300","1925",,,"20170106","20171201","Geen verstrekking in Open Data","145794","Ja",,,,,,,"2","4","0","0",,"0","0","M1",,,"op dwarsbalk v. r. voorzitting","2300","204 AMG",,"e1*2001/116*0464*20","R487P0","RRAAB4HN","0","0.19","284","Nee","Nee",,"Nee","0","0","0.00","2023","Geen oordeel","05","Ja","2025-10-11T00:00:00.000","2022-06-10T00:00:00.000","2017-01-06T00:00:00.000","2017-12-01T00:00:00.000",,,,,,,,,,,,,,,,,,,,,"G",,,,,,,"https://opendata.rdw.nl/resource/3huj-srit.json","https://opendata.rdw.nl/resource/8ys7-d773.json","https://opendata.rdw.nl/resource/vezc-m2t6.json","https://opendata.rdw.nl/resource/jhie-znh9.json","https://opendata.rdw.nl/resource/kmfi-hrps.json"
"RT694L","Personenauto","MERCEDES-AMG","AMG C 63 S","20260315","20180214","33661","cabriolet","4","BLAUW","Niet geregistreerd","8","3982","1825","2300","1925",,,"20180214","20180214","Geen verstrekking in Open Data","157679","Ja",,,,,,,"2","4","0","0",,"476","188","M1",,,"onder r. voorzitting","2300","204 AMG",,"e1*2001/116*0464*22","R487P0","RRAAB4HL","0","0.19","284","Nee","Nee",,"Nee","0","0","0.00","2024","Logisch","00","Ja","2026-03-15T00:00:00.000","2018-02-14T00:00:00.000","2018-02-14T00:00:00.000","2018-02-14T00:00:00.000",,,,,,,,,,,"141",,,,,,,,,,"G",,,,,,,"https://opendata.rdw.nl/resource/3huj-srit.json","https://opendata.rdw.nl/resource/8ys7-d773.json","https://opendata.rdw.nl/resource/vezc-m2t6.json","https://opendata.rdw.nl/resource/jhie-znh9.json","https://opendata.rdw.nl/resource/kmfi-hrps.json"
"S273XF","Personenauto","MERCEDES-AMG","AMG C 63 S","20250501","20230426","32465","cabriolet","4","GRIJS","Niet geregistreerd","8","3982","1825","2300","1925",,,"20170413","20230426","Geen verstrekking in Open Data","145479","Ja","280",,,,,,"2","4","0","0",,"0","188","M1",,,,"2300","204 AMG",,"e1*2001/116*0464*21","R487P0","RRAAB4HL","0","0.19","284","Nee","Ja",,"Nee","0","0","0.00","2023","Geen oordeel","05","Ja","2025-05-01T00:00:00.000","2023-04-26T00:00:00.000","2017-04-13T00:00:00.000","2023-04-26T00:00:00.000",,,,,,,,,,,,,,,,,,,,,,"20230413","2023-04-13T00:00:00.000",,,,,"https://opendata.rdw.nl/resource/3huj-srit.json","https://opendata.rdw.nl/resource/8ys7-d773.json","https://opendata.rdw.nl/resource/vezc-m2t6.json","https://opendata.rdw.nl/resource/jhie-znh9.json","https://opendata.rdw.nl/resource/kmfi-hrps.json"
"SJ332P","Personenauto","MERCEDES-AMG","AMG C 63 S","20251014","20231117","33661","cabriolet","4","WIT","Niet geregistreerd","8","3982","1825","2300","1925",,,"20180413","20180413","Geen verstrekking in Open Data","168025","Ja",,,,,,,"2","4","0","0",,"476","188","M1",,,"onder r. voorzitting","2300","204 AMG",,"e1*2001/116*0464*22","R487P0","RRAAB4HL","0","0.19","284","Nee","Nee",,"Nee","0","0","0.00","2023","Logisch","00","Ja","2025-10-14T00:00:00.000","2023-11-17T00:00:00.000","2018-04-13T00:00:00.000","2018-04-13T00:00:00.000",,,,,,,,,,,"141",,,,,,,,,,"G",,,,,,,"https://opendata.rdw.nl/resource/3huj-srit.json","https://opendata.rdw.nl/resource/8ys7-d773.json","https://opendata.rdw.nl/resource/vezc-m2t6.json","https://opendata.rdw.nl/resource/jhie-znh9.json","https://opendata.rdw.nl/resource/kmfi-hrps.json"
"ST782L","Personenauto","MERCEDES-AMG","AMG C 63 S","20251102","20180529","27622","cabriolet","4","GRIJS","Niet geregistreerd","8","3982","1825","2300","1925",,,"20171102","20180529","Geen verstrekking in Open Data","144717","Ja",,,,,,,"2","4","0","0",,"0","0","M1",,,"r. bodemplaat by voorzitting","2300","204 AMG",,"e1*2001/116*0464*22","R487P0","RRAAB4HL","0","0.19","284","Nee","Ja",,"Nee","0","0","0.00","2023","Geen oordeel","05","Ja","2025-11-02T00:00:00.000","2018-05-29T00:00:00.000","2017-11-02T00:00:00.000","2018-05-29T00:00:00.000",,,,,,,,,,,,,,,,,,,,,"G",,,,,,,"https://opendata.rdw.nl/resource/3huj-srit.json","https://opendata.rdw.nl/resource/8ys7-d773.json","https://opendata.rdw.nl/resource/vezc-m2t6.json","https://opendata.rdw.nl/resource/jhie-znh9.json","https://opendata.rdw.nl/resource/kmfi-hrps.json"
"SX657D","Personenauto","MERCEDES-AMG","AMG C 63 S","20250602","20180911","20740","cabriolet","4","ZWART","Niet geregistreerd","8","3982","1825","2300","1925",,,"20170522","20180911","Geen verstrekking in Open Data","156766","Ja",,,,,,,"2","4","0","0",,"0","0","M1",,,"r. bodemplaat by voorzitting","2300","204 AMG",,"e1*2001/116*0464*21","R487P0","RRAAB4HL","0","0.19","284","Nee","Ja",,"Nee","0","0","0.00","2023","Geen oordeel","05","Ja","2025-06-02T00:00:00.000","2018-09-11T00:00:00.000","2017-05-22T00:00:00.000","2018-09-11T00:00:00.000",,,,,,,,,,,,,,,,,,,,,"G",,,,,,,"https://opendata.rdw.nl/resource/3huj-srit.json","https://opendata.rdw.nl/resource/8ys7-d773.json","https://opendata.rdw.nl/resource/vezc-m2t6.json","https://opendata.rdw.nl/resource/jhie-znh9.json","https://opendata.rdw.nl/resource/kmfi-hrps.json"
"SZ604P","Personenauto","MERCEDES-AMG","AMG C 63 S","20240629","20200608","33661","cabriolet","4","ZWART","Niet geregistreerd","8","3982","1825","2300","1925",,,"20180629","20180629","Geen verstrekking in Open Data","169598","Ja",,,,,,,"2","4","0","0",,"476","188","M1",,,,"2300","204 AMG",,"e1*2001/116*0464*21","R487P0","RRAAB4HL","0","0.19","284","Nee","Ja",,"Nee","0","0","0.00","2022","Logisch","00","Ja","2024-06-29T00:00:00.000","2020-06-08T00:00:00.000","2018-06-29T00:00:00.000","2018-06-29T00:00:00.000",,,,,,,,,,,"141",,,,,,,,,,"G",,,,,,,"https://opendata.rdw.nl/resource/3huj-srit.json","https://opendata.rdw.nl/resource/8ys7-d773.json","https://opendata.rdw.nl/resource/vezc-m2t6.json","https://opendata.rdw.nl/resource/jhie-znh9.json","https://opendata.rdw.nl/resource/kmfi-hrps.json"
"T764DV","Personenauto","MERCEDES-AMG","AMG C 63 S","20240531","20230918","14440","cabriolet","4","WIT","Niet geregistreerd","8","3982","1825","2300","1925",,,"20170515","20230524","Geen verstrekking in Open Data","170495","Ja","280",,,,,,"2","4","0","0",,"0","188","M1",,,"r. bodemplaat by voorzitting","2300","204 AMG",,"e1*2001/116*0464*21","R487P0","RRAAB4HL","0","0.19","284","Nee","Ja",,"Nee","0","0","0.00","2023","Geen oordeel","05","Ja","2024-05-31T00:00:00.000","2023-09-18T00:00:00.000","2017-05-15T00:00:00.000","2023-05-24T00:00:00.000",,,,,,,,,,,,,,,,,,,,,,"20230519","2023-05-19T00:00:00.000",,,,,"https://opendata.rdw.nl/resource/3huj-srit.json","https://opendata.rdw.nl/resource/8ys7-d773.json","https://opendata.rdw.nl/resource/vezc-m2t6.json","https://opendata.rdw.nl/resource/jhie-znh9.json","https://opendata.rdw.nl/resource/kmfi-hrps.json"
"TF202K","Personenauto","MERCEDES-AMG","AMG C 63 S","20260410","20230602","33661","cabriolet","4","WIT","Niet geregistreerd","8","3982","1825","2300","1925",,,"20180712","20180712","Geen verstrekking in Open Data","148799","Ja",,,,,,,"2","4","0","0",,"0","0","M1",,,"r. bodemplaat by voorzitting","2300","204 AMG",,"e1*2001/116*0464*22","R487P0","RRAAB4HL","0","0.19","284","Nee","Nee",,"Nee","0","0","0.00","2024","Logisch","00","Ja","2026-04-10T00:00:00.000","2023-06-02T00:00:00.000","2018-07-12T00:00:00.000","2018-07-12T00:00:00.000",,,,,,,,,,,,,,,,,,,,,"G",,,,,,,"https://opendata.rdw.nl/resource/3huj-srit.json","https://opendata.rdw.nl/resource/8ys7-d773.json","https://opendata.rdw.nl/resource/vezc-m2t6.json","https://opendata.rdw.nl/resource/jhie-znh9.json","https://opendata.rdw.nl/resource/kmfi-hrps.json"