"kenteken","voertuigsoort","merk","handelsbenaming","vervaldatum_apk","datum_tenaamstelling","bruto_bpm","inrichting","aantal_zitplaatsen","eerste_kleur","tweede_kleur","aantal_cilinders","cilinderinhoud","massa_ledig_voertuig","toegestane_maximum_massa_voertuig","massa_rijklaar","maximum_massa_trekken_ongeremd","maximum_trekken_massa_geremd","datum_eerste_toelating","datum_eerste_tenaamstelling_in_nederland","wacht_op_keuren","catalogusprijs","wam_verzekerd","maximale_constructiesnelheid","laadvermogen","oplegger_geremd","aanhangwagen_autonoom_geremd","aanhangwagen_middenas_geremd","aantal_staanplaatsen","aantal_deuren","aantal_wielen","afstand_hart_koppeling_tot_achterzijde_voertuig","afstand_voorzijde_voertuig_tot_hart_koppeling","afwijkende_maximum_snelheid","lengte","breedte","europese_voertuigcategorie","europese_voertuigcategorie_toevoeging","europese_uitvoeringcategorie_toevoeging","plaats_chassisnummer","technische_max_massa_voertuig","type","type_gasinstallatie","typegoedkeuringsnummer","variant","uitvoering","volgnummer_wijziging_eu_typegoedkeuring","vermogen_massarijklaar","wielbasis","export_indicator","openstaande_terugroepactie_indicator","vervaldatum_tachograaf","taxi_indicator","maximum_massa_samenstelling","aantal_rolstoelplaatsen","maximum_ondersteunende_snelheid","jaar_laatste_registratie_tellerstand","tellerstandoordeel","code_toelichting_tellerstandoordeel","tenaamstellen_mogelijk","vervaldatum_apk_dt","datum_tenaamstelling_dt","datum_eerste_toelating_dt","datum_eerste_tenaamstelling_in_nederland_dt","vervaldatum_tachograaf_dt","maximum_last_onder_de_vooras_sen_tezamen_koppeling","type_remsysteem_voertuig_code","rupsonderstelconfiguratiecode","wielbasis_voertuig_minimum","wielbasis_voertuig_maximum","lengte_voertuig_minimum","lengte_voertuig_maximum","breedte_voertuig_minimum","breedte_voertuig_maximum","hoogte_voertuig","hoogte_voertuig_minimum","hoogte_voertuig_maximum","massa_bedrijfsklaar_minimaal","massa_bedrijfsklaar_maximaal","technisch_toelaatbaar_massa_koppelpunt","maximum_massa_technisch_maximaal","maximum_massa_technisch_minimaal","subcategorie_nederland","verticale_belasting_koppelpunt_getrokken_voertuig","zuinigheidsclassificatie","registratie_datum_goedkeuring_afschrijvingsmoment_bpm","registratie_datum_goedkeuring_afschrijvingsmoment_bpm_dt","gem_lading_wrde","aerodyn_voorz","massa_alt_aandr","verl_cab_ind","api_gekentekende_voertuigen_assen","api_gekentekende_voertuigen_brandstof","api_gekentekende_voertuigen_carrosserie","api_gekentekende_voertuigen_carrosserie_specifiek","api_gekentekende_voertuigen_voertuigklasse"
"G437KG","Personenauto","MERCEDES-AMG","AMG S63 4MATIC","20250217","20191023","41033","sedan","4","ZWART","Niet geregistreerd","8","5461","1970","2725","2070",,,"20170217","20191023","Geen verstrekking in Open Data","274817","Ja","300",,,,,,"4","4",,,,"529","191","M1",,,"by zywand r. voorzitting","2725","221 AMG",,"e1*2001/116*0396*19","P17UP1","RZBAR40B","0","0.21","317","Nee","Nee",,"Nee",,,,"2023","Geen oordeel","05","Ja","2025-02-17T00:00:00.000","2019-10-23T00:00:00.000","2017-02-17T00:00:00.000","2019-10-23T00:00:00.000",,,,,,,,,,,,,,,,,,,,,"G",,,,,,,"https://opendata.rdw.nl/resource/3huj-srit.json","https://opendata.rdw.nl/resource/8ys7-d773.json","https://opendata.rdw.nl/resource/vezc-m2t6.json","https://opendata.rdw.nl/resource/jhie-znh9.json","https://opendata.rdw.nl/resource/kmfi-hrps.json"
"G566GB","Personenauto","MERCEDES-AMG","AMG S63 4MATIC","20250814","20190918","18895","coupe","4","ZWART","Niet geregistreerd","8","3982","1980","2545","2080",,,"20190814","20190918","Geen verstrekking in Open Data","303401","Ja","300",,,,,,"2","4","0","0",,"0","191","M1",,,"by zywand r. voorzitting","2545","221 AMG",,"e1*2001/116*0396*20","P38CS1","CZBCR43A","0","0.22","295","Nee","Ja",,"Nee","0","0","0.00","2023","Logisch","00","Ja","2025-08-14T00:00:00.000","2019-09-18T00:00:00.000","2019-08-14T00:00:00.000","2019-09-18T00:00:00.000",,,,,,,,,,,,,,,,,,,,,"F",,,,,,,"https://opendata.rdw.nl/resource/3huj-srit.json","https://opendata.rdw.nl/resource/8ys7-d773.json","https://opendata.rdw.nl/resource/vezc-m2t6.json","https://opendata.rdw.nl/resource/jhie-znh9.json","https://opendata.rdw.nl/resource/kmfi-hrps.json"
"G949KT","Personenauto","MERCEDES-AMG","AMG S63 4MATIC","20250326","20191021","42970","sedan","4","ZWART","Niet geregistreerd","8","5461","1970","2725","2070",,,"20160316","20191021","Geen verstrekking in Open Data","241477","Ja","300",,,,,,"4","4",,,,"529","191","M1",,,"by zywand r. voorzitting","2725","221 AMG",,"e1*2001/116*0396*18","P17UP1","RZBBR40B","0","0.21","317","Nee","Nee",,"Nee",,,,"2024","Geen oordeel","05","Ja","2025-03-26T00:00:00.000","2019-10-21T00:00:00.000","2016-03-16T00:00:00.000","2019-10-21T00:00:00.000",,,,,,,,,,,,,,,,,,,,,"G",,,,,,,"https://opendata.rdw.nl/resource/3huj-srit.json","https://opendata.rdw.nl/resource/8ys7-d773.json","https://opendata.rdw.nl/resource/vezc-m2t6.json","https://opendata.rdw.nl/resource/jhie-znh9.json","https://opendata.rdw.nl/resource/kmfi-hrps.json"
"H748LB","Personenauto","MERCEDES-AMG","AMG S63 4MATIC","20260416","20210312","30446","cabriolet","4","BLAUW","Niet geregistreerd","8","3982","2085","2635","2185",,,"20180416","20200312","Geen verstrekking in Open Data","252584","Ja","300",,,,,,"2","4","0","0",,"0","191","M1",,,"l. by r. achterzitting in pers.ruimte","2635","221 AMG",,"e1*2001/116*0396*20","P48CS1","CZBCR400","0","0.21","295","Nee","Ja",,"Nee","0","0","0.00","2024","Geen oordeel","05","Ja","2026-04-16T00:00:00.000","2021-03-12T00:00:00.000","2018-04-16T00:00:00.000","2020-03-12T00:00:00.000",,,,,,,,,,,,,,,,,,,,,"G",,,,,,,"https://opendata.rdw.nl/resource/3huj-srit.json","https://opendata.rdw.nl/resource/8ys7-d773.json","https://opendata.rdw.nl/resource/vezc-m2t6.json","https://opendata.rdw.nl/resource/jhie-znh9.json","https://opendata.rdw.nl/resource/kmfi-hrps.json"
"H974FV","Personenauto","MERCEDES-AMG","AMG S63 4MATIC","20250503","20220701","33729","cabriolet","4","ZWART","Niet geregistreerd","8","5461","2085","2635","2185",,,"20170503","20200121","Geen verstrekking in Open Data","273620","Ja","300",,,,,,"2","4","0","0",,"504","191","M1",,,"by zywand r. voorzitting","2635","221 AMG",,"e1*2001/116*0396*19","P47UP1","RZBAR40B","0","0.20","295","Nee","Nee",,"Nee","0","0","0.00","2024","Geen oordeel","05","Ja","2025-05-03T00:00:00.000","2022-07-01T00:00:00.000","2017-05-03T00:00:00.000","2020-01-21T00:00:00.000",,,,,,,,,,,,,,,,,,,,,"G",,,,,,,"https://opendata.rdw.nl/resource/3huj-srit.json","https://opendata.rdw.nl/resource/8ys7-d773.json","https://opendata.rdw.nl/resource/vezc-m2t6.json","https://opendata.rdw.nl/resource/jhie-znh9.json","https://opendata.rdw.nl/resource/kmfi-hrps.json"
"J326TN","Personenauto","MERCEDES-AMG","AMG S63 4MATIC","20250212","20240220","26479","coupe","4","GRIJS","Niet geregistreerd","8","3982","1980","2545","2080",,,"20190212","20201016","Geen verstrekking in Open Data","240289","Ja","300",,,,,,"2","4","0","0",,"0","191","M1",,,"l. by r. achterzitting in pers.ruimte","2545","221 AMG",,"e1*2001/116*0396*20","P38CS1","CZBCR400","0","0.22","295","Nee","Ja",,"Nee","0","0","0.00","2024","Geen oordeel","05","Ja","2025-02-12T00:00:00.000","2024-02-20T00:00:00.000","2019-02-12T00:00:00.000","2020-10-16T00:00:00.000",,,,,,,,,,,,,,,,,,,,,"F",,,,,,,"https://opendata.rdw.nl/resource/3huj-srit.json","https://opendata.rdw.nl/resource/8ys7-d773.json","https://opendata.rdw.nl/resource/vezc-m2t6.json","https://opendata.rdw.nl/resource/jhie-znh9.json","https://opendata.rdw.nl/resource/kmfi-hrps.json"
"JS239R","Personenauto","MERCEDES-AMG","AMG S63 4MATIC","20250206","20220205","32556","cabriolet","4","ZWART","Niet geregistreerd","8","5461","2085","2635","2185",,,"20160511","20160607","Geen verstrekking in Open Data","278883","Ja",,,,,,,"2","4","0","0",,"504","0","M1",,,"by zywand r. voorzitting","2635","221 AMG",,"e1*2001/116*0396*18","P47UP1","RZBBR40B","0","0.20","295","Nee","Nee",,"Nee","0","0","0.00","2024","Logisch","00","Ja","2025-02-06T00:00:00.000","2022-02-05T00:00:00.000","2016-05-11T00:00:00.000","2016-06-07T00:00:00.000",,,,,,,,,,,,,,,,,,,,,"G",,,,,,,"https://opendata.rdw.nl/resource/3huj-srit.json","https://opendata.rdw.nl/resource/8ys7-d773.json","https://opendata.rdw.nl/resource/vezc-m2t6.json","https://opendata.rdw.nl/resource/jhie-znh9.json","https://opendata.rdw.nl/resource/kmfi-hrps.json"
"K859HR","Personenauto","MERCEDES-AMG","AMG S63 4MATIC","20260112","20210803","33245","cabriolet","4","GRIJS","Niet geregistreerd","8","5461","2085","2635","2185",,,"20170717","20210803","Geen verstrekking in Open Data","269434","Ja","300",,,,,,"2","4","0","0",,"504","191","M1",,,"l. by r. achterzitting in pers.ruimte","2635","221 AMG",,"e1*2001/116*0396*19","P47UP1","RZBAR40B","0","0.20","295","Nee","Ja",,"Nee","0","0","0.00","2024","Geen oordeel","05","Ja","2026-01-12T00:00:00.000","2021-08-03T00:00:00.000","2017-07-17T00:00:00.000","2021-08-03T00:00:00.000",,,,,,,,,,,,,,,,,,,,,"G",,,,,,,"https://opendata.rdw.nl/resource/3huj-srit.json","https://opendata.rdw.nl/resource/8ys7-d773.json","https://opendata.rdw.nl/resource/vezc-m2t6.json","https://opendata.rdw.nl/resource/jhie-znh9.json","https://opendata.rdw.nl/resource/kmfi-hrps.json"
"KF243H","Personenauto","MERCEDES-AMG","AMG S63 4MATIC","20250217","20220305","33906","cabriolet","4","ZWART","Niet geregistreerd","8","5461","2085","2635","2185",,,"20160427","20160817","Geen verstrekking in Open Data","280416","Ja",,,,,,,"2","4","0","0",,"504","0","M1",,,"by zywand r. voorzitting","2635","221 AMG",,"e1*2001/116*0396*18","P47UP1","RZBBR40B","0","0.20","295","Nee","Nee",,"Nee","0","0","0.00","2024","Geen oordeel","05","Ja","2025-02-17T00:00:00.000","2022-03-05T00:00:00.000","2016-04-27T00:00:00.000","2016-08-17T00:00:00.000",,,,,,,,,,,,,,,,,,,,,"G",,,,,,,"https://opendata.rdw.nl/resource/3huj-srit.json","https://opendata.rdw.nl/resource/8ys7-d773.json","https://opendata.rdw.nl/resource/vezc-m2t6.json","https://opendata.rdw.nl/resource/jhie-znh9.json","https://opendata.rdw.nl/resource/kmfi-hrps.json"
"KS483H","Personenauto","MERCEDES-AMG","AMG S63 4MATIC","20240925","20200902","34213","cabriolet","4","ZWART","Niet geregistreerd","8","5461","2085","2635","2185",,,"20160804","20161117","Geen verstrekking in Open Data","265006","Ja",,,,,,,"2","4","0","0",,"504","0","M1",,,"by achterzitting r.","2635","221 AMG",,"e1*2001/116*0396*19","P47UP1","RZBZR40B","0","0.20","295","Nee","Nee",,"Nee","0","0","0.00","2023","Geen oordeel","05","Ja","2024-09-25T00:00:00.000","2020-09-02T00:00:00.000","2016-08-04T00:00:00.000","2016-11-17T00:00:00.000",,,,,,,,,,,,,,,,,,,,,"G",,,,,,,"https://opendata.rdw.nl/resource/3huj-srit.json","https://opendata.rdw.nl/resource/8ys7-d773.json","https://opendata.rdw.nl/resource/vezc-m2t6.json","https://opendata.rdw.nl/resource/jhie-znh9.json","https://opendata.rdw.nl/resource/kmfi-hrps.json"
"KX633T","Personenauto","MERCEDES-AMG","AMG S63 4MATIC","20240629","20230907","27175","sedan","5","GRIJS","Niet geregistreerd","8","5461","1970","2725","2070",,,"20160629","20161220","Geen verstrekking in Open Data","259010","Ja",,,,,,,"4","4","0","0",,"529","0","M1",,,"by zywand r. voorzitting","2725","221 AMG",,"e1*2001/116*0396*17","P17UP1","RZBBR53B","0","0.21","317","Nee","Nee",,"Nee","0","0","0.00","2024","Geen oordeel","05","Ja","2024-06-29T00:00:00.000","2023-09-07T00:00:00.000","2016-06-29T00:00:00.000","2016-12-20T00:00:00.000",,,,,,,,,,,,,,,,,,,,,"G",,,,,,,"https://opendata.rdw.nl/resource/3huj-srit.json","https://opendata.rdw.nl/resource/8ys7-d773.json","https://opendata.rdw.nl/resource/vezc-m2t6.json","https://opendata.rdw.nl/resource/jhie-znh9.json","https://opendata.rdw.nl/resource/kmfi-hrps.json"
"L159ZN","Personenauto","MERCEDES-AMG","AMG S63 4MATIC","20250902","20220722","22257","cabriolet","4","ZWART","Niet geregistreerd","8","5461","2085","2635","2185",,,"20161013","20210828","Geen verstrekking in Open Data","252580","Ja","300",,,,,,"2","4","0","0",,"504","191","M1",,,"l. by r. achterzitting in pers.ruimte","2635","221 AMG",,"e1*2001/116*0396*19","P47UP1","RZBZR40B","0","0.20","295","Nee","Nee",,"Nee","0","0","0.00","2023","Geen oordeel","05","Ja","2025-09-02T00:00:00.000","2022-07-22T00:00:00.000","2016-10-13T00:00:00.000","2021-08-28T00:00:00.000",,,,,,,,,,,,,,,,,,,,,,,,,,,,"https://opendata.rdw.nl/resource/3huj-srit.json","https://opendata.rdw.nl/resource/8ys7-d773.json","https://opendata.rdw.nl/resource/vezc-m2t6.json","https://opendata.rdw.nl/resource/jhie-znh9.json","https://opendata.rdw.nl/resource/kmfi-hrps.json"
"L266XG","Personenauto","MERCEDES-AMG","AMG S63 4MATIC","20260508","20210824","31828","cabriolet","4","ZWART","Niet geregistreerd","8","5461","2085","2635","2185",,,"20180502","20210824","Geen verstrekking in Open Data","269801","Ja","300",,,,,,"2","4","0","0",,"504","191","M1",,,"l. by r. achterzitting in pers.ruimte","2635","221 AMG",,"e1*2001/116*0396*19","P47UP1","RZBAR40B","0","0.20","295","Nee","Ja",,"Nee","0","0","0.00","2024","Geen oordeel","05","Ja","2026-05-08T00:00:00.000","2021-08-24T00:00:00.000","2018-05-02T00:00:00.000","2021-08-24T00:00:00.000",,,,,,,,,,,,,,,,,,,,,,,,,,,,"https://opendata.rdw.nl/resource/3huj-srit.json","https://opendata.rdw.nl/resource/8ys7-d773.json","https://opendata.rdw.nl/resource/vezc-m2t6.json","https://opendata.rdw.nl/resource/jhie-znh9.json","https://opendata.rdw.nl/resource/kmfi-hrps.json"
"L847TJ","Personenauto","MERCEDES-AMG","AMG S63 4MATIC","20250729","20240307","32747","sedan","5","ZWART","Niet geregistreerd","8","5461","1970","2725","2070",,,"20170320","20210726","Geen verstrekking in Open Data","227724","Ja","300",,,,,,"4","4","0","0",,"529","191","M1",,,"l. by r. achterzitting in pers.ruimte","2725","221 AMG",,"e1*2001/116*0396*19","P17UP1","RZBAR50B","0","0.21","317","Nee","Nee",,"Nee","0","0","0.00","2024","Geen oordeel","05","Ja","2025-07-29T00:00:00.000","2024-03-07T00:00:00.000","2017-03-20T00:00:00.000","2021-07-26T00:00:00.000",,,,,,,,,,,,,,,,,,,,,,,,,,,,"https://opendata.rdw.nl/resource/3huj-srit.json","https://opendata.rdw.nl/resource/8ys7-d773.json","https://opendata.rdw.nl/resource/vezc-m2t6.json","https://opendata.rdw.nl/resource/jhie-znh9.json","https://opendata.rdw.nl/resource/kmfi-hrps.json"
"NG696R","Personenauto","MERCEDES-AMG","AMG S63 4MATIC","20241014","20230330","38224","cabriolet","4","GRIJS","Niet geregistreerd","8","5461","2085","2635","2185",,,"20161012","20170120","Geen verstrekking in Open Data","275846","Ja",,,,,,,"2","4","0","0",,"504","0","M1",,,"by zywand r. voorzitting","2635","221 AMG",,"e1*2001/116*0396*19","P47UP1","RZBAR40B","0","0.20","295","Nee","Nee",,"Nee","0","0","0.00","2023","Geen oordeel","05","Ja","2024-10-14T00:00:00.000","2023-03-30T00:00:00.000","2016-10-12T00:00:00.000","2017-01-20T00:00:00.000",,,,,,,,,,,,,,,,,,,,,"G",,,,,,,"https://opendata.rdw.nl/resource/3huj-srit.json","https://opendata.rdw.nl/resource/8ys7-d773.json","https://opendata.rdw.nl/resource/vezc-m2t6.json","https://opendata.rdw.nl/resource/jhie-znh9.json","https://opendata.rdw.nl/resource/kmfi-hrps.json"
"NH038R","Personenauto","MERCEDES-AMG","AMG S63 4MATIC","20240904","20240202","25900","sedan","5","GRIJS","Niet geregistreerd","8","5461","1970","2725","2070",,,"20160823","20170131","Geen verstrekking in Open Data","263395","Ja",,,,,,,"4","4","0","0",,"529","0","M1",,,"by zywand r. voorzitting","2725","221 AMG",,"e1*2001/116*0396*18","P17UP1","RZBBR53B","0","0.21","317","Nee","Nee",,"Nee","0","0","0.00","2024","Geen oordeel","05","Ja","2024-09-04T00:00:00.000","2024-02-02T00:00:00.000","2016-08-23T00:00:00.000","2017-01-31T00:00:00.000",,,,,,,,,,,,,,,,,,,,,"G",,,,,,,"https://opendata.rdw.nl/resource/3huj-srit.json","https://opendata.rdw.nl/resource/8ys7-d773.json","https://opendata.rdw.nl/resource/vezc-m2t6.json","https://opendata.rdw.nl/resource/jhie-znh9.json","https://opendata.rdw.nl/resource/kmfi-hrps.json"
"NN534B","Personenauto","MERCEDES-AMG","AMG S63 4MATIC","20250425","20201130","31219","coupe","4","GRIJS","Niet geregistreerd","8","5461","1970","2545","2070",,,"20160425","20171125","Geen verstrekking in Open Data","284026","Ja",,,,,,,"2","4","0","0",,"504","0","M1",,,"by zywand r. voorzitting","2545","221 AMG",,"e1*2001/116*0396*17","P37UP1","RZBBR43B","0","0.21","295","Nee","Nee",,"Nee","0","0","0.00","2024","Geen oordeel","05","Ja","2025-04-25T00:00:00.000","2020-11-30T00:00:00.000","2016-04-25T00:00:00.000","2017-11-25T00:00:00.000",,,,,,,,,,,,,,,,,,,,,"G",,,,,,,"https://opendata.rdw.nl/resource/3huj-srit.json","https://opendata.rdw.nl/resource/8ys7-d773.json","https://opendata.rdw.nl/resource/vezc-m2t6.json","https://opendata.rdw.nl/resource/jhie-znh9.json","https://opendata.rdw.nl/resource/kmfi-hrps.json"
"NP057S","Personenauto","MERCEDES-AMG","AMG S63 4MATIC","20250430","20190327","39596","cabriolet","4","ZWART","Niet geregistreerd","8","5461","2085","2635","2185",,,"20160425","20170323","Geen verstrekking in Open Data","269260","Ja",,,,,,,"2","4","0","0",,"504","0","M1",,,"by zywand r. voorzitting","2635","221 AMG",,"e1*2001/116*0396*18","P47UP1","RZBBR40B","0","0.20","295","Nee","Nee",,"Nee","0","0","0.00","2024","Geen oordeel","05","Ja","2025-04-30T00:00:00.000","2019-03-27T00:00:00.000","2016-04-25T00:00:00.000","2017-03-23T00:00:00.000",,,,,,,,,,,,,,,,,,,,,"G",,,,,,,"https://opendata.rdw.nl/resource/3huj-srit.json","https://opendata.rdw.nl/resource/8ys7-d773.json","https://opendata.rdw.nl/resource/vezc-m2t6.json","https://opendata.rdw.nl/resource/jhie-znh9.json","https://opendata.rdw.nl/resource/kmfi-hrps.json"
"NS484F","Personenauto","MERCEDES-AMG","AMG S63 4MATIC","20241018","20201125","34452","sedan","4","GRIJS","Niet geregistreerd","8","5461","1970","2725","2070",,,"20160128","20170330","Geen verstrekking in Open Data","283149","Ja",,,,,,,"4","4","0","0",,"529","0","M1",,,"by zywand r. voorzitting","2725","221 AMG",,"e1*2001/116*0396*17","P17UP1","RZBBR43B","0","0.21","317","Nee","Nee",,"Nee","0","0","0.00","2023","Geen oordeel","05","Ja","2024-10-18T00:00:00.000","2020-11-25T00:00:00.000","2016-01-28T00:00:00.000","2017-03-30T00:00:00.000",,,,,,,,,,,,,,,,,,,,,"G",,,,,,,"https://opendata.rdw.nl/resource/3huj-srit.json","https://opendata.rdw.nl/resource/8ys7-d773.json","https://opendata.rdw.nl/resource/vezc-m2t6.json","https://opendata.rdw.nl/resource/jhie-znh9.json","https://opendata.rdw.nl/resource/kmfi-hrps.json"
"NV743R","Personenauto","MERCEDES-AMG","AMG S63 4MATIC","20250509","20190216","37446","cabriolet","4","GRIJS","Niet geregistreerd","8","5461","2085","2635","2185",,,"20160509","20170429","Geen verstrekking in Open Data","284459","Ja",,,,,,,"2","4","0","0",,"504","0","M1",,,"by zywand r. voorzitting","2635","221 AMG",,"e1*2001/116*0396*18","P47UP1","RZBBR43B","0","0.20","295","Nee","Nee",,"Nee","0","0","0.00","2024","Geen oordeel","05","Ja","2025-05-09T00:00:00.000","2019-02-16T00:00:00.000","2016-05-09T00:00:00.000","2017-04-29T00:00:00.000",,,,,,,,,,,,,,,,,,,,,"G",,,,,,,"https://opendata.rdw.nl/resource/3huj-srit.json","https://opendata.rdw.nl/resource/8ys7-d773.json","https://opendata.rdw.nl/resource/vezc-m2t6.json","https://opendata.rdw.nl/resource/jhie-znh9.json","https://opendata.rdw.nl/resource/kmfi-hrps.json"
"P126KN","Personenauto","MERCEDES-AMG","AMG S63 4MATIC","20240828","20220402","49113","cabriolet","4","GRIJS","Niet geregistreerd","8","5461","2085","2635","2185",,,"20180828","20220402","Geen verstrekking in Open Data","278957","Ja","300",,,,,,"2","4","0","0",,"504","191","M1",,,,"2635","221 AMG",,"e1*2001/116*0396*19","P47UP1","RZBAR40B","0","0.20","295","Nee","Nee",,"Nee","0","0","0.00","2022","Geen oordeel","05","Ja","2024-08-28T00:00:00.000","2022-04-02T00:00:00.000","2018-08-28T00:00:00.000","2022-04-02T00:00:00.000",,,,,,,,,,,,,,,,,,,,,,"20220309","2022-03-09T00:00:00.000",,,,,"https://opendata.rdw.nl/resource/3huj-srit.json","https://opendata.rdw.nl/resource/8ys7-d773.json","https://opendata.rdw.nl/resource/vezc-m2t6.json","https://opendata.rdw.nl/resource/jhie-znh9.json","https://opendata.rdw.nl/resource/kmfi-hrps.json"
"PF195J","Personenauto","MERCEDES-AMG","AMG S63 4MATIC","20250303","20230303","32498","cabriolet","4","ZWART","Niet geregistreerd","8","5461","2085","2635","2185",,,"20170208","20170616","Geen verstrekking in Open Data","283682","Ja",,,,,,,"2","4","0","0",,"504","0","M1",,,"by zywand r. voorzitting","2635","221 AMG",,"e1*2001/116*0396*18","P47UP1","RZBBR40B","0","0.20","295","Nee","Nee",,"Nee","0","0","0.00","2023","Geen oordeel","05","Ja","2025-03-03T00:00:00.000","2023-03-03T00:00:00.000","2017-02-08T00:00:00.000","2017-06-16T00:00:00.000",,,,,,,,,,,,,,,,,,,,,"G",,,,,,,"https://opendata.rdw.nl/resource/3huj-srit.json","https://opendata.rdw.nl/resource/8ys7-d773.json","https://opendata.rdw.nl/resource/vezc-m2t6.json","https://opendata.rdw.nl/resource/jhie-znh9.json","https://opendata.rdw.nl/resource/kmfi-hrps.json"
"PK559X","Personenauto","MERCEDES-AMG","AMG S63 4MATIC","20250408","20190307","35626","cabriolet","4","ZWART","Niet geregistreerd","8","5461","2085","2635","2185",,,"20170403","20170722","Geen verstrekking in Open Data","270926","Ja",,,,,,,"2","4","0","0",,"504","0","M1",,,"by zywand r. voorzitting","2635","221 AMG",,"e1*2001/116*0396*19","P47UP1","RZBZR40B","0","0.20","295","Nee","Nee",,"Nee","0","0","0.00","2023","Geen oordeel","05","Ja","2025-04-08T00:00:00.000","2019-03-07T00:00:00.000","2017-04-03T00:00:00.000","2017-07-22T00:00:00.000",,,,,,,,,,,,,,,,,,,,,"G",,,,,,,"https://opendata.rdw.nl/resource/3huj-srit.json","https://opendata.rdw.nl/resource/8ys7-d773.json","https://opendata.rdw.nl/resource/vezc-m2t6.json","https://opendata.rdw.nl/resource/jhie-znh9.json","https://opendata.rdw.nl/resource/kmfi-hrps.json"
"PK812G","Personenauto","MERCEDES-AMG","AMG S63 4MATIC","20240524","20240116","34653","cabriolet","4","WIT","Niet geregistreerd","8","5461","2085","2635","2185",,,"20160420","20171110","Geen verstrekking in Open Data","290154","Ja",,,,,,,"2","4","0","0",,"504","0","M1",,,"l. by r. achterzitting in pers.ruimte","2635","221 AMG",,"e1*2001/116*0396*18","P47UP1","RZBBR40B","0","0.20","295","Nee","Nee",,"Nee","0","0","0.00","2022","Geen oordeel","05","Ja","2024-05-24T00:00:00.000","2024-01-16T00:00:00.000","2016-04-20T00:00:00.000","2017-11-10T00:00:00.000",,,,,,,,,,,,,,,,,,,,,"G",,,,,,,"https://opendata.rdw.nl/resource/3huj-srit.json","https://opendata.rdw.nl/resource/8ys7-d773.json","https://opendata.rdw.nl/resource/vezc-m2t6.json","https://opendata.rdw.nl/resource/jhie-znh9.json","https://opendata.rdw.nl/resource/kmfi-hrps.json"
"RF294D","Personenauto","MERCEDES-AMG","AMG S63 4MATIC","20241116","20240412","31828","sedan","5","GRIJS","Niet geregistreerd","8","5461","1970","2725","2070",,,"20161116","20171106","Geen verstrekking in Open Data","277561","Ja",,,,,,,"4","4","0","0",,"529","0","M1",,,"by zywand r. voorzitting","2725","221 AMG",,"e1*2001/116*0396*19","P17UP1","RZBAR50B","0","0.21","317","Nee","Nee",,"Nee","0","0","0.00","2024","Geen oordeel","05","Ja","2024-11-16T00:00:00.000","2024-04-12T00:00:00.000","2016-11-16T00:00:00.000","2017-11-06T00:00:00.000",,,,,,,,,,,,,,,,,,,,,"G",,,,,,,"https://opendata.rdw.nl/resource/3huj-srit.json","https://opendata.rdw.nl/resource/8ys7-d773.json","https://opendata.rdw.nl/resource/vezc-m2t6.json","https://opendata.rdw.nl/resource/jhie-znh9.json","https://opendata.rdw.nl/resource/kmfi-hrps.json"