"kenteken","voertuigsoort","merk","handelsbenaming","vervaldatum_apk","datum_tenaamstelling","bruto_bpm","inrichting","aantal_zitplaatsen","eerste_kleur","tweede_kleur","aantal_cilinders","cilinderinhoud","massa_ledig_voertuig","toegestane_maximum_massa_voertuig","massa_rijklaar","maximum_massa_trekken_ongeremd","maximum_trekken_massa_geremd","datum_eerste_toelating","datum_eerste_tenaamstelling_in_nederland","wacht_op_keuren","catalogusprijs","wam_verzekerd","maximale_constructiesnelheid","laadvermogen","oplegger_geremd","aanhangwagen_autonoom_geremd","aanhangwagen_middenas_geremd","aantal_staanplaatsen","aantal_deuren","aantal_wielen","afstand_hart_koppeling_tot_achterzijde_voertuig","afstand_voorzijde_voertuig_tot_hart_koppeling","afwijkende_maximum_snelheid","lengte","breedte","europese_voertuigcategorie","europese_voertuigcategorie_toevoeging","europese_uitvoeringcategorie_toevoeging","plaats_chassisnummer","technische_max_massa_voertuig","type","type_gasinstallatie","typegoedkeuringsnummer","variant","uitvoering","volgnummer_wijziging_eu_typegoedkeuring","vermogen_massarijklaar","wielbasis","export_indicator","openstaande_terugroepactie_indicator","vervaldatum_tachograaf","taxi_indicator","maximum_massa_samenstelling","aantal_rolstoelplaatsen","maximum_ondersteunende_snelheid","jaar_laatste_registratie_tellerstand","tellerstandoordeel","code_toelichting_tellerstandoordeel","tenaamstellen_mogelijk","vervaldatum_apk_dt","datum_tenaamstelling_dt","datum_eerste_toelating_dt","datum_eerste_tenaamstelling_in_nederland_dt","vervaldatum_tachograaf_dt","maximum_last_onder_de_vooras_sen_tezamen_koppeling","type_remsysteem_voertuig_code","rupsonderstelconfiguratiecode","wielbasis_voertuig_minimum","wielbasis_voertuig_maximum","lengte_voertuig_minimum","lengte_voertuig_maximum","breedte_voertuig_minimum","breedte_voertuig_maximum","hoogte_voertuig","hoogte_voertuig_minimum","hoogte_voertuig_maximum","massa_bedrijfsklaar_minimaal","massa_bedrijfsklaar_maximaal","technisch_toelaatbaar_massa_koppelpunt","maximum_massa_technisch_maximaal","maximum_massa_technisch_minimaal","subcategorie_nederland","verticale_belasting_koppelpunt_getrokken_voertuig","zuinigheidsclassificatie","registratie_datum_goedkeuring_afschrijvingsmoment_bpm","registratie_datum_goedkeuring_afschrijvingsmoment_bpm_dt","gem_lading_wrde","aerodyn_voorz","massa_alt_aandr","verl_cab_ind","api_gekentekende_voertuigen_assen","api_gekentekende_voertuigen_brandstof","api_gekentekende_voertuigen_carrosserie","api_gekentekende_voertuigen_carrosserie_specifiek","api_gekentekende_voertuigen_voertuigklasse"
"1TPK98","Personenauto","MC LAREN","MCLAREN 650S SPIDER","20250203","20230208","50193","cabriolet","2","GRIJS","Niet geregistreerd","8","3799","1449","1747","1549",,,"20140402","20140402","Geen verstrekking in Open Data","378970","Ja",,,,,,,"2","4","0","0",,"451","0","M1",,,"r. voorzitting","1747","MP4-12C",,"e11*2007/46*0232*07","CS4A50","80CCG200","0","0.31","267","Nee","Nee",,"Nee","0","0",,"2024","Logisch","00","Ja","2025-02-03T00:00:00.000","2023-02-08T00:00:00.000","2014-04-02T00:00:00.000","2014-04-02T00:00:00.000",,,,,,,,,,,,,,,,,,,,,"G",,,,,,,"https://opendata.rdw.nl/resource/3huj-srit.json","https://opendata.rdw.nl/resource/8ys7-d773.json","https://opendata.rdw.nl/resource/vezc-m2t6.json","https://opendata.rdw.nl/resource/jhie-znh9.json","https://opendata.rdw.nl/resource/kmfi-hrps.json"
"4SGK25","Personenauto","MC LAREN","MP4-12C","20250108","20140530","49035","cabriolet","2","ORANJE","Niet geregistreerd","8","3798","1449","1747","1549",,,"20130108","20130919","Geen verstrekking in Open Data","284577","Ja",,,,,,,"2","4","0","0",,"451","0","M1",,,"r. voorzitting","1747","MP4-12C",,"e11*2007/46*0232*04","CS4A50","70CCB200","0","0.30","267","Nee","Nee",,"Nee","0","0","0.00","2024","Geen oordeel","05","Ja","2025-01-08T00:00:00.000","2014-05-30T00:00:00.000","2013-01-08T00:00:00.000","2013-09-19T00:00:00.000",,"0",,,,,,,,,,,,,,,,,,,"G",,,,,,,"https://opendata.rdw.nl/resource/3huj-srit.json","https://opendata.rdw.nl/resource/8ys7-d773.json","https://opendata.rdw.nl/resource/vezc-m2t6.json","https://opendata.rdw.nl/resource/jhie-znh9.json","https://opendata.rdw.nl/resource/kmfi-hrps.json"
"5SXK64","Personenauto","MC LAREN","MP4-12C","20250125","20131220","49035","cabriolet","2","BLAUW","Niet geregistreerd","8","3798","1449","1747","1549",,,"20121203","20131220","Geen verstrekking in Open Data","334304","Ja",,,,,,,"2","4",,,,,,"M1",,,"r. voorzitting","1747","MP4-12C",,,,,,"0.30","267","Nee","Nee",,"Nee",,,,"2024","Geen oordeel","05","Ja","2025-01-25T00:00:00.000","2013-12-20T00:00:00.000","2012-12-03T00:00:00.000","2013-12-20T00:00:00.000",,"0",,,,,,,,,,,,,,,,,,,,,,,,,,"https://opendata.rdw.nl/resource/3huj-srit.json","https://opendata.rdw.nl/resource/8ys7-d773.json","https://opendata.rdw.nl/resource/vezc-m2t6.json","https://opendata.rdw.nl/resource/jhie-znh9.json","https://opendata.rdw.nl/resource/kmfi-hrps.json"
"7TLN72","Personenauto","MC LAREN","MP4-12C","20250604","20140319","52089","cabriolet","2","ZWART","Niet geregistreerd","8","3798","1449","1747","1549",,,"20140319","20140319","Geen verstrekking in Open Data","334187","Ja",,,,,,,"2","4","0","0",,"451","0","M1",,,"r. voorzitting","1747","MP4-12C",,"e11*2007/46*0232*04","CS4A50","70CCB100","0","0.30","267","Nee","Nee",,"Nee","0","0","0.00","2024","Logisch","00","Ja","2025-06-04T00:00:00.000","2014-03-19T00:00:00.000","2014-03-19T00:00:00.000","2014-03-19T00:00:00.000",,,,,,,,,,,,,,,,,,,,,"G",,,,,,,"https://opendata.rdw.nl/resource/3huj-srit.json","https://opendata.rdw.nl/resource/8ys7-d773.json","https://opendata.rdw.nl/resource/vezc-m2t6.json","https://opendata.rdw.nl/resource/jhie-znh9.json","https://opendata.rdw.nl/resource/kmfi-hrps.json"
"9XGZ90","Personenauto","MC LAREN","MCLAREN 650S SPIDER","20240807","20240124","50193","cabriolet","2","WIT","Niet geregistreerd","8","3799","1449","1747","1549",,,"20140801","20140801","Geen verstrekking in Open Data","382050","Ja",,,,,,,"2","4","0","0",,"451","0","M1",,,"r. voorzitting","1747","MP4-12C",,"e11*2007/46*0232*07","CS4A50","80CCG200","0","0.31","267","Nee","Nee",,"Nee","0","0",,"2024","Logisch","00","Ja","2024-08-07T00:00:00.000","2024-01-24T00:00:00.000","2014-08-01T00:00:00.000","2014-08-01T00:00:00.000",,,,,,,,,,,,,,,,,,,,,"G",,,,,,,"https://opendata.rdw.nl/resource/3huj-srit.json","https://opendata.rdw.nl/resource/8ys7-d773.json","https://opendata.rdw.nl/resource/vezc-m2t6.json","https://opendata.rdw.nl/resource/jhie-znh9.json","https://opendata.rdw.nl/resource/kmfi-hrps.json"
"G200DH","Personenauto","MC LAREN","MCLAREN 650S SPIDER","20241214","20190828","61406","cabriolet","2","GRIJS","Niet geregistreerd","8","3799","1449","1747","1549",,,"20161214","20190828","Geen verstrekking in Open Data","304961","Ja",,,,,,,"2","4",,,,"451","191","M1",,,"a. r. voorzitting","1747","MP4-12C",,"e11*2007/46*0232*13","CS4A50","80CCG200","0","0.31","267","Nee","Nee",,"Nee",,,,"2023","Geen oordeel","05","Ja","2024-12-14T00:00:00.000","2019-08-28T00:00:00.000","2016-12-14T00:00:00.000","2019-08-28T00:00:00.000",,,,,,,,,,,"120",,,,,,,,,,"G",,,,,,,"https://opendata.rdw.nl/resource/3huj-srit.json","https://opendata.rdw.nl/resource/8ys7-d773.json","https://opendata.rdw.nl/resource/vezc-m2t6.json","https://opendata.rdw.nl/resource/jhie-znh9.json","https://opendata.rdw.nl/resource/kmfi-hrps.json"
"H033VD","Personenauto","MC LAREN","MCLAREN 650S SPIDER","20231218","20230725","62412","cabriolet","2","ZWART","Niet geregistreerd","8","3799","1449","1747","1549",,,"20171218","20200529","Geen verstrekking in Open Data","333652","Ja",,,,,,,"2","4",,,,"451","191","M1",,,,"1747","MP4-12C",,"e11*2007/46*0232*12","CS4A50","80CCG200","0","0.31","267","Nee","Nee",,"Nee",,,,"2023","Geen oordeel","05","Ja","2023-12-18T00:00:00.000","2023-07-25T00:00:00.000","2017-12-18T00:00:00.000","2020-05-29T00:00:00.000",,,,,,,,,,,"120",,,,,,,,,,"G",,,,,,,"https://opendata.rdw.nl/resource/3huj-srit.json","https://opendata.rdw.nl/resource/8ys7-d773.json","https://opendata.rdw.nl/resource/vezc-m2t6.json","https://opendata.rdw.nl/resource/jhie-znh9.json","https://opendata.rdw.nl/resource/kmfi-hrps.json"
"H481PG","Personenauto","MC LAREN","MCLAREN 650S SPIDER","20241218","20200320","50185","cabriolet","2","GRIJS","Niet geregistreerd","8","3799","1449","1747","1549",,,"20140716","20200320","Geen verstrekking in Open Data","286307","Ja",,,,,,,"2","4","0","0",,"451","191","M1",,,"r. voorzitting","1747","MP4-12C",,"e11*2007/46*0232*07","CS4A50","80CCG200","0","0.31","267","Nee","Nee",,"Nee","0","0",,"2023","Geen oordeel","05","Nee","2024-12-18T00:00:00.000","2020-03-20T00:00:00.000","2014-07-16T00:00:00.000","2020-03-20T00:00:00.000",,,,,,,,,,,"120",,,,,,,,,,"G",,,,,,,"https://opendata.rdw.nl/resource/3huj-srit.json","https://opendata.rdw.nl/resource/8ys7-d773.json","https://opendata.rdw.nl/resource/vezc-m2t6.json","https://opendata.rdw.nl/resource/jhie-znh9.json","https://opendata.rdw.nl/resource/kmfi-hrps.json"
"HF221F","Personenauto","MC LAREN","MCLAREN 650S SPIDER","20250518","20211022","50193","cabriolet","2","ROOD","Niet geregistreerd","8","3799","1449","1747","1549",,,"20140901","20151022","Geen verstrekking in Open Data","429831","Ja",,,,,,,"2","4","0","0",,"451","0","M1",,,"r. voorzitting","1747","MP4-12C",,"e11*2007/46*0232*09","CS4A50","80CCG200","0","0.31","267","Nee","Nee",,"Nee","0","0",,"2024","Geen oordeel","05","Ja","2025-05-18T00:00:00.000","2021-10-22T00:00:00.000","2014-09-01T00:00:00.000","2015-10-22T00:00:00.000",,,,,,,,,,,,,,,,,,,,,"G",,,,,,,"https://opendata.rdw.nl/resource/3huj-srit.json","https://opendata.rdw.nl/resource/8ys7-d773.json","https://opendata.rdw.nl/resource/vezc-m2t6.json","https://opendata.rdw.nl/resource/jhie-znh9.json","https://opendata.rdw.nl/resource/kmfi-hrps.json"
"HP400S","Personenauto","MC LAREN","MP4-12C","20250408","20220311","52089","cabriolet","2","ORANJE","Niet geregistreerd","8","3798","1449","1747","1549",,,"20140610","20151209","Geen verstrekking in Open Data","309722","Ja",,,,,,,"2","4","0","0",,"451","0","M1",,,"r. voorzitting","1747","MP4-12C",,"e11*2007/46*0232*05","CS4A50","70CCB200","0","0.30","267","Nee","Nee",,"Nee","0","0","0.00","2024","Geen oordeel","05","Ja","2025-04-08T00:00:00.000","2022-03-11T00:00:00.000","2014-06-10T00:00:00.000","2015-12-09T00:00:00.000",,,,,,,,,,,,,,,,,,,,,"G",,,,,,,"https://opendata.rdw.nl/resource/3huj-srit.json","https://opendata.rdw.nl/resource/8ys7-d773.json","https://opendata.rdw.nl/resource/vezc-m2t6.json","https://opendata.rdw.nl/resource/jhie-znh9.json","https://opendata.rdw.nl/resource/kmfi-hrps.json"
"JL992G","Personenauto","MC LAREN","MCLAREN 650S SPIDER","20241030","20160426","53769","cabriolet","2","WIT","Niet geregistreerd","8","3799","1449","1747","1549",,,"20150201","20160426","Geen verstrekking in Open Data","448169","Ja",,,,,,,"2","4",,,,,,"M1",,,"r. voorzitting","1747","MP4-12C",,,,,,"0.31","267","Nee","Nee",,"Nee",,,,"2023","Geen oordeel","05","Ja","2024-10-30T00:00:00.000","2016-04-26T00:00:00.000","2015-02-01T00:00:00.000","2016-04-26T00:00:00.000",,,,,,,,,,,,,,,,,,,,,,,,,,,,"https://opendata.rdw.nl/resource/3huj-srit.json","https://opendata.rdw.nl/resource/8ys7-d773.json","https://opendata.rdw.nl/resource/vezc-m2t6.json","https://opendata.rdw.nl/resource/jhie-znh9.json","https://opendata.rdw.nl/resource/kmfi-hrps.json"
"JX345D","Personenauto","MC LAREN","MCLAREN 675LT SPIDER","20250112","20211015","61407","cabriolet","2","BLAUW","Niet geregistreerd","8","3799","1343","1636","1443",,,"20160708","20160708","Geen verstrekking in Open Data","455442","Ja",,,,,,,"2","4","0","0",,"455","191","M1",,,"in pers.ruimte a.","1636","MP4-12C",,"e11*2007/46*0232*12","CS4A50","80CCH100","0","0.34","267","Nee","Nee",,"Nee","0","0","0.00","2023","Logisch","00","Ja","2025-01-12T00:00:00.000","2021-10-15T00:00:00.000","2016-07-08T00:00:00.000","2016-07-08T00:00:00.000",,,,,,,,,,,"119",,,,,,,,,,"G",,,,,,,"https://opendata.rdw.nl/resource/3huj-srit.json","https://opendata.rdw.nl/resource/8ys7-d773.json","https://opendata.rdw.nl/resource/vezc-m2t6.json","https://opendata.rdw.nl/resource/jhie-znh9.json","https://opendata.rdw.nl/resource/kmfi-hrps.json"
"K072GK","Personenauto","MC LAREN","MP4-12C","20250112","20220112","49035","cabriolet","2","GRIJS","Niet geregistreerd","8","3798","1449","1747","1549",,,"20121204","20201208","Geen verstrekking in Open Data","293761","Ja","329",,,,,,"2","4","0","0",,"451","191","M1",,,,"1747","MP4-12C",,"e11*2007/46*0232*04","CS4A50","70CCB200","0","0.30","267","Nee","Nee",,"Nee","0","0","0.00","2024","Geen oordeel","05","Ja","2025-01-12T00:00:00.000","2022-01-12T00:00:00.000","2012-12-04T00:00:00.000","2020-12-08T00:00:00.000",,,,,,,,,,,"120",,,,,,,,,,"G",,,,,,,"https://opendata.rdw.nl/resource/3huj-srit.json","https://opendata.rdw.nl/resource/8ys7-d773.json","https://opendata.rdw.nl/resource/vezc-m2t6.json","https://opendata.rdw.nl/resource/jhie-znh9.json","https://opendata.rdw.nl/resource/kmfi-hrps.json"
"KJ268S","Personenauto","MC LAREN","MCLAREN 650S SPIDER","20241110","20220107","61407","cabriolet","2","GROEN","Niet geregistreerd","8","3799","1449","1747","1549",,,"20160923","20160923","Geen verstrekking in Open Data","348790","Ja",,,,,,,"2","4",,,,"451","191","M1",,,"in pers.ruimte a.","1747","MP4-12C",,"e11*2007/46*0232*12","CS4A50","80CCG100","0","0.31","267","Nee","Nee",,"Nee",,,,"2024","Logisch","00","Ja","2024-11-10T00:00:00.000","2022-01-07T00:00:00.000","2016-09-23T00:00:00.000","2016-09-23T00:00:00.000",,,,,,,,,,,"120",,,,,,,,,,"G",,,,,,,"https://opendata.rdw.nl/resource/3huj-srit.json","https://opendata.rdw.nl/resource/8ys7-d773.json","https://opendata.rdw.nl/resource/vezc-m2t6.json","https://opendata.rdw.nl/resource/jhie-znh9.json","https://opendata.rdw.nl/resource/kmfi-hrps.json"
"KX830X","Personenauto","MC LAREN","MP-12C SPIDER","20250117","20220113","49035","cabriolet","2","ZWART","Niet geregistreerd","8","3798","1449","1747","1549",,,"20131226","20161223","Geen verstrekking in Open Data","300511","Ja",,,,,,,"2","4",,,,,,"M1",,,"r. a. voorzitting","1747","MP4-12C",,,,,,"0.30","267","Nee","Nee",,"Nee",,,,"2023","Geen oordeel","05","Ja","2025-01-17T00:00:00.000","2022-01-13T00:00:00.000","2013-12-26T00:00:00.000","2016-12-23T00:00:00.000",,,,,,,,,,,,,,,,,,,,,,,,,,,,"https://opendata.rdw.nl/resource/3huj-srit.json","https://opendata.rdw.nl/resource/8ys7-d773.json","https://opendata.rdw.nl/resource/vezc-m2t6.json","https://opendata.rdw.nl/resource/jhie-znh9.json","https://opendata.rdw.nl/resource/kmfi-hrps.json"
"NB989F","Personenauto","MC LAREN","MCLAREN 675LT SPIDER","20250124","20170109","61407","cabriolet","2","WIT","Niet geregistreerd","8","3799","1343","1636","1443",,,"20170109","20170109","Geen verstrekking in Open Data","476736","Ja",,,,,,,"2","4",,,,"455","191","M1",,,"in pers.ruimte a.","1636","MP4-12C",,"e11*2007/46*0232*15","CS4A50","80CCH100","0","0.34","267","Nee","Nee",,"Nee",,,,"2023","Logisch","00","Ja","2025-01-24T00:00:00.000","2017-01-09T00:00:00.000","2017-01-09T00:00:00.000","2017-01-09T00:00:00.000",,,,,,,,,,,"119",,,,,,,,,,"G",,,,,,,"https://opendata.rdw.nl/resource/3huj-srit.json","https://opendata.rdw.nl/resource/8ys7-d773.json","https://opendata.rdw.nl/resource/vezc-m2t6.json","https://opendata.rdw.nl/resource/jhie-znh9.json","https://opendata.rdw.nl/resource/kmfi-hrps.json"
"NF078P","Personenauto","MC LAREN","MCLAREN 650S SPIDER","20250401","20210331","61407","cabriolet","2","GRIJS","Niet geregistreerd","8","3799","1449","1747","1549",,,"20170228","20170228","Geen verstrekking in Open Data","353399","Ja",,,,,,,"2","4","0","0",,"451","191","M1",,,"in pers.ruimte a.","1747","MP4-12C",,"e11*2007/46*0232*09","CS4A50","80CCG100","0","0.31","267","Nee","Nee",,"Nee","0","0","0.00","2024","Logisch","00","Ja","2025-04-01T00:00:00.000","2021-03-31T00:00:00.000","2017-02-28T00:00:00.000","2017-02-28T00:00:00.000",,,,,,,,,,,"120",,,,,,,,,,"G",,,,,,,"https://opendata.rdw.nl/resource/3huj-srit.json","https://opendata.rdw.nl/resource/8ys7-d773.json","https://opendata.rdw.nl/resource/vezc-m2t6.json","https://opendata.rdw.nl/resource/jhie-znh9.json","https://opendata.rdw.nl/resource/kmfi-hrps.json"
"NN730T","Personenauto","MC LAREN","MCLAREN 650S SPIDER","20250420","20170317","53769","cabriolet","2","GRIJS","Niet geregistreerd","8","3799","1449","1747","1549",,,"20150306","20170317","Geen verstrekking in Open Data","359559","Ja",,,,,,,"2","4","0","0",,"451","0","M1",,,"r. voorzitting","1747","MP4-12C",,"e11*2007/46*0232*09","CS4A50","80CCG100","0","0.31","267","Nee","Nee",,"Nee","0","0","0.00","2024","Geen oordeel","05","Ja","2025-04-20T00:00:00.000","2017-03-17T00:00:00.000","2015-03-06T00:00:00.000","2017-03-17T00:00:00.000",,,,,,,,,,,,,,,,,,,,,"G",,,,,,,"https://opendata.rdw.nl/resource/3huj-srit.json","https://opendata.rdw.nl/resource/8ys7-d773.json","https://opendata.rdw.nl/resource/vezc-m2t6.json","https://opendata.rdw.nl/resource/jhie-znh9.json","https://opendata.rdw.nl/resource/kmfi-hrps.json"
"NT614P","Personenauto","MC LAREN","MP4-12C, SPIDER","20240610","20171205","55505","cabriolet","2","ROOD","Niet geregistreerd","8","3798","1449","1747","1549",,,"20150610","20170504","Geen verstrekking in Open Data","313767","Ja",,,,,,,"2","4",,,,,,"M1",,,"a. r. voorzitting","1747","MP4-12C",,,,,,"0.30","267","Nee","Nee",,"Nee",,,,"2023","Geen oordeel","05","Ja","2024-06-10T00:00:00.000","2017-12-05T00:00:00.000","2015-06-10T00:00:00.000","2017-05-04T00:00:00.000",,,,,,,,,,,,,,,,,,,,,,,,,,,,"https://opendata.rdw.nl/resource/3huj-srit.json","https://opendata.rdw.nl/resource/8ys7-d773.json","https://opendata.rdw.nl/resource/vezc-m2t6.json","https://opendata.rdw.nl/resource/jhie-znh9.json","https://opendata.rdw.nl/resource/kmfi-hrps.json"
"NX453V","Personenauto","MC LAREN","MCLAREN 650S SPIDER","20240526","20170512","53769","cabriolet","2","ORANJE","Niet geregistreerd","8","3799","1449","1747","1549",,,"20150119","20170512","Geen verstrekking in Open Data","313750","Ja",,,,,,,"2","4","0","0",,"451","0","M1",,,"r. voorzitting","1747","MP4-12C",,"e11*2007/46*0232*09","CS4A50","80CCG100","0","0.31","267","Nee","Nee",,"Nee","0","0","0.00","2023","Geen oordeel","05","Ja","2024-05-26T00:00:00.000","2017-05-12T00:00:00.000","2015-01-19T00:00:00.000","2017-05-12T00:00:00.000",,,,,,,,,,,,,,,,,,,,,"G",,,,,,,"https://opendata.rdw.nl/resource/3huj-srit.json","https://opendata.rdw.nl/resource/8ys7-d773.json","https://opendata.rdw.nl/resource/vezc-m2t6.json","https://opendata.rdw.nl/resource/jhie-znh9.json","https://opendata.rdw.nl/resource/kmfi-hrps.json"
"P742ZV","Personenauto","MC LAREN","MCLAREN 675LT SPIDER","20240811","20220708","61407","cabriolet","2","WIT","Niet geregistreerd","8","3799","1343","1636","1443",,,"20160812","20220708","Geen verstrekking in Open Data","441513","Ja","326",,,,,,"2","4",,,,"455","191","M1",,,"a. voorzitting r.","1636","MP4-12C",,,,,,"0.34","267","Nee","Nee",,"Nee",,,,"2022","Geen oordeel","05","Nee","2024-08-11T00:00:00.000","2022-07-08T00:00:00.000","2016-08-12T00:00:00.000","2022-07-08T00:00:00.000",,,,,,,,,,,"119",,,,,,,,,,,"20220701","2022-07-01T00:00:00.000",,,,,"https://opendata.rdw.nl/resource/3huj-srit.json","https://opendata.rdw.nl/resource/8ys7-d773.json","https://opendata.rdw.nl/resource/vezc-m2t6.json","https://opendata.rdw.nl/resource/jhie-znh9.json","https://opendata.rdw.nl/resource/kmfi-hrps.json"
"PG107S","Personenauto","MC LAREN","MCLAREN 650S SPIDER","20210601","20240302","53769","cabriolet","2","GRIJS","Niet geregistreerd","8","3799","1449","1747","1549",,,"20150601","20170630","Geen verstrekking in Open Data","327090","Ja",,,,,,,"2","4",,,,,,"M1",,,"r. voorzitting","1747","MP4-12C",,,,,,"0.31","267","Nee","Nee",,"Nee",,,,"2024","Geen oordeel","05","Ja","2021-06-01T00:00:00.000","2024-03-02T00:00:00.000","2015-06-01T00:00:00.000","2017-06-30T00:00:00.000",,,,,,,,,,,,,,,,,,,,,,,,,,,,"https://opendata.rdw.nl/resource/3huj-srit.json","https://opendata.rdw.nl/resource/8ys7-d773.json","https://opendata.rdw.nl/resource/vezc-m2t6.json","https://opendata.rdw.nl/resource/jhie-znh9.json","https://opendata.rdw.nl/resource/kmfi-hrps.json"
"R475BT","Personenauto","MC LAREN","MP4-12C","20230721","20221111","48483","cabriolet","2","GRIJS","Niet geregistreerd","8","3798","1449","1747","1549",,,"20130403","20220721","Geen verstrekking in Open Data","284640","Ja","329",,,,,,"2","4","0","0",,"451","191","M1",,,,"1747","MP4-12C",,"e11*2007/46*0232*04","CS4A50","70CCB200","0","0.30","267","Nee","Nee",,"Nee","0","0","0.00","2022","Geen oordeel","05","Ja","2023-07-21T00:00:00.000","2022-11-11T00:00:00.000","2013-04-03T00:00:00.000","2022-07-21T00:00:00.000",,,,,,,,,,,"120",,,,,,,,,,,"20220720","2022-07-20T00:00:00.000",,,,,"https://opendata.rdw.nl/resource/3huj-srit.json","https://opendata.rdw.nl/resource/8ys7-d773.json","https://opendata.rdw.nl/resource/vezc-m2t6.json","https://opendata.rdw.nl/resource/jhie-znh9.json","https://opendata.rdw.nl/resource/kmfi-hrps.json"
"R522HX","Personenauto","MC LAREN","MCLAREN 675LT SPIDER","20260327","20230317","62410","cabriolet","2","ZWART","Niet geregistreerd","8","3799","1343","1636","1443",,,"20180628","20230317","Geen verstrekking in Open Data","429464","Ja","326",,,,,,"2","4",,,,"455","191","M1",,,,"1636","MP4-12C",,"e11*2007/46*0232*15","CS4A50","80CCH100","0","0.34","267","Nee","Nee",,"Nee",,,,"2024","Geen oordeel","05","Ja","2026-03-27T00:00:00.000","2023-03-17T00:00:00.000","2018-06-28T00:00:00.000","2023-03-17T00:00:00.000",,,,,,,,,,,"119",,,,,,,,,,,"20220817","2022-08-17T00:00:00.000",,,,,"https://opendata.rdw.nl/resource/3huj-srit.json","https://opendata.rdw.nl/resource/8ys7-d773.json","https://opendata.rdw.nl/resource/vezc-m2t6.json","https://opendata.rdw.nl/resource/jhie-znh9.json","https://opendata.rdw.nl/resource/kmfi-hrps.json"
"S471PF","Personenauto","MC LAREN","MP4-12C","20250502","20230309","48465","cabriolet","2","ZWART","Niet geregistreerd","8","3798","1449","1747","1549",,,"20130415","20230309","Geen verstrekking in Open Data","284640","Ja","329",,,,,,"2","4","0","0",,"451","191","M1",,,,"1747","MP4-12C",,"e11*2007/46*0232*04","CS4A50","70CCB200","0","0.30","267","Nee","Nee",,"Nee","0","0","0.00","2024","Geen oordeel","05","Ja","2025-05-02T00:00:00.000","2023-03-09T00:00:00.000","2013-04-15T00:00:00.000","2023-03-09T00:00:00.000",,,,,,,,,,,"120",,,,,,,,,,,"20230308","2023-03-08T00:00:00.000",,,,,"https://opendata.rdw.nl/resource/3huj-srit.json","https://opendata.rdw.nl/resource/8ys7-d773.json","https://opendata.rdw.nl/resource/vezc-m2t6.json","https://opendata.rdw.nl/resource/jhie-znh9.json","https://opendata.rdw.nl/resource/kmfi-hrps.json"
"SG819Z","Personenauto","MC LAREN","MCLAREN 650S SPIDER","20250422","20200626","53769","cabriolet","2","ORANJE","Niet geregistreerd","8","3799","1449","1747","1549",,,"20150701","20180406","Geen verstrekking in Open Data","371401","Ja",,,,,,,"2","4",,,,,,"M1",,,"r. voorzitting","1747","MP4-12C",,,,,,"0.31","267","Nee","Nee",,"Nee",,,,"2024","Geen oordeel","05","Ja","2025-04-22T00:00:00.000","2020-06-26T00:00:00.000","2015-07-01T00:00:00.000","2018-04-06T00:00:00.000",,,,,,,,,,,,,,,,,,,,,,,,,,,,"https://opendata.rdw.nl/resource/3huj-srit.json","https://opendata.rdw.nl/resource/8ys7-d773.json","https://opendata.rdw.nl/resource/vezc-m2t6.json","https://opendata.rdw.nl/resource/jhie-znh9.json","https://opendata.rdw.nl/resource/kmfi-hrps.json"