"kenteken","voertuigsoort","merk","handelsbenaming","vervaldatum_apk","datum_tenaamstelling","bruto_bpm","inrichting","aantal_zitplaatsen","eerste_kleur","tweede_kleur","aantal_cilinders","cilinderinhoud","massa_ledig_voertuig","toegestane_maximum_massa_voertuig","massa_rijklaar","maximum_massa_trekken_ongeremd","maximum_trekken_massa_geremd","datum_eerste_toelating","datum_eerste_tenaamstelling_in_nederland","wacht_op_keuren","catalogusprijs","wam_verzekerd","maximale_constructiesnelheid","laadvermogen","oplegger_geremd","aanhangwagen_autonoom_geremd","aanhangwagen_middenas_geremd","aantal_staanplaatsen","aantal_deuren","aantal_wielen","afstand_hart_koppeling_tot_achterzijde_voertuig","afstand_voorzijde_voertuig_tot_hart_koppeling","afwijkende_maximum_snelheid","lengte","breedte","europese_voertuigcategorie","europese_voertuigcategorie_toevoeging","europese_uitvoeringcategorie_toevoeging","plaats_chassisnummer","technische_max_massa_voertuig","type","type_gasinstallatie","typegoedkeuringsnummer","variant","uitvoering","volgnummer_wijziging_eu_typegoedkeuring","vermogen_massarijklaar","wielbasis","export_indicator","openstaande_terugroepactie_indicator","vervaldatum_tachograaf","taxi_indicator","maximum_massa_samenstelling","aantal_rolstoelplaatsen","maximum_ondersteunende_snelheid","jaar_laatste_registratie_tellerstand","tellerstandoordeel","code_toelichting_tellerstandoordeel","tenaamstellen_mogelijk","vervaldatum_apk_dt","datum_tenaamstelling_dt","datum_eerste_toelating_dt","datum_eerste_tenaamstelling_in_nederland_dt","vervaldatum_tachograaf_dt","maximum_last_onder_de_vooras_sen_tezamen_koppeling","type_remsysteem_voertuig_code","rupsonderstelconfiguratiecode","wielbasis_voertuig_minimum","wielbasis_voertuig_maximum","lengte_voertuig_minimum","lengte_voertuig_maximum","breedte_voertuig_minimum","breedte_voertuig_maximum","hoogte_voertuig","hoogte_voertuig_minimum","hoogte_voertuig_maximum","massa_bedrijfsklaar_minimaal","massa_bedrijfsklaar_maximaal","technisch_toelaatbaar_massa_koppelpunt","maximum_massa_technisch_maximaal","maximum_massa_technisch_minimaal","subcategorie_nederland","verticale_belasting_koppelpunt_getrokken_voertuig","zuinigheidsclassificatie","registratie_datum_goedkeuring_afschrijvingsmoment_bpm","registratie_datum_goedkeuring_afschrijvingsmoment_bpm_dt","gem_lading_wrde","aerodyn_voorz","massa_alt_aandr","verl_cab_ind","api_gekentekende_voertuigen_assen","api_gekentekende_voertuigen_brandstof","api_gekentekende_voertuigen_carrosserie","api_gekentekende_voertuigen_carrosserie_specifiek","api_gekentekende_voertuigen_voertuigklasse"
"1VXH79","Bedrijfsauto","LANCIA","VOYAGER VAN","20250407","20170728","10465","gesloten opbouw","2","N.v.t.","N.v.t.","6","3604","1973","2690","2073","450",,"20120713","20120713","Geen verstrekking in Open Data","47547","Ja",,"717",,"1600","1600",,"0","4","0","0",,"522","200","N1",,,"r. op a. deurdorpel","2690","RT","G3 gasinstallatie","e4*NKS*0045*00","L5DBX","C2MN1A","0","0.10","308","Nee","Nee",,"Nee","4290","0",,"2024","Logisch","00","Ja","2025-04-07T00:00:00.000","2017-07-28T00:00:00.000","2012-07-13T00:00:00.000","2012-07-13T00:00:00.000",,"0",,,,,,,,,,,,,,,,,,,,,,,,,,"https://opendata.rdw.nl/resource/3huj-srit.json","https://opendata.rdw.nl/resource/8ys7-d773.json","https://opendata.rdw.nl/resource/vezc-m2t6.json","https://opendata.rdw.nl/resource/jhie-znh9.json","https://opendata.rdw.nl/resource/kmfi-hrps.json"
"1VXT27","Bedrijfsauto","LANCIA","VOYAGER VAN","20250227","20231108","14165","gesloten opbouw","2","N.v.t.","N.v.t.","4","2776","2060","2790","2160","450",,"20120821","20120821","Geen verstrekking in Open Data","58877","Ja",,"730",,"1600","1600",,"0","4","0","0",,"522","200","N1",,,"r. op a. deurdorpel","2790","RT",,"e4*NKS*0045*00","L5DB9","C2MD1A","0","0.06","308","Nee","Nee",,"Nee","4390","0",,"2024","Logisch","00","Ja","2025-02-27T00:00:00.000","2023-11-08T00:00:00.000","2012-08-21T00:00:00.000","2012-08-21T00:00:00.000",,"0",,,,,,,,,,,,,,,,,,,,,,,,,,"https://opendata.rdw.nl/resource/3huj-srit.json","https://opendata.rdw.nl/resource/8ys7-d773.json","https://opendata.rdw.nl/resource/vezc-m2t6.json","https://opendata.rdw.nl/resource/jhie-znh9.json","https://opendata.rdw.nl/resource/kmfi-hrps.json"
"2VXL48","Bedrijfsauto","LANCIA","VOYAGER VAN","20250504","20220603","13205","gesloten opbouw","2","N.v.t.","N.v.t.","4","2776","2060","2790","2160","450",,"20120723","20120723","Geen verstrekking in Open Data","54890","Ja",,"730",,"1600","1600",,"0","4","0","0",,"522","200","N1",,,"r. op a. deurdorpel","2790","RT",,"e4*NKS*0045*00","L5DB9","C2MD1A","0","0.06","308","Nee","Nee",,"Nee","4390","0",,"2024","Logisch","00","Ja","2025-05-04T00:00:00.000","2022-06-03T00:00:00.000","2012-07-23T00:00:00.000","2012-07-23T00:00:00.000",,"0",,,,,,,,,,,,,,,,,,,,,,,,,,"https://opendata.rdw.nl/resource/3huj-srit.json","https://opendata.rdw.nl/resource/8ys7-d773.json","https://opendata.rdw.nl/resource/vezc-m2t6.json","https://opendata.rdw.nl/resource/jhie-znh9.json","https://opendata.rdw.nl/resource/kmfi-hrps.json"
"2VXL49","Bedrijfsauto","LANCIA","VOYAGER VAN","20240922","20130902","14165","gesloten opbouw","2","N.v.t.","N.v.t.","4","2776","2060","2790","2160","450",,"20120720","20120720","Geen verstrekking in Open Data","58877","Ja",,"730",,"1600","1600",,"0","4","0","0",,"522","200","N1",,,"r. op a. deurdorpel","2790","RT",,"e4*NKS*0045*00","L5DB9","C2MD1A","0","0.06","308","Nee","Ja",,"Nee","4390","0",,"2023","Logisch","00","Ja","2024-09-22T00:00:00.000","2013-09-02T00:00:00.000","2012-07-20T00:00:00.000","2012-07-20T00:00:00.000",,"0",,,,,,,,,,,,,,,,,,,,,,,,,,"https://opendata.rdw.nl/resource/3huj-srit.json","https://opendata.rdw.nl/resource/8ys7-d773.json","https://opendata.rdw.nl/resource/vezc-m2t6.json","https://opendata.rdw.nl/resource/jhie-znh9.json","https://opendata.rdw.nl/resource/kmfi-hrps.json"
"3VZS60","Bedrijfsauto","LANCIA","VOYAGER VAN","20240913","20230704","10729","gesloten opbouw","2","N.v.t.","N.v.t.","6","3604","1960","2690","2060","450",,"20121123","20121123","Geen verstrekking in Open Data","49283","Ja",,"730",,"1600","1600",,"0","4","0","0",,"522","200","N1",,,"r. op a. deurdorpel","2690","RT","G3 gasinstallatie","e4*NKS*0045*00","L5DBX","C2MN1A","0","0.10","308","Nee","Nee",,"Nee","4290","0",,"2024","Logisch","00","Ja","2024-09-13T00:00:00.000","2023-07-04T00:00:00.000","2012-11-23T00:00:00.000","2012-11-23T00:00:00.000",,"0",,,,,,,,,,,,,,,,,,,,,,,,,,"https://opendata.rdw.nl/resource/3huj-srit.json","https://opendata.rdw.nl/resource/8ys7-d773.json","https://opendata.rdw.nl/resource/vezc-m2t6.json","https://opendata.rdw.nl/resource/jhie-znh9.json","https://opendata.rdw.nl/resource/kmfi-hrps.json"
"4VXZ40","Bedrijfsauto","LANCIA","VOYAGER VAN","20250228","20211211","12197","gesloten opbouw","2","N.v.t.","N.v.t.","6","3604","1909","2690","2009","450",,"20120905","20120905","Geen verstrekking in Open Data","54750","Ja",,"781",,"1600","1600",,"0","4","0","0",,"522","200","N1",,,"r. op a. deurdorpel","2690","RT",,"e4*NKS*0045*00","L5DBX","C2MN1A","0","0.10","308","Nee","Nee",,"Nee","4290","0",,"2024","Logisch","00","Ja","2025-02-28T00:00:00.000","2021-12-11T00:00:00.000","2012-09-05T00:00:00.000","2012-09-05T00:00:00.000",,"0",,,,,,,,,,,,,,,,,,,,,,,,,,"https://opendata.rdw.nl/resource/3huj-srit.json","https://opendata.rdw.nl/resource/8ys7-d773.json","https://opendata.rdw.nl/resource/vezc-m2t6.json","https://opendata.rdw.nl/resource/jhie-znh9.json","https://opendata.rdw.nl/resource/kmfi-hrps.json"
"5VVK45","Bedrijfsauto","LANCIA","VOYAGER VAN","20250220","20240203","13814","gesloten opbouw","2","N.v.t.","N.v.t.","4","2776","2060","2790","2160","450",,"20120425","20120425","Geen verstrekking in Open Data","56559","Ja",,"730",,"1600","1600",,"0","4","0","0",,"522","200","N1",,,"r. op a. deurdorpel","2790","RT",,"e4*NKS*0045*00","L5DB9","C2MD1A","0","0.06","308","Nee","Nee",,"Nee","4390","0",,"2024","Logisch","00","Ja","2025-02-20T00:00:00.000","2024-02-03T00:00:00.000","2012-04-25T00:00:00.000","2012-04-25T00:00:00.000",,"0",,,,,,,,,,,,,,,,,,,,,,,,,,"https://opendata.rdw.nl/resource/3huj-srit.json","https://opendata.rdw.nl/resource/8ys7-d773.json","https://opendata.rdw.nl/resource/vezc-m2t6.json","https://opendata.rdw.nl/resource/jhie-znh9.json","https://opendata.rdw.nl/resource/kmfi-hrps.json"
"7VZK95","Bedrijfsauto","LANCIA","VOYAGER VAN","20241130","20221202","14164","gesloten opbouw","2","N.v.t.","N.v.t.","4","2776","2060","2790","2160","450",,"20121019","20121019","Geen verstrekking in Open Data","59625","Ja",,"730",,"1600","1600",,"0","4","0","0",,"522","200","N1",,,"r. op a. deurdorpel","2790","RT",,"e4*NKS*0045*00","L5DB9","C2MD1A","0","0.06","308","Nee","Nee",,"Nee","4390","0",,"2023","Logisch","00","Ja","2024-11-30T00:00:00.000","2022-12-02T00:00:00.000","2012-10-19T00:00:00.000","2012-10-19T00:00:00.000",,"0",,,,,,,,,,,,,,,,,,,,,,,,,,"https://opendata.rdw.nl/resource/3huj-srit.json","https://opendata.rdw.nl/resource/8ys7-d773.json","https://opendata.rdw.nl/resource/vezc-m2t6.json","https://opendata.rdw.nl/resource/jhie-znh9.json","https://opendata.rdw.nl/resource/kmfi-hrps.json"
"H010LV","Personenauto","LANCIA","VOYAGER VAN","20250406","20200605","4972","MPV","6","ZWART","Niet geregistreerd","4","2776","2220","2790","2320","450","1535","20140320","20140320","Geen verstrekking in Open Data","72585","Ja",,,,,,,"4","4",,,,"522","200","M1",,,"r. op a. deurdorpel","2790","RT",,,,,,"0.06","308","Nee","Nee",,"Nee","4390",,,"2024","Logisch","00","Ja","2025-04-06T00:00:00.000","2020-06-05T00:00:00.000","2014-03-20T00:00:00.000","2014-03-20T00:00:00.000",,,,,,,,,,,,,,,,,,,,,,,,,,,,"https://opendata.rdw.nl/resource/3huj-srit.json","https://opendata.rdw.nl/resource/8ys7-d773.json","https://opendata.rdw.nl/resource/vezc-m2t6.json","https://opendata.rdw.nl/resource/jhie-znh9.json","https://opendata.rdw.nl/resource/kmfi-hrps.json"
"KJ950D","Personenauto","LANCIA","VOYAGER VAN","20240108","20240116","10785","lijkwagen","2","GRIJS","Niet geregistreerd","4","2776","2380","2790","2480","450","1535","20160108","20160108","Geen verstrekking in Open Data",,"Ja",,,,,,,"4","4",,,,,,"M1",,,"r. op a. deurdorpel","2790","RT",,,,,,"0.05","308","Nee","Nee",,"Nee","4390",,,"2024","Geen oordeel","05","Ja","2024-01-08T00:00:00.000","2024-01-16T00:00:00.000","2016-01-08T00:00:00.000","2016-01-08T00:00:00.000",,,,,,,,,,,,,,,,,,,,,,,,,,,,"https://opendata.rdw.nl/resource/3huj-srit.json","https://opendata.rdw.nl/resource/8ys7-d773.json","https://opendata.rdw.nl/resource/vezc-m2t6.json","https://opendata.rdw.nl/resource/jhie-znh9.json","https://opendata.rdw.nl/resource/kmfi-hrps.json"
"VB113P","Bedrijfsauto","LANCIA","VOYAGER VAN","20250215","20130215","14686","gesloten opbouw","2","N.v.t.","N.v.t.","4","2776","2060","2790","2160","450",,"20130215","20130215","Geen verstrekking in Open Data","60946","Ja",,"730",,"1600","1600",,"0","4","0","0",,"522","200","N1",,,"r. op a. deurdorpel","2790","RT",,"e4*NKS*0045*00","L5DB9","C2MD1A","0","0.06","308","Nee","Nee",,"Nee","4390","0",,"2024","Logisch","00","Ja","2025-02-15T00:00:00.000","2013-02-15T00:00:00.000","2013-02-15T00:00:00.000","2013-02-15T00:00:00.000",,"0",,,,,,,,,,,,,,,,,,,,,,,,,,"https://opendata.rdw.nl/resource/3huj-srit.json","https://opendata.rdw.nl/resource/8ys7-d773.json","https://opendata.rdw.nl/resource/vezc-m2t6.json","https://opendata.rdw.nl/resource/jhie-znh9.json","https://opendata.rdw.nl/resource/kmfi-hrps.json"
"VB217D","Bedrijfsauto","LANCIA","VOYAGER VAN","20250115","20130111","11560","gesloten opbouw","2","N.v.t.","N.v.t.","6","3604","1909","2690","2009","450",,"20130111","20130111","Geen verstrekking in Open Data","52784","Ja",,"781",,"1600","1600",,"0","4","0","0",,"522","200","N1",,,"r. op a. deurdorpel","2690","RT",,"e4*NKS*0045*00","L5DBX","C2MN1A","0","0.10","308","Nee","Nee",,"Nee","4290","0",,"2024","Logisch","00","Ja","2025-01-15T00:00:00.000","2013-01-11T00:00:00.000","2013-01-11T00:00:00.000","2013-01-11T00:00:00.000",,"0",,,,,,,,,,,,,,,,,,,,,,,,,,"https://opendata.rdw.nl/resource/3huj-srit.json","https://opendata.rdw.nl/resource/8ys7-d773.json","https://opendata.rdw.nl/resource/vezc-m2t6.json","https://opendata.rdw.nl/resource/jhie-znh9.json","https://opendata.rdw.nl/resource/kmfi-hrps.json"
"VB644V","Bedrijfsauto","LANCIA","VOYAGER VAN","20250323","20180323","8636","gesloten opbouw","2","N.v.t.","N.v.t.","6","3604","1981","2690","2081","450",,"20130318","20130318","Geen verstrekking in Open Data","40490","Ja",,"709",,"1600","1600",,"0","4","0","0",,"522","200","N1",,,"r. op a. deurdorpel","2690","RT","G3 gasinstallatie","e4*NKS*0045*00","L5DBX","C2MN1A","0","0.10","308","Nee","Nee",,"Nee","0","0",,"2024","Logisch","00","Ja","2025-03-23T00:00:00.000","2018-03-23T00:00:00.000","2013-03-18T00:00:00.000","2013-03-18T00:00:00.000",,"0",,,,,,,,,,,,,,,,,,,,,,,,,,"https://opendata.rdw.nl/resource/3huj-srit.json","https://opendata.rdw.nl/resource/8ys7-d773.json","https://opendata.rdw.nl/resource/vezc-m2t6.json","https://opendata.rdw.nl/resource/jhie-znh9.json","https://opendata.rdw.nl/resource/kmfi-hrps.json"
"VB854Z","Bedrijfsauto","LANCIA","VOYAGER VAN","20250218","20130329","8641","gesloten opbouw","2","N.v.t.","N.v.t.","6","3604","1909","2690","2009","450",,"20130329","20130329","Geen verstrekking in Open Data","40496","Ja",,"781",,"1600","1600",,"0","4","0","0",,"522","200","N1",,,"r. op a. deurdorpel","2690","RT",,"e4*NKS*0045*00","L5DBX","C2MN1A","0","0.10","308","Nee","Nee",,"Nee","0","0",,"2024","Logisch","00","Ja","2025-02-18T00:00:00.000","2013-03-29T00:00:00.000","2013-03-29T00:00:00.000","2013-03-29T00:00:00.000",,"0",,,,,,,,,,,,,,,,,,,,,,,,,,"https://opendata.rdw.nl/resource/3huj-srit.json","https://opendata.rdw.nl/resource/8ys7-d773.json","https://opendata.rdw.nl/resource/vezc-m2t6.json","https://opendata.rdw.nl/resource/jhie-znh9.json","https://opendata.rdw.nl/resource/kmfi-hrps.json"
"VD098K","Bedrijfsauto","LANCIA","VOYAGER VAN","20240823","20190829","14514","gesloten opbouw","2","N.v.t.","N.v.t.","4","2776","2060","2790","2160","450",,"20130506","20130506","Geen verstrekking in Open Data","60224","Ja",,"730",,"1600","1600",,"0","4","0","0",,"522","200","N1",,,"r. op a. deurdorpel","2790","RT",,"e4*NKS*0045*00","L5DB9","C2MD1A","0","0.06","308","Nee","Nee",,"Nee","4390","0",,"2023","Logisch","00","Ja","2024-08-23T00:00:00.000","2019-08-29T00:00:00.000","2013-05-06T00:00:00.000","2013-05-06T00:00:00.000",,"0",,,,,,,,,,,,,,,,,,,,,,,,,,"https://opendata.rdw.nl/resource/3huj-srit.json","https://opendata.rdw.nl/resource/8ys7-d773.json","https://opendata.rdw.nl/resource/vezc-m2t6.json","https://opendata.rdw.nl/resource/jhie-znh9.json","https://opendata.rdw.nl/resource/kmfi-hrps.json"
"VD194X","Bedrijfsauto","LANCIA","VOYAGER VAN","20240221","20240102","13455","gesloten opbouw","2","N.v.t.","N.v.t.","4","2776","2060","2790","2160","450",,"20130621","20130621","Geen verstrekking in Open Data","55765","Ja",,"730",,"1600","1600",,"0","4","0","0",,"522","200","N1",,,"r. op a. deurdorpel","2790","RT",,"e4*NKS*0045*00","L5DB9","C2MD1A","0","0.06","308","Nee","Nee",,"Nee","4390","0",,"2024","Logisch","00","Ja","2024-02-21T00:00:00.000","2024-01-02T00:00:00.000","2013-06-21T00:00:00.000","2013-06-21T00:00:00.000",,"0",,,,,,,,,,,,,,,,,,,,,,,,,,"https://opendata.rdw.nl/resource/3huj-srit.json","https://opendata.rdw.nl/resource/8ys7-d773.json","https://opendata.rdw.nl/resource/vezc-m2t6.json","https://opendata.rdw.nl/resource/jhie-znh9.json","https://opendata.rdw.nl/resource/kmfi-hrps.json"
"VD716F","Bedrijfsauto","LANCIA","VOYAGER VAN","20250329","20231006","14514","gesloten opbouw","2","N.v.t.","N.v.t.","4","2776","2060","2790","2160","450",,"20130329","20130329","Geen verstrekking in Open Data","60224","Ja",,"730",,"1600","1600",,"0","4","0","0",,"522","200","N1",,,"r. op a. deurdorpel","2790","RT",,"e4*NKS*0045*00","L5DB9","C2MD1A","0","0.06","308","Nee","Ja",,"Nee","4390","0",,"2024","Logisch","00","Ja","2025-03-29T00:00:00.000","2023-10-06T00:00:00.000","2013-03-29T00:00:00.000","2013-03-29T00:00:00.000",,"0",,,,,,,,,,,,,,,,,,,,,,,,,,"https://opendata.rdw.nl/resource/3huj-srit.json","https://opendata.rdw.nl/resource/8ys7-d773.json","https://opendata.rdw.nl/resource/vezc-m2t6.json","https://opendata.rdw.nl/resource/jhie-znh9.json","https://opendata.rdw.nl/resource/kmfi-hrps.json"
"VF733J","Bedrijfsauto","LANCIA","VOYAGER VAN","20240821","20240417","14468","gesloten opbouw","2","N.v.t.","N.v.t.","4","2776","2060","2790","2160","450",,"20130809","20130809","Geen verstrekking in Open Data","60028","Ja",,"730",,"1600","1600",,"0","4","0","0",,"522","200","N1",,,"r. op a. deurdorpel","2790","RT",,"e4*NKS*0045*00","L5DB9","C2MD1A","0","0.06","308","Nee","Nee",,"Nee","4390","0",,"2024","Logisch","00","Ja","2024-08-21T00:00:00.000","2024-04-17T00:00:00.000","2013-08-09T00:00:00.000","2013-08-09T00:00:00.000",,"0",,,,,,,,,,,,,,,,,,,,,,,,,,"https://opendata.rdw.nl/resource/3huj-srit.json","https://opendata.rdw.nl/resource/8ys7-d773.json","https://opendata.rdw.nl/resource/vezc-m2t6.json","https://opendata.rdw.nl/resource/jhie-znh9.json","https://opendata.rdw.nl/resource/kmfi-hrps.json"
"VF757S","Bedrijfsauto","LANCIA","VOYAGER VAN","20250207","20210130","13020","gesloten opbouw","2","N.v.t.","N.v.t.","4","2776","2060","2790","2160","450",,"20130926","20130926","Geen verstrekking in Open Data","53935","Ja",,"730",,"1600","1600",,"0","4","0","0",,"522","200","N1",,,"r. op a. deurdorpel","2790","RT",,"e4*NKS*0045*00","L5DB9","C2MD1A","0","0.06","308","Nee","Nee",,"Nee","4390","0",,"2024","Logisch","00","Ja","2025-02-07T00:00:00.000","2021-01-30T00:00:00.000","2013-09-26T00:00:00.000","2013-09-26T00:00:00.000",,"0",,,,,,,,,,,,,,,,,,,,,,,,,,"https://opendata.rdw.nl/resource/3huj-srit.json","https://opendata.rdw.nl/resource/8ys7-d773.json","https://opendata.rdw.nl/resource/vezc-m2t6.json","https://opendata.rdw.nl/resource/jhie-znh9.json","https://opendata.rdw.nl/resource/kmfi-hrps.json"
"VG071P","Bedrijfsauto","LANCIA","VOYAGER VAN","20250314","20200905","12727","gesloten opbouw","2","N.v.t.","N.v.t.","4","2776","2060","2790","2160","450",,"20131227","20131227","Geen verstrekking in Open Data","52703","Ja",,"730",,"1600","1600",,"0","4","0","0",,"522","200","N1",,,"r. op a. deurdorpel","2790","RT",,"e4*NKS*0045*02","L5DB9","E2HD1B","0","0.06","308","Nee","Nee",,"Nee","0","0",,"2024","Logisch","00","Ja","2025-03-14T00:00:00.000","2020-09-05T00:00:00.000","2013-12-27T00:00:00.000","2013-12-27T00:00:00.000",,"0",,,,,,,,,,,,,,,,,,,,,,,,,,"https://opendata.rdw.nl/resource/3huj-srit.json","https://opendata.rdw.nl/resource/8ys7-d773.json","https://opendata.rdw.nl/resource/vezc-m2t6.json","https://opendata.rdw.nl/resource/jhie-znh9.json","https://opendata.rdw.nl/resource/kmfi-hrps.json"
"VG124T","Bedrijfsauto","LANCIA","VOYAGER VAN","20250115","20240102","12727","gesloten opbouw","2","N.v.t.","N.v.t.","4","2776","2060","2790","2160","450",,"20140115","20140115","Geen verstrekking in Open Data","52703","Ja",,"730",,"1600","1600",,"0","4","0","0",,"522","200","N1",,,"r. op a. deurdorpel","2790","RT",,"e4*NKS*0045*02","L5DB9","E2HD1B","0","0.06","308","Nee","Nee",,"Nee","4390","0",,"2024","Logisch","00","Ja","2025-01-15T00:00:00.000","2024-01-02T00:00:00.000","2014-01-15T00:00:00.000","2014-01-15T00:00:00.000",,"0",,,,,,,,,,,,,,,,,,,,,,,,,,"https://opendata.rdw.nl/resource/3huj-srit.json","https://opendata.rdw.nl/resource/8ys7-d773.json","https://opendata.rdw.nl/resource/vezc-m2t6.json","https://opendata.rdw.nl/resource/jhie-znh9.json","https://opendata.rdw.nl/resource/kmfi-hrps.json"
"VG315P","Bedrijfsauto","LANCIA","VOYAGER VAN","20241021","20230902","13505","gesloten opbouw","2","N.v.t.","N.v.t.","4","2776","2060","2790","2160","450",,"20131231","20131231","Geen verstrekking in Open Data","55975","Ja",,"730",,"1600","1600",,"0","4","0","0",,"522","200","N1",,,"r. op a. deurdorpel","2790","RT",,"e4*NKS*0045*01","L5DB9","D2HD1B","0","0.06","308","Nee","Nee",,"Nee","0","0",,"2023","Logisch","00","Ja","2024-10-21T00:00:00.000","2023-09-02T00:00:00.000","2013-12-31T00:00:00.000","2013-12-31T00:00:00.000",,"0",,,,,,,,,,,,,,,,,,,,,,,,,,"https://opendata.rdw.nl/resource/3huj-srit.json","https://opendata.rdw.nl/resource/8ys7-d773.json","https://opendata.rdw.nl/resource/vezc-m2t6.json","https://opendata.rdw.nl/resource/jhie-znh9.json","https://opendata.rdw.nl/resource/kmfi-hrps.json"
"VG602D","Bedrijfsauto","LANCIA","VOYAGER VAN","20240920","20201210","12727","gesloten opbouw","2","N.v.t.","N.v.t.","4","2776","2060","2790","2160","450",,"20131030","20131030","Geen verstrekking in Open Data","52703","Ja",,"730",,"1600","1600",,"0","4","0","0",,"522","200","N1",,,"r. op a. deurdorpel","2790","RT",,"e4*NKS*0045*02","L5DB9","E2HD1B","0","0.06","308","Nee","Nee",,"Nee","4390","0",,"2023","Logisch","00","Ja","2024-09-20T00:00:00.000","2020-12-10T00:00:00.000","2013-10-30T00:00:00.000","2013-10-30T00:00:00.000",,"0",,,,,,,,,,,,,,,,,,,,,,,,,,"https://opendata.rdw.nl/resource/3huj-srit.json","https://opendata.rdw.nl/resource/8ys7-d773.json","https://opendata.rdw.nl/resource/vezc-m2t6.json","https://opendata.rdw.nl/resource/jhie-znh9.json","https://opendata.rdw.nl/resource/kmfi-hrps.json"
"VG720L","Bedrijfsauto","LANCIA","VOYAGER VAN","20241214","20131214","12727","gesloten opbouw","2","N.v.t.","N.v.t.","4","2776","2060","2790","2160","450",,"20131214","20131214","Geen verstrekking in Open Data","52703","Ja",,"730",,"1600","1600",,"0","4","0","0",,"522","200","N1",,,"r. op a. deurdorpel","2790","RT",,"e4*NKS*0045*02","L5DB9","E2HD1B","0","0.06","308","Nee","Nee",,"Nee","0","0",,"2024","Logisch","00","Ja","2024-12-14T00:00:00.000","2013-12-14T00:00:00.000","2013-12-14T00:00:00.000","2013-12-14T00:00:00.000",,"0",,,,,,,,,,,,,,,,,,,,,,,,,,"https://opendata.rdw.nl/resource/3huj-srit.json","https://opendata.rdw.nl/resource/8ys7-d773.json","https://opendata.rdw.nl/resource/vezc-m2t6.json","https://opendata.rdw.nl/resource/jhie-znh9.json","https://opendata.rdw.nl/resource/kmfi-hrps.json"
"VH114F","Bedrijfsauto","LANCIA","VOYAGER VAN","20250216","20140210","13719","gesloten opbouw","2","N.v.t.","N.v.t.","4","2776","2060","2790","2160","450",,"20140210","20140210","Geen verstrekking in Open Data","56877","Ja",,"730",,"1535","1535",,"0","4","0","0",,"522","200","N1",,,"r. op a. deurdorpel","2790","RT",,"e4*NKS*0045*02","L5DB9","E2HD1B","0","0.06","308","Nee","Nee",,"Nee","4390","0",,"2024","Logisch","00","Ja","2025-02-16T00:00:00.000","2014-02-10T00:00:00.000","2014-02-10T00:00:00.000","2014-02-10T00:00:00.000",,"0",,,,,,,,,,,,,,,,,,,,,,,,,,"https://opendata.rdw.nl/resource/3huj-srit.json","https://opendata.rdw.nl/resource/8ys7-d773.json","https://opendata.rdw.nl/resource/vezc-m2t6.json","https://opendata.rdw.nl/resource/jhie-znh9.json","https://opendata.rdw.nl/resource/kmfi-hrps.json"
"VH993F","Bedrijfsauto","LANCIA","VOYAGER VAN","20240531","20200616","13455","gesloten opbouw","2","N.v.t.","N.v.t.","4","2776","2060","2790","2160","450",,"20140214","20140214","Geen verstrekking in Open Data","55765","Ja",,"730",,"1600","1600",,"0","4","0","0",,"522","200","N1",,,"r. op a. deurdorpel","2790","RT",,"e4*NKS*0045*00","L5DB9","C2MD1A","0","0.06","308","Nee","Nee",,"Nee","4390","0",,"2024","Logisch","00","Ja","2024-05-31T00:00:00.000","2020-06-16T00:00:00.000","2014-02-14T00:00:00.000","2014-02-14T00:00:00.000",,"0",,,,,,,,,,,,,,,,,,,,,,,,,,"https://opendata.rdw.nl/resource/3huj-srit.json","https://opendata.rdw.nl/resource/8ys7-d773.json","https://opendata.rdw.nl/resource/vezc-m2t6.json","https://opendata.rdw.nl/resource/jhie-znh9.json","https://opendata.rdw.nl/resource/kmfi-hrps.json"