"kenteken","voertuigsoort","merk","handelsbenaming","vervaldatum_apk","datum_tenaamstelling","bruto_bpm","inrichting","aantal_zitplaatsen","eerste_kleur","tweede_kleur","aantal_cilinders","cilinderinhoud","massa_ledig_voertuig","toegestane_maximum_massa_voertuig","massa_rijklaar","maximum_massa_trekken_ongeremd","maximum_trekken_massa_geremd","datum_eerste_toelating","datum_eerste_tenaamstelling_in_nederland","wacht_op_keuren","catalogusprijs","wam_verzekerd","maximale_constructiesnelheid","laadvermogen","oplegger_geremd","aanhangwagen_autonoom_geremd","aanhangwagen_middenas_geremd","aantal_staanplaatsen","aantal_deuren","aantal_wielen","afstand_hart_koppeling_tot_achterzijde_voertuig","afstand_voorzijde_voertuig_tot_hart_koppeling","afwijkende_maximum_snelheid","lengte","breedte","europese_voertuigcategorie","europese_voertuigcategorie_toevoeging","europese_uitvoeringcategorie_toevoeging","plaats_chassisnummer","technische_max_massa_voertuig","type","type_gasinstallatie","typegoedkeuringsnummer","variant","uitvoering","volgnummer_wijziging_eu_typegoedkeuring","vermogen_massarijklaar","wielbasis","export_indicator","openstaande_terugroepactie_indicator","vervaldatum_tachograaf","taxi_indicator","maximum_massa_samenstelling","aantal_rolstoelplaatsen","maximum_ondersteunende_snelheid","jaar_laatste_registratie_tellerstand","tellerstandoordeel","code_toelichting_tellerstandoordeel","tenaamstellen_mogelijk","vervaldatum_apk_dt","datum_tenaamstelling_dt","datum_eerste_toelating_dt","datum_eerste_tenaamstelling_in_nederland_dt","vervaldatum_tachograaf_dt","maximum_last_onder_de_vooras_sen_tezamen_koppeling","type_remsysteem_voertuig_code","rupsonderstelconfiguratiecode","wielbasis_voertuig_minimum","wielbasis_voertuig_maximum","lengte_voertuig_minimum","lengte_voertuig_maximum","breedte_voertuig_minimum","breedte_voertuig_maximum","hoogte_voertuig","hoogte_voertuig_minimum","hoogte_voertuig_maximum","massa_bedrijfsklaar_minimaal","massa_bedrijfsklaar_maximaal","technisch_toelaatbaar_massa_koppelpunt","maximum_massa_technisch_maximaal","maximum_massa_technisch_minimaal","subcategorie_nederland","verticale_belasting_koppelpunt_getrokken_voertuig","zuinigheidsclassificatie","registratie_datum_goedkeuring_afschrijvingsmoment_bpm","registratie_datum_goedkeuring_afschrijvingsmoment_bpm_dt","gem_lading_wrde","aerodyn_voorz","massa_alt_aandr","verl_cab_ind","api_gekentekende_voertuigen_assen","api_gekentekende_voertuigen_brandstof","api_gekentekende_voertuigen_carrosserie","api_gekentekende_voertuigen_carrosserie_specifiek","api_gekentekende_voertuigen_voertuigklasse"
"08ZFH9","Personenauto","LAMBORGHINI","AVENTADOR","20240802","20221013","107151","coupe","2","GRIJS","Niet geregistreerd","12","6498","1665","2100","1765",,,"20121019","20121019","Geen verstrekking in Open Data","459750","Ja","350",,,,,,"2","4",,,,"478","203","M1",,,,"2100","834",,,,,,"0.29","270","Nee","Ja",,"Nee",,,,"2023","Geen oordeel","05","Ja","2024-08-02T00:00:00.000","2022-10-13T00:00:00.000","2012-10-19T00:00:00.000","2012-10-19T00:00:00.000",,,,,,,,,,,"114",,,,,,,,,,"G","20211203","2021-12-03T00:00:00.000",,,,,"https://opendata.rdw.nl/resource/3huj-srit.json","https://opendata.rdw.nl/resource/8ys7-d773.json","https://opendata.rdw.nl/resource/vezc-m2t6.json","https://opendata.rdw.nl/resource/jhie-znh9.json","https://opendata.rdw.nl/resource/kmfi-hrps.json"
"2TJD38","Personenauto","LAMBORGHINI","AVENTADOR","20240228","20170929","95223","coupe","2","GROEN","Niet geregistreerd","12","6498","1665","2100","1765",,,"20140220","20140220","Geen verstrekking in Open Data","489259","Ja",,,,,,,"2","4","0","0",,"478","0","M1",,,"r. bodemplaat by voorzitting","2100","834",,"e3*KS07/46*0075*05","C","21AAC","0","0.29","270","Nee","Ja",,"Nee","0","0",,"2023","Logisch","00","Ja","2024-02-28T00:00:00.000","2017-09-29T00:00:00.000","2014-02-20T00:00:00.000","2014-02-20T00:00:00.000",,,,,,,,,,,,,,,,,,,,,"G",,,,,,,"https://opendata.rdw.nl/resource/3huj-srit.json","https://opendata.rdw.nl/resource/8ys7-d773.json","https://opendata.rdw.nl/resource/vezc-m2t6.json","https://opendata.rdw.nl/resource/jhie-znh9.json","https://opendata.rdw.nl/resource/kmfi-hrps.json"
"3TTH23","Personenauto","LAMBORGHINI","AVENTADOR","20241103","20240412","95223","coupe","2","ZWART","Niet geregistreerd","12","6498","1665","2100","1765",,,"20140509","20140509","Geen verstrekking in Open Data","458828","Ja",,,,,,,"2","4","0","0",,"478","0","M1",,,"r. bodemplaat by voorzitting","2100","834",,"e3*KS07/46*0075*04","C","21AAC","0","0.29","270","Nee","Ja",,"Nee","0","0",,"2024","Logisch","00","Ja","2024-11-03T00:00:00.000","2024-04-12T00:00:00.000","2014-05-09T00:00:00.000","2014-05-09T00:00:00.000",,,,,,,,,,,,,,,,,,,,,"G",,,,,,,"https://opendata.rdw.nl/resource/3huj-srit.json","https://opendata.rdw.nl/resource/8ys7-d773.json","https://opendata.rdw.nl/resource/vezc-m2t6.json","https://opendata.rdw.nl/resource/jhie-znh9.json","https://opendata.rdw.nl/resource/kmfi-hrps.json"
"5SXK80","Personenauto","LAMBORGHINI","AVENTADOR","20240814","20220207","72477","coupe","2","ZWART","Niet geregistreerd","12","6498","1665","2100","1765",,,"20130429","20140205","Geen verstrekking in Open Data","450688","Ja",,,,,,,"2","4",,,,,,"M1",,,"r. bodemplaat by voorzitting","2100","834",,,,,,"0.29","270","Nee","Ja",,"Nee",,,,"2023","Geen oordeel","05","Ja","2024-08-14T00:00:00.000","2022-02-07T00:00:00.000","2013-04-29T00:00:00.000","2014-02-05T00:00:00.000",,"0",,,,,,,,,,,,,,,,,,,,,,,,,,"https://opendata.rdw.nl/resource/3huj-srit.json","https://opendata.rdw.nl/resource/8ys7-d773.json","https://opendata.rdw.nl/resource/vezc-m2t6.json","https://opendata.rdw.nl/resource/jhie-znh9.json","https://opendata.rdw.nl/resource/kmfi-hrps.json"
"G860VR","Personenauto","LAMBORGHINI","AVENTADOR","20241220","20220909","94999","coupe","2","ZWART","Niet geregistreerd","12","6498","1753","2100","1853",,,"20150521","20200109","Geen verstrekking in Open Data","502000","Ja","350",,,,,,"2","4",,,,,,"M1",,,"r. bodemplaat by voorzitting","2100","834",,,,,,"0.28","270","Nee","Nee",,"Nee",,,,"2023","Geen oordeel","05","Ja","2024-12-20T00:00:00.000","2022-09-09T00:00:00.000","2015-05-21T00:00:00.000","2020-01-09T00:00:00.000",,,,,,,,,,,,,,,,,,,,,,,,,,,,"https://opendata.rdw.nl/resource/3huj-srit.json","https://opendata.rdw.nl/resource/8ys7-d773.json","https://opendata.rdw.nl/resource/vezc-m2t6.json","https://opendata.rdw.nl/resource/jhie-znh9.json","https://opendata.rdw.nl/resource/kmfi-hrps.json"
"H514FK","Personenauto","LAMBORGHINI","AVENTADOR","20240602","20200203","94999","coupe","2","GRIJS","Niet geregistreerd","12","6498","1665","2100","1765",,,"20130328","20200203","Geen verstrekking in Open Data","436306","Ja","350",,,,,,"2","4",,,,"478","203","M1",,,"r. bodemplaat by voorzitting","2100","834",,,,,,"0.29","270","Nee","Nee",,"Nee",,,,"2023","Geen oordeel","05","Ja","2024-06-02T00:00:00.000","2020-02-03T00:00:00.000","2013-03-28T00:00:00.000","2020-02-03T00:00:00.000",,,,,,,,,,,"114",,,,,,,,,,,,,,,,,"https://opendata.rdw.nl/resource/3huj-srit.json","https://opendata.rdw.nl/resource/8ys7-d773.json","https://opendata.rdw.nl/resource/vezc-m2t6.json","https://opendata.rdw.nl/resource/jhie-znh9.json","https://opendata.rdw.nl/resource/kmfi-hrps.json"
"H790SR","Personenauto","LAMBORGHINI","AVENTADOR","20240629","20230726","107151","coupe","2","WIT","Niet geregistreerd","12","6498","1665","2100","1765",,,"20120621","20200508","Geen verstrekking in Open Data","466200","Ja","350",,,,,,"2","4",,,,,,"M1",,,,"2100",,,,,,,"0.29","270","Nee","Nee",,"Nee",,,,"2023","Geen oordeel","05","Ja","2024-06-29T00:00:00.000","2023-07-26T00:00:00.000","2012-06-21T00:00:00.000","2020-05-08T00:00:00.000",,,,,,,,,,,,,,,,,,,,,,,,,,,,"https://opendata.rdw.nl/resource/3huj-srit.json","https://opendata.rdw.nl/resource/8ys7-d773.json","https://opendata.rdw.nl/resource/vezc-m2t6.json","https://opendata.rdw.nl/resource/jhie-znh9.json","https://opendata.rdw.nl/resource/kmfi-hrps.json"
"JD620H","Personenauto","LAMBORGHINI","AVENTADOR","20250307","20160211","106817","coupe","2","ORANJE","Niet geregistreerd","12","6498","1615","2050","1715",,,"20160211","20160211","Geen verstrekking in Open Data","524759","Ja",,,,,,,"2","4","0","0",,"484","203","M1",,,"in pers.ruimte v.","2050","834",,"e3*KS07/46*0075*08","F","21AFC","1","0.32","270","Nee","Ja",,"Nee","0","0","0.00","2024","Logisch","00","Ja","2025-03-07T00:00:00.000","2016-02-11T00:00:00.000","2016-02-11T00:00:00.000","2016-02-11T00:00:00.000",,,,,,,,,,,"114",,,,,,,,,,"G",,,,,,,"https://opendata.rdw.nl/resource/3huj-srit.json","https://opendata.rdw.nl/resource/8ys7-d773.json","https://opendata.rdw.nl/resource/vezc-m2t6.json","https://opendata.rdw.nl/resource/jhie-znh9.json","https://opendata.rdw.nl/resource/kmfi-hrps.json"
"JK168J","Personenauto","LAMBORGHINI","AVENTADOR","20240807","20160407","85642","coupe","2","GROEN","Niet geregistreerd","12","6498","1665","2100","1765",,,"20140807","20160407","Geen verstrekking in Open Data","474841","Ja",,,,,,,"2","4","0","0",,"478","0","M1",,,"r. bodemplaat by voorzitting","2100","834",,"e3*KS07/46*0075*07","C","21AAC","0","0.29","270","Nee","Ja",,"Nee","0","0","0.00","2023","Geen oordeel","05","Ja","2024-08-07T00:00:00.000","2016-04-07T00:00:00.000","2014-08-07T00:00:00.000","2016-04-07T00:00:00.000",,,,,,,,,,,,,,,,,,,,,"G",,,,,,,"https://opendata.rdw.nl/resource/3huj-srit.json","https://opendata.rdw.nl/resource/8ys7-d773.json","https://opendata.rdw.nl/resource/vezc-m2t6.json","https://opendata.rdw.nl/resource/jhie-znh9.json","https://opendata.rdw.nl/resource/kmfi-hrps.json"
"JK962F","Personenauto","LAMBORGHINI","AVENTADOR","20220414","20210521","106817","coupe","2","BLAUW","Niet geregistreerd","12","6498","1615","2050","1715",,,"20160414","20160414","Geen verstrekking in Open Data","551976","Ja",,,,,,,"2","4","0","0",,"484","203","M1",,,"in bodemplaat r. v.","2050","834",,"e3*KS07/46*0075*08","F","21AFC","1","0.32","270","Nee","Ja",,"Nee","0","0","0.00","2021","Logisch","00","Ja","2022-04-14T00:00:00.000","2021-05-21T00:00:00.000","2016-04-14T00:00:00.000","2016-04-14T00:00:00.000",,,,,,,,,,,"114",,,,,,,,,,"G",,,,,,,"https://opendata.rdw.nl/resource/3huj-srit.json","https://opendata.rdw.nl/resource/8ys7-d773.json","https://opendata.rdw.nl/resource/vezc-m2t6.json","https://opendata.rdw.nl/resource/jhie-znh9.json","https://opendata.rdw.nl/resource/kmfi-hrps.json"
"K159PV","Personenauto","LAMBORGHINI","AVENTADOR (SIAN)","20250201","20210201","130238","coupe","2","BLAUW","Niet geregistreerd","12","6498","1680","2100","1780",,,"20210201","20210201","Geen verstrekking in Open Data","2659138","Ja","356",,,,,,"2","4",,,,"498","208","M1",,,,"2100","834",,"e3*KS07/46*0075*15","J","21AIC","0","0.32","270","Nee","Nee",,"Nee",,,,"2021","Logisch","00","Ja","2025-02-01T00:00:00.000","2021-02-01T00:00:00.000","2021-02-01T00:00:00.000","2021-02-01T00:00:00.000",,,,,,,,,,,"113",,,,,,,,,,"G",,,,,,,"https://opendata.rdw.nl/resource/3huj-srit.json","https://opendata.rdw.nl/resource/8ys7-d773.json","https://opendata.rdw.nl/resource/vezc-m2t6.json","https://opendata.rdw.nl/resource/jhie-znh9.json","https://opendata.rdw.nl/resource/kmfi-hrps.json"
"K366SV","Personenauto","LAMBORGHINI","AVENTADOR","20250225","20210303","107151","coupe","2","GRIJS","Niet geregistreerd","12","6498","1665","2100","1765",,,"20150324","20210303","Geen verstrekking in Open Data","423735","Ja","350",,,,,,"2","4",,,,"478","203","M1",,,"r. bodemplaat by voorzitting","2100","834",,"e3*KS07/46*0075*07","C","21AAB","1","0.29","270","Nee","Nee",,"Nee",,,,"2024","Geen oordeel","05","Ja","2025-02-25T00:00:00.000","2021-03-03T00:00:00.000","2015-03-24T00:00:00.000","2021-03-03T00:00:00.000",,,,,,,,,,,"114",,,,,,,,,,"G",,,,,,,"https://opendata.rdw.nl/resource/3huj-srit.json","https://opendata.rdw.nl/resource/8ys7-d773.json","https://opendata.rdw.nl/resource/vezc-m2t6.json","https://opendata.rdw.nl/resource/jhie-znh9.json","https://opendata.rdw.nl/resource/kmfi-hrps.json"
"L089XZ","Personenauto","LAMBORGHINI","AVENTADOR","20241005","20210820","94998","coupe","2","ROOD","Niet geregistreerd","12","6498","1615","2050","1715",,,"20150804","20210820","Geen verstrekking in Open Data","494904","Ja","351",,,,,,"2","4",,,,,,"M1",,,,"2050","834",,,,,,"0.32","270","Nee","Nee",,"Nee",,,,"2023","Geen oordeel","05","Ja","2024-10-05T00:00:00.000","2021-08-20T00:00:00.000","2015-08-04T00:00:00.000","2021-08-20T00:00:00.000",,,,,,,,,,,,,,,,,,,,,,,,,,,,"https://opendata.rdw.nl/resource/3huj-srit.json","https://opendata.rdw.nl/resource/8ys7-d773.json","https://opendata.rdw.nl/resource/vezc-m2t6.json","https://opendata.rdw.nl/resource/jhie-znh9.json","https://opendata.rdw.nl/resource/kmfi-hrps.json"
"L192KG","Personenauto","LAMBORGHINI","AVENTADOR","20240610","20210612","107151","coupe","2","ORANJE","Niet geregistreerd","12","6498","1665","2100","1765",,,"20121031","20210612","Geen verstrekking in Open Data","478530","Ja","350",,,,,,"2","4",,,,"478","203","M1",,,,"2100","834",,,,,,"0.29","270","Nee","Nee",,"Nee",,,,"2023","Geen oordeel","05","Ja","2024-06-10T00:00:00.000","2021-06-12T00:00:00.000","2012-10-31T00:00:00.000","2021-06-12T00:00:00.000",,,,,,,,,,,"114",,,,,,,,,,,,,,,,,"https://opendata.rdw.nl/resource/3huj-srit.json","https://opendata.rdw.nl/resource/8ys7-d773.json","https://opendata.rdw.nl/resource/vezc-m2t6.json","https://opendata.rdw.nl/resource/jhie-znh9.json","https://opendata.rdw.nl/resource/kmfi-hrps.json"
"L611ZD","Personenauto","LAMBORGHINI","AVENTADOR","20240727","20210920","94999","coupe","2","GROEN","Niet geregistreerd","12","6498","1665","2100","1765",,,"20140807","20210920","Geen verstrekking in Open Data","434023","Ja","350",,,,,,"2","4",,,,"478","203","M1",,,"r. bodemplaat by voorzitting","2100","834",,,,,,"0.29","270","Nee","Nee",,"Nee",,,,"2023","Geen oordeel","05","Ja","2024-07-27T00:00:00.000","2021-09-20T00:00:00.000","2014-08-07T00:00:00.000","2021-09-20T00:00:00.000",,,,,,,,,,,"114",,,,,,,,,,,,,,,,,"https://opendata.rdw.nl/resource/3huj-srit.json","https://opendata.rdw.nl/resource/8ys7-d773.json","https://opendata.rdw.nl/resource/vezc-m2t6.json","https://opendata.rdw.nl/resource/jhie-znh9.json","https://opendata.rdw.nl/resource/kmfi-hrps.json"
"N280XS","Personenauto","LAMBORGHINI","AVENTADOR","20250209","20211231","94997","coupe","2","ORANJE","Niet geregistreerd","12","6498","1665","2100","1765",,,"20150311","20211231","Geen verstrekking in Open Data","422000","Ja","350",,,,,,"2","4","0","0",,"478","203","M1",,,"r. bodemplaat by voorzitting","2100","834",,"e3*KS07/46*0075*07","C","21AAC","0","0.29","270","Nee","Nee",,"Nee","0","0","0.00","2024","Geen oordeel","05","Ja","2025-02-09T00:00:00.000","2021-12-31T00:00:00.000","2015-03-11T00:00:00.000","2021-12-31T00:00:00.000",,,,,,,,,,,"114",,,,,,,,,,,"20211228","2021-12-28T00:00:00.000",,,,,"https://opendata.rdw.nl/resource/3huj-srit.json","https://opendata.rdw.nl/resource/8ys7-d773.json","https://opendata.rdw.nl/resource/vezc-m2t6.json","https://opendata.rdw.nl/resource/jhie-znh9.json","https://opendata.rdw.nl/resource/kmfi-hrps.json"
"NZ004X","Personenauto","LAMBORGHINI","AVENTADOR","20250330","20210330","94999","coupe","2","GROEN","Niet geregistreerd","12","6498","1665","2100","1765",,,"20130305","20190124","Geen verstrekking in Open Data","434370","Ja",,,,,,,"2","4",,,,,,"M1",,,"r. bodemplaat by voorzitting","2100","834",,,,,,"0.29","270","Nee","Nee",,"Nee",,,,"2024","Geen oordeel","05","Ja","2025-03-30T00:00:00.000","2021-03-30T00:00:00.000","2013-03-05T00:00:00.000","2019-01-24T00:00:00.000",,,,,,,,,,,,,,,,,,,,,,,,,,,,"https://opendata.rdw.nl/resource/3huj-srit.json","https://opendata.rdw.nl/resource/8ys7-d773.json","https://opendata.rdw.nl/resource/vezc-m2t6.json","https://opendata.rdw.nl/resource/jhie-znh9.json","https://opendata.rdw.nl/resource/kmfi-hrps.json"
"P820LH","Personenauto","LAMBORGHINI","AVENTADOR (COUNTACH)","20260412","20220412","133341","coupe","2","WIT","Niet geregistreerd","12","6498","1680","2100","1780",,,"20220412","20220412","Geen verstrekking in Open Data","2662241","Ja","355",,,,,,"2","4",,,,"487","210","M1",,,,"2100","834",,"e3*KS07/46*0075*20","A","21AMC","0","0.32","270","Nee","Nee",,"Nee",,,,"2022","Logisch","00","Ja","2026-04-12T00:00:00.000","2022-04-12T00:00:00.000","2022-04-12T00:00:00.000","2022-04-12T00:00:00.000",,,,,,,,,,,"114",,,,,,,,,,"G","20220411","2022-04-11T00:00:00.000",,,,,"https://opendata.rdw.nl/resource/3huj-srit.json","https://opendata.rdw.nl/resource/8ys7-d773.json","https://opendata.rdw.nl/resource/vezc-m2t6.json","https://opendata.rdw.nl/resource/jhie-znh9.json","https://opendata.rdw.nl/resource/kmfi-hrps.json"
"PD844S","Personenauto","LAMBORGHINI","AVENTADOR","20250602","20240214","106817","coupe","2","WIT","Niet geregistreerd","12","6498","1615","2050","1715",,,"20160413","20170615","Geen verstrekking in Open Data","512288","Ja",,,,,,,"2","4",,,,,,"M1",,,"r. bodemplaat by voorzitting","2050","834",,,,,,"0.32","270","Nee","Nee",,"Nee",,,,"2024","Geen oordeel","05","Ja","2025-06-02T00:00:00.000","2024-02-14T00:00:00.000","2016-04-13T00:00:00.000","2017-06-15T00:00:00.000",,,,,,,,,,,,,,,,,,,,,,,,,,,,"https://opendata.rdw.nl/resource/3huj-srit.json","https://opendata.rdw.nl/resource/8ys7-d773.json","https://opendata.rdw.nl/resource/vezc-m2t6.json","https://opendata.rdw.nl/resource/jhie-znh9.json","https://opendata.rdw.nl/resource/kmfi-hrps.json"
"PK321S","Personenauto","LAMBORGHINI","AVENTADOR","20240901","20170805","120815","coupe","2","GRIJS","Niet geregistreerd","12","6498","1665","2100","1765",,,"20170805","20170805","Geen verstrekking in Open Data","517641","Ja",,,,,,,"2","4",,,,"480","203","M1",,,"in bodemplaat r. v.","2100","834",,"e3*KS07/46*0075*10","G","21ACC","0","0.31","270","Nee","Nee",,"Nee",,,,"2022","Logisch","00","Ja","2024-09-01T00:00:00.000","2017-08-05T00:00:00.000","2017-08-05T00:00:00.000","2017-08-05T00:00:00.000",,,,,,,,,,,"114",,,,,,,,,,"G",,,,,,,"https://opendata.rdw.nl/resource/3huj-srit.json","https://opendata.rdw.nl/resource/8ys7-d773.json","https://opendata.rdw.nl/resource/vezc-m2t6.json","https://opendata.rdw.nl/resource/jhie-znh9.json","https://opendata.rdw.nl/resource/kmfi-hrps.json"
"PK563V","Personenauto","LAMBORGHINI","AVENTADOR","20250721","20170721","109415","coupe","2","GEEL","Niet geregistreerd","12","6498","1610","2050","1710",,,"20170721","20170721","Geen verstrekking in Open Data","2226915","Ja",,,,,,,"2","4",,,,"492","270","M1",,,"in bodemplaat r. v.","2050","834",,"e3*KS07/46*0075*10","Y","21AGC","0","0.33","270","Nee","Nee",,"Nee",,,,"2023","Logisch","00","Ja","2025-07-21T00:00:00.000","2017-07-21T00:00:00.000","2017-07-21T00:00:00.000","2017-07-21T00:00:00.000",,,,,,,,,,,"114",,,,,,,,,,"G",,,,,,,"https://opendata.rdw.nl/resource/3huj-srit.json","https://opendata.rdw.nl/resource/8ys7-d773.json","https://opendata.rdw.nl/resource/vezc-m2t6.json","https://opendata.rdw.nl/resource/jhie-znh9.json","https://opendata.rdw.nl/resource/kmfi-hrps.json"
"RF554S","Personenauto","LAMBORGHINI","AVENTADOR","20241115","20200722","94999","coupe","2","ZWART","Niet geregistreerd","12","6498","1665","2100","1765",,,"20121213","20171103","Geen verstrekking in Open Data","444099","Ja",,,,,,,"2","4",,,,,,"M1",,,"by voorzitting r. bodemplaat","2100","834",,,,,,"0.29","270","Nee","Nee",,"Nee",,,,"2023","Geen oordeel","05","Ja","2024-11-15T00:00:00.000","2020-07-22T00:00:00.000","2012-12-13T00:00:00.000","2017-11-03T00:00:00.000",,,,,,,,,,,,,,,,,,,,,,,,,,,,"https://opendata.rdw.nl/resource/3huj-srit.json","https://opendata.rdw.nl/resource/8ys7-d773.json","https://opendata.rdw.nl/resource/vezc-m2t6.json","https://opendata.rdw.nl/resource/jhie-znh9.json","https://opendata.rdw.nl/resource/kmfi-hrps.json"
"RR296J","Personenauto","LAMBORGHINI","AVENTADOR","20240727","20230911","53725","coupe","2","ORANJE","Niet geregistreerd","12","6498","1665","2100","1765",,,"20130418","20171230","Geen verstrekking in Open Data","447559","Ja",,,,,,,"2","4","0","0",,"478","0","M1",,,"r. bodemplaat by voorzitting","2100","834",,"e3*KS07/46*0075*02","C","21AAB","0","0.29","270","Nee","Nee",,"Nee","0","0",,"2024","Geen oordeel","05","Ja","2024-07-27T00:00:00.000","2023-09-11T00:00:00.000","2013-04-18T00:00:00.000","2017-12-30T00:00:00.000",,,,,,,,,,,,,,,,,,,,,"G",,,,,,,"https://opendata.rdw.nl/resource/3huj-srit.json","https://opendata.rdw.nl/resource/8ys7-d773.json","https://opendata.rdw.nl/resource/vezc-m2t6.json","https://opendata.rdw.nl/resource/jhie-znh9.json","https://opendata.rdw.nl/resource/kmfi-hrps.json"
"SK266G","Personenauto","LAMBORGHINI","AVENTADOR","20260503","20210702","118849","coupe","2","GRIJS","Niet geregistreerd","12","6498","1665","2100","1765",,,"20180430","20180430","Geen verstrekking in Open Data","510956","Ja",,,,,,,"2","4",,,,"480","203","M1",,,,"2100","834",,"e3*KS07/46*0075*10","G","21ACC","1","0.31","270","Nee","Nee",,"Nee",,,,"2024","Logisch","00","Ja","2026-05-03T00:00:00.000","2021-07-02T00:00:00.000","2018-04-30T00:00:00.000","2018-04-30T00:00:00.000",,,,,,,,,,,"114",,,,,,,,,,"G",,,,,,,"https://opendata.rdw.nl/resource/3huj-srit.json","https://opendata.rdw.nl/resource/8ys7-d773.json","https://opendata.rdw.nl/resource/vezc-m2t6.json","https://opendata.rdw.nl/resource/jhie-znh9.json","https://opendata.rdw.nl/resource/kmfi-hrps.json"
"TD609R","Personenauto","LAMBORGHINI","AVENTADOR","20240828","20240517","106817","coupe","2","GEEL","ZWART","12","6498","1615","2050","1715",,,"20160510","20180716","Geen verstrekking in Open Data","508658","Ja",,,,,,,"2","4","0","0",,"484","0","M1",,,"r. bodemplaat by voorzitting","2050","834",,"e3*KS07/46*0075*08","F","21AFC","0","0.32","270","Nee","Nee",,"Nee","0","0","0.00","2024","Geen oordeel","05","Ja","2024-08-28T00:00:00.000","2024-05-17T00:00:00.000","2016-05-10T00:00:00.000","2018-07-16T00:00:00.000",,,,,,,,,,,,,,,,,,,,,"G",,,,,,,"https://opendata.rdw.nl/resource/3huj-srit.json","https://opendata.rdw.nl/resource/8ys7-d773.json","https://opendata.rdw.nl/resource/vezc-m2t6.json","https://opendata.rdw.nl/resource/jhie-znh9.json","https://opendata.rdw.nl/resource/kmfi-hrps.json"
"TF597G","Personenauto","LAMBORGHINI","AVENTADOR","20250601","20180802","91651","coupe","2","GROEN","Niet geregistreerd","12","6498","1615","2050","1715",,,"20160601","20180802","Geen verstrekking in Open Data","518822","Ja",,,,,,,"2","4","0","0",,"484","0","M1",,,"r. bodemplaat by voorzitting","2050","834",,"e3*KS07/46*0075*08","F","21AFC","0","0.32","270","Nee","Nee",,"Nee","0","0","0.00","2024","Geen oordeel","05","Ja","2025-06-01T00:00:00.000","2018-08-02T00:00:00.000","2016-06-01T00:00:00.000","2018-08-02T00:00:00.000",,,,,,,,,,,,,,,,,,,,,"G",,,,,,,"https://opendata.rdw.nl/resource/3huj-srit.json","https://opendata.rdw.nl/resource/8ys7-d773.json","https://opendata.rdw.nl/resource/vezc-m2t6.json","https://opendata.rdw.nl/resource/jhie-znh9.json","https://opendata.rdw.nl/resource/kmfi-hrps.json"
"TZ515L","Personenauto","LAMBORGHINI","AVENTADOR","20240807","20210813","85743","coupe","2","ZWART","Niet geregistreerd","12","6498","1665","2100","1765",,,"20120227","20181124","Geen verstrekking in Open Data","118713","Ja",,,,,,,"2","4",,,,,,"M1",,,,"2100","834",,,,,,"0.29","270","Nee","Nee",,"Nee",,,,"2023","Geen oordeel","05","Ja","2024-08-07T00:00:00.000","2021-08-13T00:00:00.000","2012-02-27T00:00:00.000","2018-11-24T00:00:00.000",,,,,,,,,,,,,,,,,,,,,,,,,,,,"https://opendata.rdw.nl/resource/3huj-srit.json","https://opendata.rdw.nl/resource/8ys7-d773.json","https://opendata.rdw.nl/resource/vezc-m2t6.json","https://opendata.rdw.nl/resource/jhie-znh9.json","https://opendata.rdw.nl/resource/kmfi-hrps.json"