"kenteken","voertuigsoort","merk","handelsbenaming","vervaldatum_apk","datum_tenaamstelling","bruto_bpm","inrichting","aantal_zitplaatsen","eerste_kleur","tweede_kleur","aantal_cilinders","cilinderinhoud","massa_ledig_voertuig","toegestane_maximum_massa_voertuig","massa_rijklaar","maximum_massa_trekken_ongeremd","maximum_trekken_massa_geremd","datum_eerste_toelating","datum_eerste_tenaamstelling_in_nederland","wacht_op_keuren","catalogusprijs","wam_verzekerd","maximale_constructiesnelheid","laadvermogen","oplegger_geremd","aanhangwagen_autonoom_geremd","aanhangwagen_middenas_geremd","aantal_staanplaatsen","aantal_deuren","aantal_wielen","afstand_hart_koppeling_tot_achterzijde_voertuig","afstand_voorzijde_voertuig_tot_hart_koppeling","afwijkende_maximum_snelheid","lengte","breedte","europese_voertuigcategorie","europese_voertuigcategorie_toevoeging","europese_uitvoeringcategorie_toevoeging","plaats_chassisnummer","technische_max_massa_voertuig","type","type_gasinstallatie","typegoedkeuringsnummer","variant","uitvoering","volgnummer_wijziging_eu_typegoedkeuring","vermogen_massarijklaar","wielbasis","export_indicator","openstaande_terugroepactie_indicator","vervaldatum_tachograaf","taxi_indicator","maximum_massa_samenstelling","aantal_rolstoelplaatsen","maximum_ondersteunende_snelheid","jaar_laatste_registratie_tellerstand","tellerstandoordeel","code_toelichting_tellerstandoordeel","tenaamstellen_mogelijk","vervaldatum_apk_dt","datum_tenaamstelling_dt","datum_eerste_toelating_dt","datum_eerste_tenaamstelling_in_nederland_dt","vervaldatum_tachograaf_dt","maximum_last_onder_de_vooras_sen_tezamen_koppeling","type_remsysteem_voertuig_code","rupsonderstelconfiguratiecode","wielbasis_voertuig_minimum","wielbasis_voertuig_maximum","lengte_voertuig_minimum","lengte_voertuig_maximum","breedte_voertuig_minimum","breedte_voertuig_maximum","hoogte_voertuig","hoogte_voertuig_minimum","hoogte_voertuig_maximum","massa_bedrijfsklaar_minimaal","massa_bedrijfsklaar_maximaal","technisch_toelaatbaar_massa_koppelpunt","maximum_massa_technisch_maximaal","maximum_massa_technisch_minimaal","subcategorie_nederland","verticale_belasting_koppelpunt_getrokken_voertuig","zuinigheidsclassificatie","registratie_datum_goedkeuring_afschrijvingsmoment_bpm","registratie_datum_goedkeuring_afschrijvingsmoment_bpm_dt","gem_lading_wrde","aerodyn_voorz","massa_alt_aandr","verl_cab_ind","api_gekentekende_voertuigen_assen","api_gekentekende_voertuigen_brandstof","api_gekentekende_voertuigen_carrosserie","api_gekentekende_voertuigen_carrosserie_specifiek","api_gekentekende_voertuigen_voertuigklasse"
"1TZV34","Personenauto","KIA","KIA PICANTO","20250402","20180707","1212","hatchback","5","BLAUW","Niet geregistreerd","4","999","885","1350","985",,"700","20060627","20140908","Geen verstrekking in Open Data",,"Ja",,,,,,,"4","4",,,,,,"M1",,,"r. dwarsbalk by voorzitting","1350",,,,,,,"0.05","237","Nee","Nee",,"Nee","2050",,,"2024","Geen oordeel","05","Ja","2025-04-02T00:00:00.000","2018-07-07T00:00:00.000","2006-06-27T00:00:00.000","2014-09-08T00:00:00.000",,"0",,,,,,,,,,,,,,,,,,,,,,,,,,"https://opendata.rdw.nl/resource/3huj-srit.json","https://opendata.rdw.nl/resource/8ys7-d773.json","https://opendata.rdw.nl/resource/vezc-m2t6.json","https://opendata.rdw.nl/resource/jhie-znh9.json","https://opendata.rdw.nl/resource/kmfi-hrps.json"
"2SJR13","Personenauto","KIA","KIA PICANTO","20250325","20220924","1975","hatchback","5","BLAUW","Niet geregistreerd","4","1086","836","1350","936","400","700","20060515","20131009","Geen verstrekking in Open Data",,"Ja",,,,,,,"4","4",,,,,,"M1",,,"op dwarsbalk by r. voorzitting","1350","BA",,,,,,"0.05","237","Nee","Nee",,"Nee","2050",,,"2024","Geen oordeel","05","Ja","2025-03-25T00:00:00.000","2022-09-24T00:00:00.000","2006-05-15T00:00:00.000","2013-10-09T00:00:00.000",,"0",,,,,,,,,,,,,,,,,,,,,,,,,,"https://opendata.rdw.nl/resource/3huj-srit.json","https://opendata.rdw.nl/resource/8ys7-d773.json","https://opendata.rdw.nl/resource/vezc-m2t6.json","https://opendata.rdw.nl/resource/jhie-znh9.json","https://opendata.rdw.nl/resource/kmfi-hrps.json"
"4SRP52","Personenauto","KIA","KIA PICANTO","20241018","20240110","1225","hatchback","5","GRIJS","Niet geregistreerd","4","1086","836","1350","936","400","700","20040310","20131128","Geen verstrekking in Open Data",,"Ja",,,,,,,"4","4",,,,,,"M1",,,"r. dwarsbalk v. voorzitting","1350",,,,,,,"0.05","237","Nee","Nee",,"Nee",,,,"2023","Geen oordeel","05","Ja","2024-10-18T00:00:00.000","2024-01-10T00:00:00.000","2004-03-10T00:00:00.000","2013-11-28T00:00:00.000",,"0",,,,,,,,,,,,,,,,,,,,,,,,,,"https://opendata.rdw.nl/resource/3huj-srit.json","https://opendata.rdw.nl/resource/8ys7-d773.json","https://opendata.rdw.nl/resource/vezc-m2t6.json","https://opendata.rdw.nl/resource/jhie-znh9.json","https://opendata.rdw.nl/resource/kmfi-hrps.json"
"6XHR14","Personenauto","KIA","KIA PICANTO","20240806","20140809","1290","hatchback","5","BLAUW","Niet geregistreerd","4","1086","836","1350","936","400","700","20060313","20140809","Geen verstrekking in Open Data",,"Ja",,,,,,,"4","4",,,,,,"M1",,,"r. voorzitting","1350",,,,,,,"0.05","237","Nee","Nee",,"Nee",,,,"2024","Geen oordeel","05","Ja","2024-08-06T00:00:00.000","2014-08-09T00:00:00.000","2006-03-13T00:00:00.000","2014-08-09T00:00:00.000",,"0",,,,,,,,,,,,,,,,,,,,,,,,,,"https://opendata.rdw.nl/resource/3huj-srit.json","https://opendata.rdw.nl/resource/8ys7-d773.json","https://opendata.rdw.nl/resource/vezc-m2t6.json","https://opendata.rdw.nl/resource/jhie-znh9.json","https://opendata.rdw.nl/resource/kmfi-hrps.json"
"7KVP46","Personenauto","KIA","KIA PICANTO","20241024","20211224","617","hatchback","5","GRIJS","Niet geregistreerd","4","1086","885","1350","985",,"700","20041223","20130727","Geen verstrekking in Open Data",,"Ja",,,,,,,"4","4",,,,,,"M1",,,"r. dwarsbalk onder voorzitting","1350",,,,,,,"0.05","237","Nee","Nee",,"Nee","2050",,,"2023","Geen oordeel","05","Ja","2024-10-24T00:00:00.000","2021-12-24T00:00:00.000","2004-12-23T00:00:00.000","2013-07-27T00:00:00.000",,"0",,,,,,,,,,,,,,,,,,,,,,,,,,"https://opendata.rdw.nl/resource/3huj-srit.json","https://opendata.rdw.nl/resource/8ys7-d773.json","https://opendata.rdw.nl/resource/vezc-m2t6.json","https://opendata.rdw.nl/resource/jhie-znh9.json","https://opendata.rdw.nl/resource/kmfi-hrps.json"
"8XJK40","Personenauto","KIA","KIA PICANTO","20240906","20170304","1317","hatchback","5","ZWART","Niet geregistreerd","4","1086","912","1350","1012","400","700","20070214","20140814","Geen verstrekking in Open Data",,"Ja",,,,,,,"4","4",,,,,,"M1",,,"r. by voorzitting","1350",,,,,,,"0.05","238","Nee","Nee",,"Nee",,,,"2023","Onlogisch","04","Ja","2024-09-06T00:00:00.000","2017-03-04T00:00:00.000","2007-02-14T00:00:00.000","2014-08-14T00:00:00.000",,"0",,,,,,,,,,,,,,,,,,,,,,,,,,"https://opendata.rdw.nl/resource/3huj-srit.json","https://opendata.rdw.nl/resource/8ys7-d773.json","https://opendata.rdw.nl/resource/vezc-m2t6.json","https://opendata.rdw.nl/resource/jhie-znh9.json","https://opendata.rdw.nl/resource/kmfi-hrps.json"
"G100VZ","Personenauto","KIA","KIA PICANTO,KIA SA","20241216","20220216",,"hatchback","5","GRIJS","Niet geregistreerd","4","1086","836","1350","936","400","700","20060120","20200225","Geen verstrekking in Open Data",,"Ja","154",,,,,,"4","4",,,,,,"M1",,,,"1350","BA",,,,,,"0.05","237","Nee","Nee",,"Nee",,,,"2023","Geen oordeel","05","Ja","2024-12-16T00:00:00.000","2022-02-16T00:00:00.000","2006-01-20T00:00:00.000","2020-02-25T00:00:00.000",,,,,,,,,,,,,,,,,,,,,,,,,,,,"https://opendata.rdw.nl/resource/3huj-srit.json","https://opendata.rdw.nl/resource/8ys7-d773.json","https://opendata.rdw.nl/resource/vezc-m2t6.json","https://opendata.rdw.nl/resource/jhie-znh9.json","https://opendata.rdw.nl/resource/kmfi-hrps.json"
"G765NZ","Personenauto","KIA","KIA PICANTO,KIA SA","20241209","20211209","1329","hatchback","5","GRIJS","Niet geregistreerd","4","1086","912","1350","1012","400","700","20050929","20191115","Geen verstrekking in Open Data",,"Ja","154",,,,,,"4","4",,,,,,"M1",,,"r. bodemplaat by voorzitting","1350",,,,,,,"0.05","235","Nee","Nee",,"Nee",,,,"2023","Geen oordeel","05","Ja","2024-12-09T00:00:00.000","2021-12-09T00:00:00.000","2005-09-29T00:00:00.000","2019-11-15T00:00:00.000",,,,,,,,,,,,,,,,,,,,,,,,,,,,"https://opendata.rdw.nl/resource/3huj-srit.json","https://opendata.rdw.nl/resource/8ys7-d773.json","https://opendata.rdw.nl/resource/vezc-m2t6.json","https://opendata.rdw.nl/resource/jhie-znh9.json","https://opendata.rdw.nl/resource/kmfi-hrps.json"
"GD001X","Personenauto","KIA","KIA PICANTO","20250106","20230107","998","hatchback","5","BLAUW","Niet geregistreerd","4","1086","836","1350","936","400","700","20051028","20150429","Geen verstrekking in Open Data",,"Ja",,,,,,,"4","4",,,,,,"M1",,,"r. v. voorzitting","1350",,,,,,,"0.05","235","Nee","Nee",,"Nee",,,,"2024","Geen oordeel","05","Ja","2025-01-06T00:00:00.000","2023-01-07T00:00:00.000","2005-10-28T00:00:00.000","2015-04-29T00:00:00.000",,,,,,,,,,,,,,,,,,,,,,,,,,,,"https://opendata.rdw.nl/resource/3huj-srit.json","https://opendata.rdw.nl/resource/8ys7-d773.json","https://opendata.rdw.nl/resource/vezc-m2t6.json","https://opendata.rdw.nl/resource/jhie-znh9.json","https://opendata.rdw.nl/resource/kmfi-hrps.json"
"JD331H","Personenauto","KIA","KIA PICANTO","20250213","20200208","1191","hatchback","5","ORANJE","Niet geregistreerd","4","1086","850","1350","950","400","700","20041122","20160604","Geen verstrekking in Open Data",,"Ja",,,,,,,"4","4",,,,,,"M1",,,"onder voorzitting r.","1350","BA",,,,,,"0.05","236","Nee","Nee",,"Nee",,,,"2024","Geen oordeel","05","Ja","2025-02-13T00:00:00.000","2020-02-08T00:00:00.000","2004-11-22T00:00:00.000","2016-06-04T00:00:00.000",,,,,,,,,,,,,,,,,,,,,,,,,,,,"https://opendata.rdw.nl/resource/3huj-srit.json","https://opendata.rdw.nl/resource/8ys7-d773.json","https://opendata.rdw.nl/resource/vezc-m2t6.json","https://opendata.rdw.nl/resource/jhie-znh9.json","https://opendata.rdw.nl/resource/kmfi-hrps.json"
"JD407J","Personenauto","KIA","KIA PICANTO,KIA SA","20250216","20220125","1191","hatchback","5","BLAUW","Niet geregistreerd","4","1086","836","1350","936","400","700","20041229","20160217","Geen verstrekking in Open Data",,"Ja",,,,,,,"4","4",,,,,,"M1",,,"by r. voorzitting","1350",,,,,,,"0.05","237","Nee","Nee",,"Nee",,,,"2024","Geen oordeel","05","Ja","2025-02-16T00:00:00.000","2022-01-25T00:00:00.000","2004-12-29T00:00:00.000","2016-02-17T00:00:00.000",,,,,,,,,,,,,,,,,,,,,,,,,,,,"https://opendata.rdw.nl/resource/3huj-srit.json","https://opendata.rdw.nl/resource/8ys7-d773.json","https://opendata.rdw.nl/resource/vezc-m2t6.json","https://opendata.rdw.nl/resource/jhie-znh9.json","https://opendata.rdw.nl/resource/kmfi-hrps.json"
"K335NJ","Personenauto","KIA","KIA PICANTO","20230602","20230306","310","hatchback","5","ORANJE","Niet geregistreerd","4","1086","836","1350","936","400","700","20050629","20210514","Geen verstrekking in Open Data",,"Ja","154",,,,,,"4","4",,,,,,"M1",,,,"1350",,,,,,,"0.05","237","Nee","Nee",,"Nee","2050",,,"2023","Geen oordeel","05","Ja","2023-06-02T00:00:00.000","2023-03-06T00:00:00.000","2005-06-29T00:00:00.000","2021-05-14T00:00:00.000",,,,,,,,,,,,,,,,,,,,,,,,,,,,"https://opendata.rdw.nl/resource/3huj-srit.json","https://opendata.rdw.nl/resource/8ys7-d773.json","https://opendata.rdw.nl/resource/vezc-m2t6.json","https://opendata.rdw.nl/resource/jhie-znh9.json","https://opendata.rdw.nl/resource/kmfi-hrps.json"
"KP836F","Personenauto","KIA","KIA PICANTO, KIA SA","20241025","20210624","1120","hatchback","5","ORANJE","Niet geregistreerd","4","1086","912","1350","1012","400","700","20070214","20161027","Geen verstrekking in Open Data",,"Ja",,,,,,,"4","4",,,,,,"M1",,,"r. bodemplaat by voorzitting","1350","BA",,,,,,"0.05","236","Nee","Nee",,"Nee","2050",,,"2023","Niet geregistreerd","NG","Ja","2024-10-25T00:00:00.000","2021-06-24T00:00:00.000","2007-02-14T00:00:00.000","2016-10-27T00:00:00.000",,,,,,,,,,,,,,,,,,,,,,,,,,,,"https://opendata.rdw.nl/resource/3huj-srit.json","https://opendata.rdw.nl/resource/8ys7-d773.json","https://opendata.rdw.nl/resource/vezc-m2t6.json","https://opendata.rdw.nl/resource/jhie-znh9.json","https://opendata.rdw.nl/resource/kmfi-hrps.json"
"KS571F","Personenauto","KIA","KIA PICANTO, KIA SA","20240714","20240508","519","hatchback","5","BLAUW","Niet geregistreerd","4","1086","912","1350","1012","400","700","20061205","20161118","Geen verstrekking in Open Data",,"Ja",,,,,,,"4","4",,,,,,"M1",,,"r. dwarsbalk by voorzitting","1350","BA",,,,,,"0.05","237","Nee","Nee",,"Nee",,,,"2024","Geen oordeel","05","Ja","2024-07-14T00:00:00.000","2024-05-08T00:00:00.000","2006-12-05T00:00:00.000","2016-11-18T00:00:00.000",,,,,,,,,,,,,,,,,,,,,,,,,,,,"https://opendata.rdw.nl/resource/3huj-srit.json","https://opendata.rdw.nl/resource/8ys7-d773.json","https://opendata.rdw.nl/resource/vezc-m2t6.json","https://opendata.rdw.nl/resource/jhie-znh9.json","https://opendata.rdw.nl/resource/kmfi-hrps.json"
"KX528D","Personenauto","KIA","KIA PICANTO","20250105","20220105","862","hatchback","5","BLAUW","Niet geregistreerd","4","1086","836","1350","936","400","700","20051209","20170119","Geen verstrekking in Open Data",,"Ja",,,,,,,"4","4",,,,,,"M1",,,"by r. voorzitting","1350","BA",,,,,,"0.05","237","Nee","Nee",,"Nee","2050",,,"2023","Geen oordeel","05","Ja","2025-01-05T00:00:00.000","2022-01-05T00:00:00.000","2005-12-09T00:00:00.000","2017-01-19T00:00:00.000",,,,,,,,,,,,,,,,,,,,,,,,,,,,"https://opendata.rdw.nl/resource/3huj-srit.json","https://opendata.rdw.nl/resource/8ys7-d773.json","https://opendata.rdw.nl/resource/vezc-m2t6.json","https://opendata.rdw.nl/resource/jhie-znh9.json","https://opendata.rdw.nl/resource/kmfi-hrps.json"
"N615BZ","Personenauto","KIA","KIA PICANTO, KIA SA","20240914","20211018","656","hatchback","5","BLAUW","Niet geregistreerd","3","1086","836","1350","936","400","700","20050929","20211018","Geen verstrekking in Open Data",,"Ja","154",,,,,,"4","4",,,,,,"M1",,,,"1350","BA",,,,,,"0.05","237","Nee","Nee",,"Nee","2050",,,"2024","Geen oordeel","05","Ja","2024-09-14T00:00:00.000","2021-10-18T00:00:00.000","2005-09-29T00:00:00.000","2021-10-18T00:00:00.000",,,,,,,,,,,,,,,,,,,,,,,,,,,,"https://opendata.rdw.nl/resource/3huj-srit.json","https://opendata.rdw.nl/resource/8ys7-d773.json","https://opendata.rdw.nl/resource/vezc-m2t6.json","https://opendata.rdw.nl/resource/jhie-znh9.json","https://opendata.rdw.nl/resource/kmfi-hrps.json"
"N892JP","Personenauto","KIA","KIA PICANTO","20241102","20211111","985","hatchback","5","BLAUW","Niet geregistreerd","4","1086","836","1350","936","400","700","20061023","20211111","Geen verstrekking in Open Data",,"Ja","154",,,,,,"4","4",,,,,,"M1",,,,"1350","BA",,,,,,"0.05","238","Nee","Nee",,"Nee",,,,"2024","Geen oordeel","05","Ja","2024-11-02T00:00:00.000","2021-11-11T00:00:00.000","2006-10-23T00:00:00.000","2021-11-11T00:00:00.000",,,,,,,,,,,,,,,,,,,,,,"20211021","2021-10-21T00:00:00.000",,,,,"https://opendata.rdw.nl/resource/3huj-srit.json","https://opendata.rdw.nl/resource/8ys7-d773.json","https://opendata.rdw.nl/resource/vezc-m2t6.json","https://opendata.rdw.nl/resource/jhie-znh9.json","https://opendata.rdw.nl/resource/kmfi-hrps.json"
"NK336G","Personenauto","KIA","KIA PICANTO","20250222","20170320","1107","hatchback","5","BLAUW","Niet geregistreerd","4","1086","912","1350","1012","400","700","20051213","20170320","Geen verstrekking in Open Data",,"Ja",,,,,,,"4","4",,,,,,"M1",,,"r. balk onder voorzitting","1350","BA",,,,,,"0.05","237","Nee","Nee",,"Nee","2050",,,"2024","Geen oordeel","05","Ja","2025-02-22T00:00:00.000","2017-03-20T00:00:00.000","2005-12-13T00:00:00.000","2017-03-20T00:00:00.000",,,,,,,,,,,,,,,,,,,,,,,,,,,,"https://opendata.rdw.nl/resource/3huj-srit.json","https://opendata.rdw.nl/resource/8ys7-d773.json","https://opendata.rdw.nl/resource/vezc-m2t6.json","https://opendata.rdw.nl/resource/jhie-znh9.json","https://opendata.rdw.nl/resource/kmfi-hrps.json"
"PD165L","Personenauto","KIA","KIA PICANTO","20250414","20240502","1548","hatchback","5","ROOD","Niet geregistreerd","4","999","885","1350","985",,"700","20080128","20170530","Geen verstrekking in Open Data",,"Ja",,,,,,,"4","4",,,,,,"M1",,,"dwarsbalk r. voorzitting","1350","BA",,,,,,"0.05","237","Nee","Nee",,"Nee","2050",,,"2024","Geen oordeel","05","Ja","2025-04-14T00:00:00.000","2024-05-02T00:00:00.000","2008-01-28T00:00:00.000","2017-05-30T00:00:00.000",,,,,,,,,,,,,,,,,,,,,,,,,,,,"https://opendata.rdw.nl/resource/3huj-srit.json","https://opendata.rdw.nl/resource/8ys7-d773.json","https://opendata.rdw.nl/resource/vezc-m2t6.json","https://opendata.rdw.nl/resource/jhie-znh9.json","https://opendata.rdw.nl/resource/kmfi-hrps.json"
"PP981N","Personenauto","KIA","KIA PICANTO, KIA SA","20241020","20231027","1910","hatchback","5","BLAUW","Niet geregistreerd","4","1086","854","1350","954",,"400","20060323","20170822","Geen verstrekking in Open Data",,"Ja",,,,,,,"4","4",,,,,,"M1",,,"r. onder voorzitting","1350","BA",,,,,,"0.05","237","Nee","Nee",,"Nee",,,,"2023","Geen oordeel","05","Ja","2024-10-20T00:00:00.000","2023-10-27T00:00:00.000","2006-03-23T00:00:00.000","2017-08-22T00:00:00.000",,,,,,,,,,,,,,,,,,,,,,,,,,,,"https://opendata.rdw.nl/resource/3huj-srit.json","https://opendata.rdw.nl/resource/8ys7-d773.json","https://opendata.rdw.nl/resource/vezc-m2t6.json","https://opendata.rdw.nl/resource/jhie-znh9.json","https://opendata.rdw.nl/resource/kmfi-hrps.json"
"PZ948X","Personenauto","KIA","KIA PICANTO","20240713","20200716","862","hatchback","5","BLAUW","Niet geregistreerd","4","1086","836","1350","936","400","700","20050615","20180109","Geen verstrekking in Open Data",,"Ja",,,,,,,"4","4",,,,,,"M1",,,"by r. voorzitting","1350","BA",,,,,,"0.05","237","Nee","Nee",,"Nee",,,,"2023","Geen oordeel","05","Ja","2024-07-13T00:00:00.000","2020-07-16T00:00:00.000","2005-06-15T00:00:00.000","2018-01-09T00:00:00.000",,,,,,,,,,,,,,,,,,,,,,,,,,,,"https://opendata.rdw.nl/resource/3huj-srit.json","https://opendata.rdw.nl/resource/8ys7-d773.json","https://opendata.rdw.nl/resource/vezc-m2t6.json","https://opendata.rdw.nl/resource/jhie-znh9.json","https://opendata.rdw.nl/resource/kmfi-hrps.json"
"RJ463Z","Personenauto","KIA","KIA PICANTO","20240902","20191007","1138","hatchback","5","ZWART","Niet geregistreerd","3","1086","912","1350","1012","400","700","20060902","20171215","Geen verstrekking in Open Data",,"Ja",,,,,,,"4","4",,,,,,"M1",,,"r. bodemplaat v. voorzitting","1350",,,,,,,"0.05","236","Nee","Nee",,"Nee",,,,"2023","Geen oordeel","05","Ja","2024-09-02T00:00:00.000","2019-10-07T00:00:00.000","2006-09-02T00:00:00.000","2017-12-15T00:00:00.000",,,,,,,,,,,,,,,,,,,,,,,,,,,,"https://opendata.rdw.nl/resource/3huj-srit.json","https://opendata.rdw.nl/resource/8ys7-d773.json","https://opendata.rdw.nl/resource/vezc-m2t6.json","https://opendata.rdw.nl/resource/jhie-znh9.json","https://opendata.rdw.nl/resource/kmfi-hrps.json"
"RS533F","Personenauto","KIA","KIA PICANTO","20240127","20240127","995","hatchback","5","ZWART","Niet geregistreerd","4","1086","836","1350","936","400","700","20060327","20180124","Geen verstrekking in Open Data",,"Ja",,,,,,,"4","4",,,,,,"M1",,,"onder voorzitting r.","1350","BA",,,,,,"0.05","237","Nee","Nee",,"Nee",,,,"2024","Geen oordeel","05","Ja","2024-01-27T00:00:00.000","2024-01-27T00:00:00.000","2006-03-27T00:00:00.000","2018-01-24T00:00:00.000",,,,,,,,,,,,,,,,,,,,,,,,,,,,"https://opendata.rdw.nl/resource/3huj-srit.json","https://opendata.rdw.nl/resource/8ys7-d773.json","https://opendata.rdw.nl/resource/vezc-m2t6.json","https://opendata.rdw.nl/resource/jhie-znh9.json","https://opendata.rdw.nl/resource/kmfi-hrps.json"
"S553GZ","Personenauto","KIA","KIA PICANTO","20250117","20230119","42","hatchback","4","GRIJS","Niet geregistreerd","4","1248","839","1400","939",,,"20180122","20230119","Geen verstrekking in Open Data","17337","Ja",,,,,,,"5","4",,,,,,"M1",,,,"1400",,,,,,,"0.06","240","Nee","Nee",,"Nee",,,,"2023","Geen oordeel","05","Ja","2025-01-17T00:00:00.000","2023-01-19T00:00:00.000","2018-01-22T00:00:00.000","2023-01-19T00:00:00.000",,,,,,,,,,,,,,,,,,,,,,"20221230","2022-12-30T00:00:00.000",,,,,"https://opendata.rdw.nl/resource/3huj-srit.json","https://opendata.rdw.nl/resource/8ys7-d773.json","https://opendata.rdw.nl/resource/vezc-m2t6.json","https://opendata.rdw.nl/resource/jhie-znh9.json","https://opendata.rdw.nl/resource/kmfi-hrps.json"
"SG032J","Personenauto","KIA","KIA PICANTO,KIA SA","20241204","20220712","417","hatchback","5","BLAUW","Niet geregistreerd","4","999","912","1350","1012","400","700","20060523","20180322","Geen verstrekking in Open Data",,"Ja",,,,,,,"4","4",,,,,,"M1",,,,"1350","BA",,,,,,"0.04","238","Nee","Nee",,"Nee",,,,"2023","Geen oordeel","05","Ja","2024-12-04T00:00:00.000","2022-07-12T00:00:00.000","2006-05-23T00:00:00.000","2018-03-22T00:00:00.000",,,,,,,,,,,,,,,,,,,,,,,,,,,,"https://opendata.rdw.nl/resource/3huj-srit.json","https://opendata.rdw.nl/resource/8ys7-d773.json","https://opendata.rdw.nl/resource/vezc-m2t6.json","https://opendata.rdw.nl/resource/jhie-znh9.json","https://opendata.rdw.nl/resource/kmfi-hrps.json"
"TJ902V","Personenauto","KIA","KIA PICANTO,KIA SA","20241026","20230318","1143","hatchback","5","ZWART","Niet geregistreerd","4","1086","912","1350","1012","400","700","20050722","20190103","Geen verstrekking in Open Data",,"Ja",,,,,,,"4","4",,,,,,"M1",,,,"1350","BA",,,,,"0","0.04","236","Nee","Nee",,"Nee",,,,"2023","Geen oordeel","05","Ja","2024-10-26T00:00:00.000","2023-03-18T00:00:00.000","2005-07-22T00:00:00.000","2019-01-03T00:00:00.000",,,,,,,,,,,,,,,,,,,,,,,,,,,,"https://opendata.rdw.nl/resource/3huj-srit.json","https://opendata.rdw.nl/resource/8ys7-d773.json","https://opendata.rdw.nl/resource/vezc-m2t6.json","https://opendata.rdw.nl/resource/jhie-znh9.json","https://opendata.rdw.nl/resource/kmfi-hrps.json"
"TN589D","Personenauto","KIA","KIA PICANTO","20241106","20191207","1523","hatchback","5","GRIJS","Niet geregistreerd","4","1086","836","1350","936","400","700","20050908","20181224","Geen verstrekking in Open Data",,"Ja",,,,,,,"4","4",,,,,,"M1",,,"r. dwarsbalk by voorzitting","1350","BA",,,,,,"0.05","235","Nee","Nee",,"Nee",,,,"2023","Geen oordeel","05","Ja","2024-11-06T00:00:00.000","2019-12-07T00:00:00.000","2005-09-08T00:00:00.000","2018-12-24T00:00:00.000",,,,,,,,,,,,,,,,,,,,,,,,,,,,"https://opendata.rdw.nl/resource/3huj-srit.json","https://opendata.rdw.nl/resource/8ys7-d773.json","https://opendata.rdw.nl/resource/vezc-m2t6.json","https://opendata.rdw.nl/resource/jhie-znh9.json","https://opendata.rdw.nl/resource/kmfi-hrps.json"
"XB554P","Personenauto","KIA","KIA PICANTO, KIA SA","20241130","20181205","1127","hatchback","5","ZWART","Niet geregistreerd","4","1086","836","1350","936","400","700","20070119","20181205","Geen verstrekking in Open Data",,"Ja",,,,,,,"4","4",,,,,,"M1",,,"r. bodemplaat v. voorzitting","1350",,,,,,,"0.05","237","Nee","Nee",,"Nee","2050",,,"2024","Geen oordeel","05","Ja","2024-11-30T00:00:00.000","2018-12-05T00:00:00.000","2007-01-19T00:00:00.000","2018-12-05T00:00:00.000",,,,,,,,,,,,,,,,,,,,,,,,,,,,"https://opendata.rdw.nl/resource/3huj-srit.json","https://opendata.rdw.nl/resource/8ys7-d773.json","https://opendata.rdw.nl/resource/vezc-m2t6.json","https://opendata.rdw.nl/resource/jhie-znh9.json","https://opendata.rdw.nl/resource/kmfi-hrps.json"