"kenteken","voertuigsoort","merk","handelsbenaming","vervaldatum_apk","datum_tenaamstelling","bruto_bpm","inrichting","aantal_zitplaatsen","eerste_kleur","tweede_kleur","aantal_cilinders","cilinderinhoud","massa_ledig_voertuig","toegestane_maximum_massa_voertuig","massa_rijklaar","maximum_massa_trekken_ongeremd","maximum_trekken_massa_geremd","datum_eerste_toelating","datum_eerste_tenaamstelling_in_nederland","wacht_op_keuren","catalogusprijs","wam_verzekerd","maximale_constructiesnelheid","laadvermogen","oplegger_geremd","aanhangwagen_autonoom_geremd","aanhangwagen_middenas_geremd","aantal_staanplaatsen","aantal_deuren","aantal_wielen","afstand_hart_koppeling_tot_achterzijde_voertuig","afstand_voorzijde_voertuig_tot_hart_koppeling","afwijkende_maximum_snelheid","lengte","breedte","europese_voertuigcategorie","europese_voertuigcategorie_toevoeging","europese_uitvoeringcategorie_toevoeging","plaats_chassisnummer","technische_max_massa_voertuig","type","type_gasinstallatie","typegoedkeuringsnummer","variant","uitvoering","volgnummer_wijziging_eu_typegoedkeuring","vermogen_massarijklaar","wielbasis","export_indicator","openstaande_terugroepactie_indicator","vervaldatum_tachograaf","taxi_indicator","maximum_massa_samenstelling","aantal_rolstoelplaatsen","maximum_ondersteunende_snelheid","jaar_laatste_registratie_tellerstand","tellerstandoordeel","code_toelichting_tellerstandoordeel","tenaamstellen_mogelijk","vervaldatum_apk_dt","datum_tenaamstelling_dt","datum_eerste_toelating_dt","datum_eerste_tenaamstelling_in_nederland_dt","vervaldatum_tachograaf_dt","maximum_last_onder_de_vooras_sen_tezamen_koppeling","type_remsysteem_voertuig_code","rupsonderstelconfiguratiecode","wielbasis_voertuig_minimum","wielbasis_voertuig_maximum","lengte_voertuig_minimum","lengte_voertuig_maximum","breedte_voertuig_minimum","breedte_voertuig_maximum","hoogte_voertuig","hoogte_voertuig_minimum","hoogte_voertuig_maximum","massa_bedrijfsklaar_minimaal","massa_bedrijfsklaar_maximaal","technisch_toelaatbaar_massa_koppelpunt","maximum_massa_technisch_maximaal","maximum_massa_technisch_minimaal","subcategorie_nederland","verticale_belasting_koppelpunt_getrokken_voertuig","zuinigheidsclassificatie","registratie_datum_goedkeuring_afschrijvingsmoment_bpm","registratie_datum_goedkeuring_afschrijvingsmoment_bpm_dt","gem_lading_wrde","aerodyn_voorz","massa_alt_aandr","verl_cab_ind","api_gekentekende_voertuigen_assen","api_gekentekende_voertuigen_brandstof","api_gekentekende_voertuigen_carrosserie","api_gekentekende_voertuigen_carrosserie_specifiek","api_gekentekende_voertuigen_voertuigklasse"
"2ZNV42","Personenauto","JAGUAR LAND ROVER","JAGUAR F-TYPE","20250215","20190115","14865","cabriolet","2","GRIJS","Niet geregistreerd","6","2995","1567","2025","1667",,,"20130627","20150211","Geen verstrekking in Open Data","126648","Ja",,,,,,,"2","4","0","0",,"447","0","M1",,,"r. schroefveerkoker","2025","QQ6",,"e11*2001/116*0272*14","A","206","0","0.17","262","Nee","Nee",,"Nee","0","0",,"2024","Onlogisch","04","Ja","2025-02-15T00:00:00.000","2019-01-15T00:00:00.000","2013-06-27T00:00:00.000","2015-02-11T00:00:00.000",,,,,,,,,,,,,,,,,,,,,"E",,,,,,,"https://opendata.rdw.nl/resource/3huj-srit.json","https://opendata.rdw.nl/resource/8ys7-d773.json","https://opendata.rdw.nl/resource/vezc-m2t6.json","https://opendata.rdw.nl/resource/jhie-znh9.json","https://opendata.rdw.nl/resource/kmfi-hrps.json"
"3ZSZ52","Personenauto","JAGUAR LAND ROVER","JAGUAR F-TYPE","20250502","20150324","14473","cabriolet","2","ORANJE","Niet geregistreerd","6","2995","1567","2025","1667",,,"20140319","20150324","Geen verstrekking in Open Data","103504","Ja",,,,,,,"2","4","0","0",,"447","0","M1",,,"tegen r. schroefveerkoker onder motorkap","2025","QQ6",,"e11*2001/116*0272*17","A","208","0","0.15","262","Nee","Nee",,"Nee","0","0",,"2024","Geen oordeel","05","Ja","2025-05-02T00:00:00.000","2015-03-24T00:00:00.000","2014-03-19T00:00:00.000","2015-03-24T00:00:00.000",,,,,,,,,,,,,,,,,,,,,"F",,,,,,,"https://opendata.rdw.nl/resource/3huj-srit.json","https://opendata.rdw.nl/resource/8ys7-d773.json","https://opendata.rdw.nl/resource/vezc-m2t6.json","https://opendata.rdw.nl/resource/jhie-znh9.json","https://opendata.rdw.nl/resource/kmfi-hrps.json"
"5ZSV43","Personenauto","JAGUAR LAND ROVER","JAGUAR F-TYPE","20240412","20240113","15965","cabriolet","2","GRIJS","Niet geregistreerd","6","2995","1567","2025","1667",,,"20130412","20150321","Geen verstrekking in Open Data","102838","Ja",,,,,,,"2","4","0","0",,"447","0","M1",,,"r. schroefveerkoker","2025","QQ6",,"e11*2001/116*0272*14","A","204","0","0.15","262","Nee","Nee",,"Nee","0","0",,"2024","Geen oordeel","05","Ja","2024-04-12T00:00:00.000","2024-01-13T00:00:00.000","2013-04-12T00:00:00.000","2015-03-21T00:00:00.000",,,,,,,,,,,,,,,,,,,,,"E",,,,,,,"https://opendata.rdw.nl/resource/3huj-srit.json","https://opendata.rdw.nl/resource/8ys7-d773.json","https://opendata.rdw.nl/resource/vezc-m2t6.json","https://opendata.rdw.nl/resource/jhie-znh9.json","https://opendata.rdw.nl/resource/kmfi-hrps.json"
"9ZNK20","Personenauto","JAGUAR LAND ROVER","JAGUAR F-TYPE","20240816","20220824","19344","cabriolet","2","ZWART","Niet geregistreerd","6","2995","1567","2025","1667",,,"20140522","20150206","Geen verstrekking in Open Data","125060","Ja",,,,,,,"2","4","0","0",,"447","0","M1",,,"r. schroefveerkoker","2025","QQ6",,"e11*2001/116*0272*15","A","206","0","0.17","262","Nee","Nee",,"Nee","0","0",,"2023","Geen oordeel","05","Ja","2024-08-16T00:00:00.000","2022-08-24T00:00:00.000","2014-05-22T00:00:00.000","2015-02-06T00:00:00.000",,,,,,,,,,,,,,,,,,,,,"F",,,,,,,"https://opendata.rdw.nl/resource/3huj-srit.json","https://opendata.rdw.nl/resource/8ys7-d773.json","https://opendata.rdw.nl/resource/vezc-m2t6.json","https://opendata.rdw.nl/resource/jhie-znh9.json","https://opendata.rdw.nl/resource/kmfi-hrps.json"
"G129FX","Personenauto","JAGUAR LAND ROVER","JAGUAR F-TYPE","20240922","20190916","38004","cabriolet","2","GRIJS","Niet geregistreerd","8","5000","1711","2025","1811",,,"20130812","20190916","Geen verstrekking in Open Data","152880","Ja","300",,,,,,"2","4","0","0",,"447","192","M1",,,"r. schroefveerkoker","2025","QQ6",,"e11*2001/116*0272*15","B","202","0","0.20","262","Nee","Nee",,"Nee","0","0",,"2023","Geen oordeel","05","Ja","2024-09-22T00:00:00.000","2019-09-16T00:00:00.000","2013-08-12T00:00:00.000","2019-09-16T00:00:00.000",,,,,,,,,,,"131",,,,,,,,,,"G",,,,,,,"https://opendata.rdw.nl/resource/3huj-srit.json","https://opendata.rdw.nl/resource/8ys7-d773.json","https://opendata.rdw.nl/resource/vezc-m2t6.json","https://opendata.rdw.nl/resource/jhie-znh9.json","https://opendata.rdw.nl/resource/kmfi-hrps.json"
"G952JK","Personenauto","JAGUAR LAND ROVER","JAGUAR F-TYPE","20241107","20191001","2094","cabriolet","2","WIT","Niet geregistreerd","6","2995","1567","2000","1667",,,"20131203","20191001","Geen verstrekking in Open Data","100478","Ja","260",,,,,,"2","4","0","0",,"447","192","M1",,,,"2000","QQ6",,"e11*2001/116*0272*15","A","204","0","0.15","262","Nee","Nee",,"Nee","0","0","0.00","2023","Geen oordeel","05","Ja","2024-11-07T00:00:00.000","2019-10-01T00:00:00.000","2013-12-03T00:00:00.000","2019-10-01T00:00:00.000",,,,,,,,,,,"131",,,,,,,,,,"E",,,,,,,"https://opendata.rdw.nl/resource/3huj-srit.json","https://opendata.rdw.nl/resource/8ys7-d773.json","https://opendata.rdw.nl/resource/vezc-m2t6.json","https://opendata.rdw.nl/resource/jhie-znh9.json","https://opendata.rdw.nl/resource/kmfi-hrps.json"
"GP620N","Personenauto","JAGUAR LAND ROVER","JAGUAR F-TYPE","20250423","20210203","31336","cabriolet","2","ROOD","Niet geregistreerd","8","5000","1635","2025","1735",,,"20140423","20150716","Geen verstrekking in Open Data","153640","Ja",,,,,,,"2","4","0","0",,"447","0","M1",,,"tegen r. schroefveerkoker onder motorkap","2025","QQ6",,"e11*2001/116*0272*16","B","204","0","0.21","262","Nee","Nee",,"Nee","0","0",,"2024","Geen oordeel","05","Ja","2025-04-23T00:00:00.000","2021-02-03T00:00:00.000","2014-04-23T00:00:00.000","2015-07-16T00:00:00.000",,,,,,,,,,,,,,,,,,,,,"G",,,,,,,"https://opendata.rdw.nl/resource/3huj-srit.json","https://opendata.rdw.nl/resource/8ys7-d773.json","https://opendata.rdw.nl/resource/vezc-m2t6.json","https://opendata.rdw.nl/resource/jhie-znh9.json","https://opendata.rdw.nl/resource/kmfi-hrps.json"
"GZ165P","Personenauto","JAGUAR LAND ROVER","JAGUAR F-TYPE","20240615","20150917","15965","cabriolet","2","GRIJS","Niet geregistreerd","6","2995","1567","2025","1667",,,"20130612","20150917","Geen verstrekking in Open Data","103970","Ja",,,,,,,"2","4","0","0",,"447","0","M1",,,"r. schroefveerkoker","2025","QQ6",,"e11*2001/116*0272*14","A","204","0","0.15","262","Nee","Nee",,"Nee","0","0",,"2023","Geen oordeel","05","Ja","2024-06-15T00:00:00.000","2015-09-17T00:00:00.000","2013-06-12T00:00:00.000","2015-09-17T00:00:00.000",,,,,,,,,,,,,,,,,,,,,"E",,,,,,,"https://opendata.rdw.nl/resource/3huj-srit.json","https://opendata.rdw.nl/resource/8ys7-d773.json","https://opendata.rdw.nl/resource/vezc-m2t6.json","https://opendata.rdw.nl/resource/jhie-znh9.json","https://opendata.rdw.nl/resource/kmfi-hrps.json"
"H257RP","Personenauto","JAGUAR LAND ROVER","JAGUAR F-TYPE","20241009","20231014","15962","cabriolet","2","WIT","Niet geregistreerd","6","2995","1567","2000","1667",,,"20130524","20200416","Geen verstrekking in Open Data","100259","Ja","260",,,,,,"2","4","0","0",,"447","192","M1",,,"r. schroefveerkoker","2000","QQ6",,"e11*2001/116*0272*15","A","204","0","0.15","262","Nee","Nee",,"Nee","0","0","0.00","2023","Geen oordeel","05","Ja","2024-10-09T00:00:00.000","2023-10-14T00:00:00.000","2013-05-24T00:00:00.000","2020-04-16T00:00:00.000",,,,,,,,,,,"131",,,,,,,,,,"E",,,,,,,"https://opendata.rdw.nl/resource/3huj-srit.json","https://opendata.rdw.nl/resource/8ys7-d773.json","https://opendata.rdw.nl/resource/vezc-m2t6.json","https://opendata.rdw.nl/resource/jhie-znh9.json","https://opendata.rdw.nl/resource/kmfi-hrps.json"
"HS054L","Personenauto","JAGUAR LAND ROVER","JAGUAR F-TYPE","20250104","20240105","15558","cabriolet","2","GRIJS","Niet geregistreerd","6","2995","1567","2025","1667",,,"20131127","20151223","Geen verstrekking in Open Data","120650","Ja",,,,,,,"2","4","0","0",,"447","0","M1",,,"r. schroefveerkoker","2025","QQ6",,"e11*2001/116*0272*15","A","206","0","0.17","262","Nee","Nee",,"Nee","0","0",,"2024","Geen oordeel","05","Ja","2025-01-04T00:00:00.000","2024-01-05T00:00:00.000","2013-11-27T00:00:00.000","2015-12-23T00:00:00.000",,,,,,,,,,,,,,,,,,,,,"E",,,,,,,"https://opendata.rdw.nl/resource/3huj-srit.json","https://opendata.rdw.nl/resource/8ys7-d773.json","https://opendata.rdw.nl/resource/vezc-m2t6.json","https://opendata.rdw.nl/resource/jhie-znh9.json","https://opendata.rdw.nl/resource/kmfi-hrps.json"
"HZ009G","Personenauto","JAGUAR LAND ROVER","JAGUAR F-TYPE","20250227","20200207","16142","cabriolet","2","GRIJS","Niet geregistreerd","6","2995","1567","2025","1667",,,"20130226","20160119","Geen verstrekking in Open Data","118171","Ja",,,,,,,"2","4","0","0",,"447","0","M1",,,"r. schroefveerkoker","2025","QQ6",,"e11*2001/116*0272*14","A","206","0","0.17","262","Nee","Nee",,"Nee","0","0",,"2024","Geen oordeel","05","Ja","2025-02-27T00:00:00.000","2020-02-07T00:00:00.000","2013-02-26T00:00:00.000","2016-01-19T00:00:00.000",,,,,,,,,,,,,,,,,,,,,"E",,,,,,,"https://opendata.rdw.nl/resource/3huj-srit.json","https://opendata.rdw.nl/resource/8ys7-d773.json","https://opendata.rdw.nl/resource/vezc-m2t6.json","https://opendata.rdw.nl/resource/jhie-znh9.json","https://opendata.rdw.nl/resource/kmfi-hrps.json"
"J256GV","Personenauto","JAGUAR LAND ROVER","JAGUAR F-TYPE","20240731","20200730","20805","cabriolet","2","WIT","Niet geregistreerd","6","2995","1660","2025","1760",,,"20141223","20200730","Geen verstrekking in Open Data","118260","Ja","275",,,,,,"2","4","0","0",,"447","192","M1",,,"r. schroefveerkoker","2025","QQ6",,"e11*2001/116*0272*15","A","206","0","0.16","262","Nee","Nee",,"Nee","0","0",,"2023","Geen oordeel","05","Ja","2024-07-31T00:00:00.000","2020-07-30T00:00:00.000","2014-12-23T00:00:00.000","2020-07-30T00:00:00.000",,,,,,,,,,,"131",,,,,,,,,,"F",,,,,,,"https://opendata.rdw.nl/resource/3huj-srit.json","https://opendata.rdw.nl/resource/8ys7-d773.json","https://opendata.rdw.nl/resource/vezc-m2t6.json","https://opendata.rdw.nl/resource/jhie-znh9.json","https://opendata.rdw.nl/resource/kmfi-hrps.json"
"JS151L","Personenauto","JAGUAR LAND ROVER","JAGUAR F-TYPE","20250423","20220302","15049","cabriolet","2","GRIJS","Niet geregistreerd","6","2995","1567","2000","1667",,,"20140516","20160608","Geen verstrekking in Open Data","107370","Ja",,,,,,,"2","4","0","0",,"447","0","M1",,,"r. schroefveerkoker","2000","QQ6",,"e11*2001/116*0272*15","A","204","0","0.15","262","Nee","Nee",,"Nee","0","0","0.00","2024","Geen oordeel","05","Ja","2025-04-23T00:00:00.000","2022-03-02T00:00:00.000","2014-05-16T00:00:00.000","2016-06-08T00:00:00.000",,,,,,,,,,,,,,,,,,,,,"F",,,,,,,"https://opendata.rdw.nl/resource/3huj-srit.json","https://opendata.rdw.nl/resource/8ys7-d773.json","https://opendata.rdw.nl/resource/vezc-m2t6.json","https://opendata.rdw.nl/resource/jhie-znh9.json","https://opendata.rdw.nl/resource/kmfi-hrps.json"
"K808BX","Personenauto","JAGUAR LAND ROVER","JAGUAR F-TYPE","20241220","20210319","6326","cabriolet","2","GRIJS","Niet geregistreerd","6","2995","1646","2150","1746",,,"20150820","20201121","Geen verstrekking in Open Data","130949","Ja",,,,,,,"2","4","0","0",,"447","192","M1",,,"tegen r. schroefveerkoker onder motorkap","2150","QQ6",,"e11*2001/116*0272*19","E","201","0","0.16","262","Nee","Nee",,"Nee","0","0","0.00","2024","Geen oordeel","05","Ja","2024-12-20T00:00:00.000","2021-03-19T00:00:00.000","2015-08-20T00:00:00.000","2020-11-21T00:00:00.000",,,,,,,,,,,"131",,,,,,,,,,"F",,,,,,,"https://opendata.rdw.nl/resource/3huj-srit.json","https://opendata.rdw.nl/resource/8ys7-d773.json","https://opendata.rdw.nl/resource/vezc-m2t6.json","https://opendata.rdw.nl/resource/jhie-znh9.json","https://opendata.rdw.nl/resource/kmfi-hrps.json"
"KB475V","Personenauto","JAGUAR LAND ROVER","JAGUAR F-TYPE","20241008","20230923","11177","cabriolet","2","ZWART","Niet geregistreerd","6","2995","1567","2050","1667",,,"20140925","20160801","Geen verstrekking in Open Data","121283","Ja",,,,,,,"2","4","0","0",,"447","0","M1",,,"tegen r. schroefveerkoker onder motorkap","2050","QQ6",,"e11*2001/116*0272*18","A","213","0","0.17","262","Nee","Nee",,"Nee","0","0","0.00","2023","Geen oordeel","05","Ja","2024-10-08T00:00:00.000","2023-09-23T00:00:00.000","2014-09-25T00:00:00.000","2016-08-01T00:00:00.000",,,,,,,,,,,,,,,,,,,,,"F",,,,,,,"https://opendata.rdw.nl/resource/3huj-srit.json","https://opendata.rdw.nl/resource/8ys7-d773.json","https://opendata.rdw.nl/resource/vezc-m2t6.json","https://opendata.rdw.nl/resource/jhie-znh9.json","https://opendata.rdw.nl/resource/kmfi-hrps.json"
"KD498Z","Personenauto","JAGUAR LAND ROVER","JAGUAR F-TYPE","20250403","20170405","14824","cabriolet","2","ZWART","Niet geregistreerd","6","2995","1567","2025","1667",,,"20130612","20170405","Geen verstrekking in Open Data","106878","Ja",,,,,,,"2","4","0","0",,"447","0","M1",,,"r. schroefveerkoker","2025","QQ6",,"e11*2001/116*0272*14","A","204","0","0.15","262","Nee","Nee",,"Nee","0","0",,"2024","Geen oordeel","05","Ja","2025-04-03T00:00:00.000","2017-04-05T00:00:00.000","2013-06-12T00:00:00.000","2017-04-05T00:00:00.000",,,,,,,,,,,,,,,,,,,,,"E",,,,,,,"https://opendata.rdw.nl/resource/3huj-srit.json","https://opendata.rdw.nl/resource/8ys7-d773.json","https://opendata.rdw.nl/resource/vezc-m2t6.json","https://opendata.rdw.nl/resource/jhie-znh9.json","https://opendata.rdw.nl/resource/kmfi-hrps.json"
"L180DF","Personenauto","JAGUAR LAND ROVER","JAGUAR F-TYPE","20240602","20210419","15962","cabriolet","2","GRIJS","Niet geregistreerd","6","2995","1660","2025","1760",,,"20130226","20210419","Geen verstrekking in Open Data","103059","Nee","260",,,,,,"2","4",,,,"447","192","M1",,,"r. schroefveerkoker","2025","QQ6",,,,,,"0.14","262","Nee","Nee",,"Nee",,,,"2023","Geen oordeel","05","Ja","2024-06-02T00:00:00.000","2021-04-19T00:00:00.000","2013-02-26T00:00:00.000","2021-04-19T00:00:00.000",,,,,,,,,,,"131",,,,,,,,,,,,,,,,,"https://opendata.rdw.nl/resource/3huj-srit.json","https://opendata.rdw.nl/resource/8ys7-d773.json","https://opendata.rdw.nl/resource/vezc-m2t6.json","https://opendata.rdw.nl/resource/jhie-znh9.json","https://opendata.rdw.nl/resource/kmfi-hrps.json"
"L792DT","Personenauto","JAGUAR LAND ROVER","JAGUAR F-TYPE","20250426","20210426","16995","cabriolet","2","ZWART","Niet geregistreerd","6","2995","1660","2000","1760",,,"20150706","20210426","Geen verstrekking in Open Data","109784","Ja","260",,,,,,"2","4","0","0",,"447","192","M1",,,,"2000","QQ6",,"e11*2001/116*0272*18","A","211","0","0.14","262","Nee","Nee",,"Nee","0","0","0.00","2024","Geen oordeel","05","Ja","2025-04-26T00:00:00.000","2021-04-26T00:00:00.000","2015-07-06T00:00:00.000","2021-04-26T00:00:00.000",,,,,,,,,,,"131",,,,,,,,,,,,,,,,,"https://opendata.rdw.nl/resource/3huj-srit.json","https://opendata.rdw.nl/resource/8ys7-d773.json","https://opendata.rdw.nl/resource/vezc-m2t6.json","https://opendata.rdw.nl/resource/jhie-znh9.json","https://opendata.rdw.nl/resource/kmfi-hrps.json"
"NH309J","Personenauto","JAGUAR LAND ROVER","JAGUAR F-TYPE","20200703","20200428","7872","cabriolet","2","GRIJS","Niet geregistreerd","6","2995","1567","2025","1667",,,"20140630","20170125","Geen verstrekking in Open Data","107091","Nee",,,,,,,"2","4","0","0",,"447","0","M1",,,"r. schroefveerkoker","2025","QQ6",,"e11*2001/116*0272*14","A","204","0","0.15","262","Nee","Nee",,"Nee","0","0",,"2020","Geen oordeel","05","Ja","2020-07-03T00:00:00.000","2020-04-28T00:00:00.000","2014-06-30T00:00:00.000","2017-01-25T00:00:00.000",,,,,,,,,,,,,,,,,,,,,"F",,,,,,,"https://opendata.rdw.nl/resource/3huj-srit.json","https://opendata.rdw.nl/resource/8ys7-d773.json","https://opendata.rdw.nl/resource/vezc-m2t6.json","https://opendata.rdw.nl/resource/jhie-znh9.json","https://opendata.rdw.nl/resource/kmfi-hrps.json"
"NJ471F","Personenauto","JAGUAR LAND ROVER","JAGUAR F-TYPE","20250320","20221116","15965","cabriolet","2","WIT","Niet geregistreerd","6","2995","1567","2000","1667",,,"20131125","20170204","Geen verstrekking in Open Data","103090","Ja",,,,,,,"2","4","0","0",,"447","0","M1",,,"r. schroefveerkoker","2000","QQ6",,"e11*2001/116*0272*15","A","202","0","0.15","262","Nee","Nee",,"Nee","0","0","0.00","2024","Geen oordeel","05","Ja","2025-03-20T00:00:00.000","2022-11-16T00:00:00.000","2013-11-25T00:00:00.000","2017-02-04T00:00:00.000",,,,,,,,,,,,,,,,,,,,,"E",,,,,,,"https://opendata.rdw.nl/resource/3huj-srit.json","https://opendata.rdw.nl/resource/8ys7-d773.json","https://opendata.rdw.nl/resource/vezc-m2t6.json","https://opendata.rdw.nl/resource/jhie-znh9.json","https://opendata.rdw.nl/resource/kmfi-hrps.json"
"NK007R","Personenauto","JAGUAR LAND ROVER","JAGUAR F-TYPE","20250412","20170224","11819","cabriolet","2","ROOD","Niet geregistreerd","6","2995","1567","2025","1667",,,"20140606","20170224","Geen verstrekking in Open Data","119011","Ja",,,,,,,"2","4","0","0",,"447","0","M1",,,"r. schroefveerkoker","2025","QQ6",,"e11*2001/116*0272*15","A","206","0","0.17","262","Nee","Nee",,"Nee","0","0",,"2024","Geen oordeel","05","Ja","2025-04-12T00:00:00.000","2017-02-24T00:00:00.000","2014-06-06T00:00:00.000","2017-02-24T00:00:00.000",,,,,,,,,,,,,,,,,,,,,"F",,,,,,,"https://opendata.rdw.nl/resource/3huj-srit.json","https://opendata.rdw.nl/resource/8ys7-d773.json","https://opendata.rdw.nl/resource/vezc-m2t6.json","https://opendata.rdw.nl/resource/jhie-znh9.json","https://opendata.rdw.nl/resource/kmfi-hrps.json"
"PF811P","Personenauto","JAGUAR LAND ROVER","JAGUAR F-TYPE","20241016","20231017","42609","cabriolet","2","WIT","Niet geregistreerd","8","5000","1711","2025","1811",,,"20140228","20170612","Geen verstrekking in Open Data","162570","Ja",,,,,,,"2","4","0","0",,"447","0","M1",,,"tegen r. schroefveerkoker onder motorkap","2025","QQ6",,"e11*2001/116*0272*17","B","204","0","0.20","262","Nee","Nee",,"Nee","0","0","0.00","2023","Geen oordeel","05","Ja","2024-10-16T00:00:00.000","2023-10-17T00:00:00.000","2014-02-28T00:00:00.000","2017-06-12T00:00:00.000",,,,,,,,,,,,,,,,,,,,,"G",,,,,,,"https://opendata.rdw.nl/resource/3huj-srit.json","https://opendata.rdw.nl/resource/8ys7-d773.json","https://opendata.rdw.nl/resource/vezc-m2t6.json","https://opendata.rdw.nl/resource/jhie-znh9.json","https://opendata.rdw.nl/resource/kmfi-hrps.json"
"PN933R","Personenauto","JAGUAR LAND ROVER","JAGUAR F-TYPE","20240915","20170805","30259","cabriolet","2","GRIJS","Niet geregistreerd","8","5000","1635","2050","1735",,,"20140807","20170805","Geen verstrekking in Open Data","170769","Ja",,,,,,,"2","4","0","0",,"447","0","M1",,,"tegen r. schroefveerkoker onder motorkap","2050","QQ6",,"e11*2001/116*0272*18","B","204","0","0.21","262","Nee","Nee",,"Nee","0","0","0.00","2023","Geen oordeel","05","Ja","2024-09-15T00:00:00.000","2017-08-05T00:00:00.000","2014-08-07T00:00:00.000","2017-08-05T00:00:00.000",,,,,,,,,,,,,,,,,,,,,"G",,,,,,,"https://opendata.rdw.nl/resource/3huj-srit.json","https://opendata.rdw.nl/resource/8ys7-d773.json","https://opendata.rdw.nl/resource/vezc-m2t6.json","https://opendata.rdw.nl/resource/jhie-znh9.json","https://opendata.rdw.nl/resource/kmfi-hrps.json"
"S058KX","Personenauto","JAGUAR LAND ROVER","JAGUAR F-TYPE","20240731","20230216","18908","cabriolet","2","ORANJE","Niet geregistreerd","6","2995","1567","2000","1667",,,"20140516","20230216","Geen verstrekking in Open Data","159821","Ja","260",,,,,,"2","4","0","0",,"447","192","M1",,,"r. schroefveerkoker","2000","QQ6",,"e11*2001/116*0272*15","A","204","0","0.15","262","Nee","Nee",,"Nee","0","0","0.00","2023","Geen oordeel","05","Ja","2024-07-31T00:00:00.000","2023-02-16T00:00:00.000","2014-05-16T00:00:00.000","2023-02-16T00:00:00.000",,,,,,,,,,,"131",,,,,,,,,,,"20230215","2023-02-15T00:00:00.000",,,,,"https://opendata.rdw.nl/resource/3huj-srit.json","https://opendata.rdw.nl/resource/8ys7-d773.json","https://opendata.rdw.nl/resource/vezc-m2t6.json","https://opendata.rdw.nl/resource/jhie-znh9.json","https://opendata.rdw.nl/resource/kmfi-hrps.json"
"S146NS","Personenauto","JAGUAR LAND ROVER","JAGUAR F-TYPE","20240623","20230625","20805","cabriolet","2","GRIJS","Niet geregistreerd","6","2995","1660","2025","1760",,,"20140313","20230304","Geen verstrekking in Open Data","114730","Ja","275",,,,,,"2","4",,,,"447","192","M1",,,"tegen r. schroefveerkoker onder motorkap","2025","QQ6",,"e11*2001/116*0272*16","A","210","0","0.16","262","Nee","Nee",,"Nee",,,,"2023","Geen oordeel","05","Ja","2024-06-23T00:00:00.000","2023-06-25T00:00:00.000","2014-03-13T00:00:00.000","2023-03-04T00:00:00.000",,,,,,,,,,,"131",,,,,,,,,,,"20230301","2023-03-01T00:00:00.000",,,,,"https://opendata.rdw.nl/resource/3huj-srit.json","https://opendata.rdw.nl/resource/8ys7-d773.json","https://opendata.rdw.nl/resource/vezc-m2t6.json","https://opendata.rdw.nl/resource/jhie-znh9.json","https://opendata.rdw.nl/resource/kmfi-hrps.json"
"S220LP","Personenauto","JAGUAR LAND ROVER","JAGUAR F-TYPE","20240818","20230223","42609","cabriolet","2","BLAUW","Niet geregistreerd","8","5000","1711","2025","1811",,,"20140307","20230223","Geen verstrekking in Open Data","154589","Ja","300",,,,,,"2","4","0","0",,"447","192","M1",,,,"2025","QQ6",,"e11*2001/116*0272*15","B","202","0","0.20","262","Nee","Nee",,"Nee","0","0",,"2023","Geen oordeel","05","Ja","2024-08-18T00:00:00.000","2023-02-23T00:00:00.000","2014-03-07T00:00:00.000","2023-02-23T00:00:00.000",,,,,,,,,,,"131",,,,,,,,,,,"20230221","2023-02-21T00:00:00.000",,,,,"https://opendata.rdw.nl/resource/3huj-srit.json","https://opendata.rdw.nl/resource/8ys7-d773.json","https://opendata.rdw.nl/resource/vezc-m2t6.json","https://opendata.rdw.nl/resource/jhie-znh9.json","https://opendata.rdw.nl/resource/kmfi-hrps.json"