"kenteken","voertuigsoort","merk","handelsbenaming","vervaldatum_apk","datum_tenaamstelling","bruto_bpm","inrichting","aantal_zitplaatsen","eerste_kleur","tweede_kleur","aantal_cilinders","cilinderinhoud","massa_ledig_voertuig","toegestane_maximum_massa_voertuig","massa_rijklaar","maximum_massa_trekken_ongeremd","maximum_trekken_massa_geremd","datum_eerste_toelating","datum_eerste_tenaamstelling_in_nederland","wacht_op_keuren","catalogusprijs","wam_verzekerd","maximale_constructiesnelheid","laadvermogen","oplegger_geremd","aanhangwagen_autonoom_geremd","aanhangwagen_middenas_geremd","aantal_staanplaatsen","aantal_deuren","aantal_wielen","afstand_hart_koppeling_tot_achterzijde_voertuig","afstand_voorzijde_voertuig_tot_hart_koppeling","afwijkende_maximum_snelheid","lengte","breedte","europese_voertuigcategorie","europese_voertuigcategorie_toevoeging","europese_uitvoeringcategorie_toevoeging","plaats_chassisnummer","technische_max_massa_voertuig","type","type_gasinstallatie","typegoedkeuringsnummer","variant","uitvoering","volgnummer_wijziging_eu_typegoedkeuring","vermogen_massarijklaar","wielbasis","export_indicator","openstaande_terugroepactie_indicator","vervaldatum_tachograaf","taxi_indicator","maximum_massa_samenstelling","aantal_rolstoelplaatsen","maximum_ondersteunende_snelheid","jaar_laatste_registratie_tellerstand","tellerstandoordeel","code_toelichting_tellerstandoordeel","tenaamstellen_mogelijk","vervaldatum_apk_dt","datum_tenaamstelling_dt","datum_eerste_toelating_dt","datum_eerste_tenaamstelling_in_nederland_dt","vervaldatum_tachograaf_dt","maximum_last_onder_de_vooras_sen_tezamen_koppeling","type_remsysteem_voertuig_code","rupsonderstelconfiguratiecode","wielbasis_voertuig_minimum","wielbasis_voertuig_maximum","lengte_voertuig_minimum","lengte_voertuig_maximum","breedte_voertuig_minimum","breedte_voertuig_maximum","hoogte_voertuig","hoogte_voertuig_minimum","hoogte_voertuig_maximum","massa_bedrijfsklaar_minimaal","massa_bedrijfsklaar_maximaal","technisch_toelaatbaar_massa_koppelpunt","maximum_massa_technisch_maximaal","maximum_massa_technisch_minimaal","subcategorie_nederland","verticale_belasting_koppelpunt_getrokken_voertuig","zuinigheidsclassificatie","registratie_datum_goedkeuring_afschrijvingsmoment_bpm","registratie_datum_goedkeuring_afschrijvingsmoment_bpm_dt","gem_lading_wrde","aerodyn_voorz","massa_alt_aandr","verl_cab_ind","api_gekentekende_voertuigen_assen","api_gekentekende_voertuigen_brandstof","api_gekentekende_voertuigen_carrosserie","api_gekentekende_voertuigen_carrosserie_specifiek","api_gekentekende_voertuigen_voertuigklasse"
"1ZSH87","Personenauto","JAGUAR LAND ROVER","JAGUAR XF","20250422","20170328","8578","sedan","5","GRIJS","Niet geregistreerd","4","2179","1704","2320","1804","750","1850","20140123","20150323","Geen verstrekking in Open Data","57554","Ja",,,,,,,"4","4","0","0",,"497","0","M1",,,"r. bodemplaat v. voorzitting","2320","CC9",,"e11*2001/116*0323*14","H","509","0","0.07","291","Nee","Nee",,"Nee","4170","0","0.00","2024","Geen oordeel","05","Ja","2025-04-22T00:00:00.000","2017-03-28T00:00:00.000","2014-01-23T00:00:00.000","2015-03-23T00:00:00.000",,,,,,,,,,,,,,,,,,,,,"C",,,,,,,"https://opendata.rdw.nl/resource/3huj-srit.json","https://opendata.rdw.nl/resource/8ys7-d773.json","https://opendata.rdw.nl/resource/vezc-m2t6.json","https://opendata.rdw.nl/resource/jhie-znh9.json","https://opendata.rdw.nl/resource/kmfi-hrps.json"
"5XGP87","Personenauto","JAGUAR LAND ROVER","JAGUAR XF","20241021","20210227","9484","sedan","5","ZWART","Niet geregistreerd","4","2179","1704","2320","1804","750","1850","20130807","20140721","Geen verstrekking in Open Data","62950","Ja",,,,,,,"4","4","0","0",,"497","0","M1",,,"r. bodemplaat v. voorzitting","2320","CC9",,"e11*2001/116*0323*11","H","507","0","0.08","291","Nee","Nee",,"Nee","4170","0","0.00","2023","Geen oordeel","05","Ja","2024-10-21T00:00:00.000","2021-02-27T00:00:00.000","2013-08-07T00:00:00.000","2014-07-21T00:00:00.000",,"0",,,,,,,,,,,,,,,,,,,"A",,,,,,,"https://opendata.rdw.nl/resource/3huj-srit.json","https://opendata.rdw.nl/resource/8ys7-d773.json","https://opendata.rdw.nl/resource/vezc-m2t6.json","https://opendata.rdw.nl/resource/jhie-znh9.json","https://opendata.rdw.nl/resource/kmfi-hrps.json"
"G244KP","Personenauto","JAGUAR LAND ROVER","JAGUAR XF SPORTBRAKE","20250331","20230215","1578","stationwagen","5","ZWART","Niet geregistreerd","4","2179","1853","2390","1953","750","1850","20140401","20191015","Geen verstrekking in Open Data","67448","Ja","214",,,,,,"4","4","0","0",,"0","188","M1",,,,"2390","CC9",,"e11*2001/116*0323*14","L","507","0","0.08","291","Nee","Nee",,"Ja","4240","0","0.00","2024","Geen oordeel","05","Ja","2025-03-31T00:00:00.000","2023-02-15T00:00:00.000","2014-04-01T00:00:00.000","2019-10-15T00:00:00.000",,,,,,,,,,,,,,,,,,,,,"C","20230602","2023-06-02T00:00:00.000",,,,,"https://opendata.rdw.nl/resource/3huj-srit.json","https://opendata.rdw.nl/resource/8ys7-d773.json","https://opendata.rdw.nl/resource/vezc-m2t6.json","https://opendata.rdw.nl/resource/jhie-znh9.json","https://opendata.rdw.nl/resource/kmfi-hrps.json"
"GB227J","Personenauto","JAGUAR LAND ROVER","JAGUAR XF SPORTBRAKE","20241217","20200808","7020","stationwagen","5","WIT","Niet geregistreerd","4","2179","1744","2390","1844","750","1850","20131217","20150403","Geen verstrekking in Open Data","64837","Ja",,,,,,,"4","4","0","0",,"0","0","M1",,,"r. bodemplaat v. voorzitting","2390","CC9",,"e11*2001/116*0323*14","L","509","0","0.07","291","Nee","Nee",,"Nee","4240","0","0.00","2024","Geen oordeel","05","Ja","2024-12-17T00:00:00.000","2020-08-08T00:00:00.000","2013-12-17T00:00:00.000","2015-04-03T00:00:00.000",,,,,,,,,,,,,,,,,,,,,"A",,,,,,,"https://opendata.rdw.nl/resource/3huj-srit.json","https://opendata.rdw.nl/resource/8ys7-d773.json","https://opendata.rdw.nl/resource/vezc-m2t6.json","https://opendata.rdw.nl/resource/jhie-znh9.json","https://opendata.rdw.nl/resource/kmfi-hrps.json"
"GB576X","Personenauto","JAGUAR LAND ROVER","JAGUAR XF","20250103","20191205","1888","sedan","5","GRIJS","Niet geregistreerd","6","2993","1739","2360","1839","750","1850","20141222","20150415","Geen verstrekking in Open Data","74277","Ja",,,,,,,"4","4","0","0",,"497","0","M1",,,"r. bodemplaat v. voorzitting","2360","CC9",,"e11*2001/116*0323*15","G","510","0","0.10","291","Nee","Nee",,"Nee","4210","0","0.00","2024","Geen oordeel","05","Ja","2025-01-03T00:00:00.000","2019-12-05T00:00:00.000","2014-12-22T00:00:00.000","2015-04-15T00:00:00.000",,,,,,,,,,,,,,,,,,,,,"D",,,,,,,"https://opendata.rdw.nl/resource/3huj-srit.json","https://opendata.rdw.nl/resource/8ys7-d773.json","https://opendata.rdw.nl/resource/vezc-m2t6.json","https://opendata.rdw.nl/resource/jhie-znh9.json","https://opendata.rdw.nl/resource/kmfi-hrps.json"
"GD916S","Personenauto","JAGUAR LAND ROVER","JAGUAR XF SPORTBRAKE","20241115","20231216","8828","stationwagen","5","GRIJS","Niet geregistreerd","4","2179","1744","2390","1844","750","1850","20150305","20150525","Geen verstrekking in Open Data","58090","Ja",,,,,,,"4","4","0","0",,"0","0","M1",,,"r. bodemplaat v. voorzitting","2390","CC9",,"e11*2001/116*0323*11","L","506","0","0.07","291","Nee","Nee",,"Nee","4240","0","0.00","2024","Geen oordeel","05","Ja","2024-11-15T00:00:00.000","2023-12-16T00:00:00.000","2015-03-05T00:00:00.000","2015-05-25T00:00:00.000",,,,,,,,,,,,,,,,,,,,,"C",,,,,,,"https://opendata.rdw.nl/resource/3huj-srit.json","https://opendata.rdw.nl/resource/8ys7-d773.json","https://opendata.rdw.nl/resource/vezc-m2t6.json","https://opendata.rdw.nl/resource/jhie-znh9.json","https://opendata.rdw.nl/resource/kmfi-hrps.json"
"GL816B","Personenauto","JAGUAR LAND ROVER","JAGUAR XF SPORTBRAKE","20250221","20190222","3777","stationwagen","5","GRIJS","Niet geregistreerd","4","2179","1744","2320","1844","750","1850","20140220","20150618","Geen verstrekking in Open Data","61400","Ja",,,,,,,"4","4","0","0",,"0","0","M1",,,"r. bodemplaat v. voorzitting","2320","CC9",,"e11*2001/116*0323*14","L","508","0","0.07","291","Nee","Nee",,"Nee","4170","0","0.00","2024","Geen oordeel","05","Ja","2025-02-21T00:00:00.000","2019-02-22T00:00:00.000","2014-02-20T00:00:00.000","2015-06-18T00:00:00.000",,,,,,,,,,,,,,,,,,,,,"B",,,,,,,"https://opendata.rdw.nl/resource/3huj-srit.json","https://opendata.rdw.nl/resource/8ys7-d773.json","https://opendata.rdw.nl/resource/vezc-m2t6.json","https://opendata.rdw.nl/resource/jhie-znh9.json","https://opendata.rdw.nl/resource/kmfi-hrps.json"
"GN429R","Personenauto","JAGUAR LAND ROVER","JAGUAR XF","20250205","20150708","8207","sedan","5","BLAUW","Niet geregistreerd","4","2179","1704","2320","1804","750","1850","20140203","20150708","Geen verstrekking in Open Data","57992","Ja",,,,,,,"4","4","0","0",,"497","0","M1",,,"r. bodemplaat v. voorzitting","2320","CC9",,"e11*2001/116*0323*14","H","509","0","0.07","291","Nee","Nee",,"Nee","4170","0","0.00","2024","Geen oordeel","05","Ja","2025-02-05T00:00:00.000","2015-07-08T00:00:00.000","2014-02-03T00:00:00.000","2015-07-08T00:00:00.000",,,,,,,,,,,,,,,,,,,,,"C",,,,,,,"https://opendata.rdw.nl/resource/3huj-srit.json","https://opendata.rdw.nl/resource/8ys7-d773.json","https://opendata.rdw.nl/resource/vezc-m2t6.json","https://opendata.rdw.nl/resource/jhie-znh9.json","https://opendata.rdw.nl/resource/kmfi-hrps.json"
"GP585Z","Personenauto","JAGUAR LAND ROVER","JAGUAR XF SPORTBRAKE","20250131","20210514","7425","stationwagen","5","GRIJS","Niet geregistreerd","4","2179","1744","2320","1844","750","1850","20140505","20150723","Geen verstrekking in Open Data","63343","Ja",,,,,,,"4","4","0","0",,"0","0","M1",,,"r. bodemplaat v. voorzitting","2320","CC9",,"e11*2001/116*0323*14","L","508","0","0.07","291","Nee","Nee",,"Nee","4170","0","0.00","2024","Geen oordeel","05","Ja","2025-01-31T00:00:00.000","2021-05-14T00:00:00.000","2014-05-05T00:00:00.000","2015-07-23T00:00:00.000",,,,,,,,,,,,,,,,,,,,,"B",,,,,,,"https://opendata.rdw.nl/resource/3huj-srit.json","https://opendata.rdw.nl/resource/8ys7-d773.json","https://opendata.rdw.nl/resource/vezc-m2t6.json","https://opendata.rdw.nl/resource/jhie-znh9.json","https://opendata.rdw.nl/resource/kmfi-hrps.json"
"GV225P","Personenauto","JAGUAR LAND ROVER","JAGUAR XF","20241012","20221015","15079","sedan","5","ZWART","Niet geregistreerd","6","2993","1739","2360","1839","750","1850","20141201","20150826","Geen verstrekking in Open Data","65839","Ja",,,,,,,"4","4","0","0",,"497","0","M1",,,"r. bodemplaat v. voorzitting","2360","CC9",,"e11*2001/116*0323*15","G","510","0","0.10","291","Nee","Nee",,"Nee","4210","0","0.00","2023","Geen oordeel","05","Ja","2024-10-12T00:00:00.000","2022-10-15T00:00:00.000","2014-12-01T00:00:00.000","2015-08-26T00:00:00.000",,,,,,,,,,,,,,,,,,,,,"D",,,,,,,"https://opendata.rdw.nl/resource/3huj-srit.json","https://opendata.rdw.nl/resource/8ys7-d773.json","https://opendata.rdw.nl/resource/vezc-m2t6.json","https://opendata.rdw.nl/resource/jhie-znh9.json","https://opendata.rdw.nl/resource/kmfi-hrps.json"
"H282TZ","Personenauto","JAGUAR LAND ROVER","JAGUAR XF","20250611","20200526","15741","sedan","5","ZWART","Niet geregistreerd","6","2993","1840","2360","1940","750","1850","20150520","20200526","Geen verstrekking in Open Data","70990","Ja","240",,,,,,"4","4","0","0",,"497","188","M1",,,,"2360","CC9",,"e11*2001/116*0323*15","G","510","0","0.09","291","Nee","Nee",,"Nee","4210","0","0.00","2024","Geen oordeel","05","Ja","2025-06-11T00:00:00.000","2020-05-26T00:00:00.000","2015-05-20T00:00:00.000","2020-05-26T00:00:00.000",,,,,,,,,,,"146",,,,,,,,,,"D",,,,,,,"https://opendata.rdw.nl/resource/3huj-srit.json","https://opendata.rdw.nl/resource/8ys7-d773.json","https://opendata.rdw.nl/resource/vezc-m2t6.json","https://opendata.rdw.nl/resource/jhie-znh9.json","https://opendata.rdw.nl/resource/kmfi-hrps.json"
"H588HP","Personenauto","JAGUAR LAND ROVER","JAGUAR XF","20250211","20200213","12816","sedan","5","GRIJS","Niet geregistreerd","4","1999","1702","2230","1802","750","1850","20130826","20200213","Geen verstrekking in Open Data","72300","Ja","240",,,,,,"4","4",,,,"497","188","M1",,,,"2230","CC9",,"e11*2001/116*0323*11","I","501","0","0.10","291","Nee","Nee",,"Nee",,,,"2024","Geen oordeel","05","Ja","2025-02-11T00:00:00.000","2020-02-13T00:00:00.000","2013-08-26T00:00:00.000","2020-02-13T00:00:00.000",,,,,,,,,,,"146",,,,,,,,,,"D",,,,,,,"https://opendata.rdw.nl/resource/3huj-srit.json","https://opendata.rdw.nl/resource/8ys7-d773.json","https://opendata.rdw.nl/resource/vezc-m2t6.json","https://opendata.rdw.nl/resource/jhie-znh9.json","https://opendata.rdw.nl/resource/kmfi-hrps.json"
"HL264B","Personenauto","JAGUAR LAND ROVER","JAGUAR XF SPORTBRAKE","20250506","20151125","12636","stationwagen","5","GRIJS","Niet geregistreerd","6","2993","1934","2440","2034","750","1850","20150427","20151125","Geen verstrekking in Open Data","92174","Ja",,,,,,,"4","4","0","0",,"0","0","M1",,,"r. bodemplaat v. voorzitting","2440","CC9",,"e11*2001/116*0323*15","M","509","0","0.10","291","Nee","Nee",,"Nee","4290","0","0.00","2024","Geen oordeel","05","Ja","2025-05-06T00:00:00.000","2015-11-25T00:00:00.000","2015-04-27T00:00:00.000","2015-11-25T00:00:00.000",,,,,,,,,,,,,,,,,,,,,"E",,,,,,,"https://opendata.rdw.nl/resource/3huj-srit.json","https://opendata.rdw.nl/resource/8ys7-d773.json","https://opendata.rdw.nl/resource/vezc-m2t6.json","https://opendata.rdw.nl/resource/jhie-znh9.json","https://opendata.rdw.nl/resource/kmfi-hrps.json"
"JD078L","Personenauto","JAGUAR LAND ROVER","JAGUAR XF SPORTBRAKE","20240601","20170210","549","stationwagen","5","GRIJS","Niet geregistreerd","4","2179","1744","2390","1844","750","1850","20141024","20170210","Geen verstrekking in Open Data","60474","Ja",,,,,,,"4","4","0","0",,"0","0","M1",,,"r. bodemplaat v. voorzitting","2390","CC9",,"e11*2001/116*0323*14","L","509","0","0.07","291","Nee","Ja",,"Nee","4240","0","0.00","2023","Geen oordeel","05","Ja","2024-06-01T00:00:00.000","2017-02-10T00:00:00.000","2014-10-24T00:00:00.000","2017-02-10T00:00:00.000",,,,,,,,,,,,,,,,,,,,,"C",,,,,,,"https://opendata.rdw.nl/resource/3huj-srit.json","https://opendata.rdw.nl/resource/8ys7-d773.json","https://opendata.rdw.nl/resource/vezc-m2t6.json","https://opendata.rdw.nl/resource/jhie-znh9.json","https://opendata.rdw.nl/resource/kmfi-hrps.json"
"JD459J","Personenauto","JAGUAR LAND ROVER","JAGUAR XF","20250220","20230811","9397","sedan","5","ZWART","Niet geregistreerd","6","2993","1728","2350","1828","750","2000","20150925","20160217","Geen verstrekking in Open Data","88361","Ja",,,,,,,"4","4","0","0",,"495","0","M1",,,"r. motorruimte","2350","JB",,"e11*2007/46*2981*00","C","501","0","0.12","296","Nee","Nee",,"Nee","4350","0","0.00","2024","Geen oordeel","05","Ja","2025-02-20T00:00:00.000","2023-08-11T00:00:00.000","2015-09-25T00:00:00.000","2016-02-17T00:00:00.000",,,,,,,,,,,,,,,,,,,,,"C",,,,,,,"https://opendata.rdw.nl/resource/3huj-srit.json","https://opendata.rdw.nl/resource/8ys7-d773.json","https://opendata.rdw.nl/resource/vezc-m2t6.json","https://opendata.rdw.nl/resource/jhie-znh9.json","https://opendata.rdw.nl/resource/kmfi-hrps.json"
"K476NB","Personenauto","JAGUAR LAND ROVER","JAGUAR XF SPORTBRAKE","20250216","20230912","1793","stationwagen","5","GRIJS","Niet geregistreerd","4","2179","1744","2390","1844","750","1850","20130715","20210109","Geen verstrekking in Open Data","67628","Ja",,,,,,,"4","4","0","0",,"0","188","M1",,,"r. bodemplaat v. voorzitting","2390","CC9",,"e11*2001/116*0323*11","L","506","0","0.07","291","Nee","Nee",,"Nee","4240","0","0.00","2024","Geen oordeel","05","Ja","2025-02-16T00:00:00.000","2023-09-12T00:00:00.000","2013-07-15T00:00:00.000","2021-01-09T00:00:00.000",,,,,,,,,,,,,,,,,,,,,"A",,,,,,,"https://opendata.rdw.nl/resource/3huj-srit.json","https://opendata.rdw.nl/resource/8ys7-d773.json","https://opendata.rdw.nl/resource/vezc-m2t6.json","https://opendata.rdw.nl/resource/jhie-znh9.json","https://opendata.rdw.nl/resource/kmfi-hrps.json"
"KF146G","Personenauto","JAGUAR LAND ROVER","JAGUAR XF SPORTBRAKE","20241205","20240416","6850","stationwagen","5","ZWART","Niet geregistreerd","4","2179","1744","2390","1844","750","1850","20140626","20160927","Geen verstrekking in Open Data","64666","Ja",,,,,,,"4","4","0","0",,"0","0","M1",,,"r. bodemplaat v. voorzitting","2390","CC9",,"e11*2001/116*0323*14","L","507","0","0.08","291","Nee","Nee",,"Nee","4240","0","0.00","2024","Geen oordeel","05","Ja","2024-12-05T00:00:00.000","2024-04-16T00:00:00.000","2014-06-26T00:00:00.000","2016-09-27T00:00:00.000",,,,,,,,,,,,,,,,,,,,,"C",,,,,,,"https://opendata.rdw.nl/resource/3huj-srit.json","https://opendata.rdw.nl/resource/8ys7-d773.json","https://opendata.rdw.nl/resource/vezc-m2t6.json","https://opendata.rdw.nl/resource/jhie-znh9.json","https://opendata.rdw.nl/resource/kmfi-hrps.json"
"KG291K","Personenauto","JAGUAR LAND ROVER","JAGUAR XF SPORTBRAKE","20250329","20231227","3399","stationwagen","5","GRIJS","Niet geregistreerd","4","2179","1744","2390","1844","750","1850","20150428","20160909","Geen verstrekking in Open Data","60440","Ja",,,,,,,"4","4","0","0",,"0","0","M1",,,"r. bodemplaat v. voorzitting","2390","CC9",,"e11*2001/116*0323*15","L","509","0","0.07","291","Nee","Nee",,"Nee","4240","0","0.00","2024","Geen oordeel","05","Ja","2025-03-29T00:00:00.000","2023-12-27T00:00:00.000","2015-04-28T00:00:00.000","2016-09-09T00:00:00.000",,,,,,,,,,,,,,,,,,,,,"C",,,,,,,"https://opendata.rdw.nl/resource/3huj-srit.json","https://opendata.rdw.nl/resource/8ys7-d773.json","https://opendata.rdw.nl/resource/vezc-m2t6.json","https://opendata.rdw.nl/resource/jhie-znh9.json","https://opendata.rdw.nl/resource/kmfi-hrps.json"
"KH882Z","Personenauto","JAGUAR LAND ROVER","JAGUAR XF","20230913","20180905","4685","sedan","5","ZWART","Niet geregistreerd","4","1999","1526","2190","1626","750","1600","20151201","20160929","Geen verstrekking in Open Data","69822","Ja",,,,,,,"4","4","0","0",,"495","0","M1",,,"r. motorruimte","2190","JB",,"e11*2007/46*2981*00","D","502","0","0.07","296","Nee","Nee",,"Nee","3790","0","0.00","2022","Geen oordeel","05","Ja","2023-09-13T00:00:00.000","2018-09-05T00:00:00.000","2015-12-01T00:00:00.000","2016-09-29T00:00:00.000",,,,,,,,,,,,,,,,,,,,,"A",,,,,,,"https://opendata.rdw.nl/resource/3huj-srit.json","https://opendata.rdw.nl/resource/8ys7-d773.json","https://opendata.rdw.nl/resource/vezc-m2t6.json","https://opendata.rdw.nl/resource/jhie-znh9.json","https://opendata.rdw.nl/resource/kmfi-hrps.json"
"N300FN","Personenauto","JAGUAR LAND ROVER","JAGUAR XF","20240930","20220826","3055","sedan","5","ZWART","Niet geregistreerd","6","2995","1820","2315","1920",,,"20140814","20220826","Geen verstrekking in Open Data","83820","Ja","250",,,,,,"4","4",,,,"497","188","M1",,,,"2315","CC9",,"e11*2001/116*0323*15","J","504","0","0.06","291","Nee","Nee",,"Nee",,,,"2024","Geen oordeel","05","Ja","2024-09-30T00:00:00.000","2022-08-26T00:00:00.000","2014-08-14T00:00:00.000","2022-08-26T00:00:00.000",,,,,,,,,,,"146",,,,,,,,,,,,,,,,,"https://opendata.rdw.nl/resource/3huj-srit.json","https://opendata.rdw.nl/resource/8ys7-d773.json","https://opendata.rdw.nl/resource/vezc-m2t6.json","https://opendata.rdw.nl/resource/jhie-znh9.json","https://opendata.rdw.nl/resource/kmfi-hrps.json"
"N930ZZ","Personenauto","JAGUAR LAND ROVER","JAGUAR XF","20250215","20220311","411","sedan","5","GROEN","Niet geregistreerd","6","2995","1820","2315","1920",,,"20131218","20220121","Geen verstrekking in Open Data","81216","Ja","250",,,,,,"4","4",,,,"497","188","M1",,,"r. bodemplaat v. voorzitting","2315","CC9",,"e11*2001/116*0323*14","J","502","0","0.13","291","Nee","Nee",,"Nee",,,,"2024","Geen oordeel","05","Ja","2025-02-15T00:00:00.000","2022-03-11T00:00:00.000","2013-12-18T00:00:00.000","2022-01-21T00:00:00.000",,,,,,,,,,,"146",,,,,,,,,,,"20220117","2022-01-17T00:00:00.000",,,,,"https://opendata.rdw.nl/resource/3huj-srit.json","https://opendata.rdw.nl/resource/8ys7-d773.json","https://opendata.rdw.nl/resource/vezc-m2t6.json","https://opendata.rdw.nl/resource/jhie-znh9.json","https://opendata.rdw.nl/resource/kmfi-hrps.json"
"NF500S","Personenauto","JAGUAR LAND ROVER","JAGUAR XF","20241213","20211218","8453","sedan","5","ZWART","Niet geregistreerd","6","2993","1739","2360","1839","750","1850","20140120","20180214","Geen verstrekking in Open Data","79099","Ja",,,,,,,"4","4","0","0",,"497","0","M1",,,"r. bodemplaat v. voorzitting","2360","CC9",,"e11*2001/116*0323*11","G","510","0","0.10","291","Nee","Nee",,"Nee","4210","0","0.00","2023","Geen oordeel","05","Ja","2024-12-13T00:00:00.000","2021-12-18T00:00:00.000","2014-01-20T00:00:00.000","2018-02-14T00:00:00.000",,,,,,,,,,,,,,,,,,,,,"D",,,,,,,"https://opendata.rdw.nl/resource/3huj-srit.json","https://opendata.rdw.nl/resource/8ys7-d773.json","https://opendata.rdw.nl/resource/vezc-m2t6.json","https://opendata.rdw.nl/resource/jhie-znh9.json","https://opendata.rdw.nl/resource/kmfi-hrps.json"
"NL258D","Personenauto","JAGUAR LAND ROVER","JAGUAR XF","20250202","20200203","5781","sedan","5","WIT","Niet geregistreerd","4","1999","1580","2190","1680","750","1600","20160118","20170301","Geen verstrekking in Open Data","71069","Ja",,,,,,,"4","4","0","0",,"495","0","M1",,,"r. motorruimte","2190","JB",,"e11*2007/46*2981*00","D","502","0","0.07","296","Nee","Nee",,"Nee","3790","0","0.00","2024","Geen oordeel","05","Ja","2025-02-02T00:00:00.000","2020-02-03T00:00:00.000","2016-01-18T00:00:00.000","2017-03-01T00:00:00.000",,,,,,,,,,,,,,,,,,,,,"B",,,,,,,"https://opendata.rdw.nl/resource/3huj-srit.json","https://opendata.rdw.nl/resource/8ys7-d773.json","https://opendata.rdw.nl/resource/vezc-m2t6.json","https://opendata.rdw.nl/resource/jhie-znh9.json","https://opendata.rdw.nl/resource/kmfi-hrps.json"
"NZ187F","Personenauto","JAGUAR LAND ROVER","JAGUAR XF","20250314","20230421","8208","sedan","5","ZWART","Niet geregistreerd","4","1999","1613","2250","1713","750","2000","20170510","20170510","Geen verstrekking in Open Data","60272","Ja",,,,,,,"4","4","0","0",,"495","0","M1",,,"r. motorruimte","2250","JB",,"e11*2007/46*2981*00","D","506","0","0.08","296","Nee","Nee",,"Ja","4250","0","0.00","2024","Logisch","00","Ja","2025-03-14T00:00:00.000","2023-04-21T00:00:00.000","2017-05-10T00:00:00.000","2017-05-10T00:00:00.000",,,,,,,,,,,,,,,,,,,,,"B","20230710","2023-07-10T00:00:00.000",,,,,"https://opendata.rdw.nl/resource/3huj-srit.json","https://opendata.rdw.nl/resource/8ys7-d773.json","https://opendata.rdw.nl/resource/vezc-m2t6.json","https://opendata.rdw.nl/resource/jhie-znh9.json","https://opendata.rdw.nl/resource/kmfi-hrps.json"
"PF983B","Personenauto","JAGUAR LAND ROVER","JAGUAR XF SPORTBRAKE","20250331","20170612","8564","stationwagen","5","WIT","Niet geregistreerd","4","2179","1744","2390","1844","750","1850","20131211","20170612","Geen verstrekking in Open Data","68025","Ja",,,,,,,"4","4","0","0",,"0","0","M1",,,"r. bodemplaat v. voorzitting","2390","CC9",,"e11*2001/116*0323*14","L","507","0","0.08","291","Nee","Nee",,"Nee","4240","0","0.00","2024","Geen oordeel","05","Ja","2025-03-31T00:00:00.000","2017-06-12T00:00:00.000","2013-12-11T00:00:00.000","2017-06-12T00:00:00.000",,,,,,,,,,,,,,,,,,,,,"A",,,,,,,"https://opendata.rdw.nl/resource/3huj-srit.json","https://opendata.rdw.nl/resource/8ys7-d773.json","https://opendata.rdw.nl/resource/vezc-m2t6.json","https://opendata.rdw.nl/resource/jhie-znh9.json","https://opendata.rdw.nl/resource/kmfi-hrps.json"