"kenteken","voertuigsoort","merk","handelsbenaming","vervaldatum_apk","datum_tenaamstelling","bruto_bpm","inrichting","aantal_zitplaatsen","eerste_kleur","tweede_kleur","aantal_cilinders","cilinderinhoud","massa_ledig_voertuig","toegestane_maximum_massa_voertuig","massa_rijklaar","maximum_massa_trekken_ongeremd","maximum_trekken_massa_geremd","datum_eerste_toelating","datum_eerste_tenaamstelling_in_nederland","wacht_op_keuren","catalogusprijs","wam_verzekerd","maximale_constructiesnelheid","laadvermogen","oplegger_geremd","aanhangwagen_autonoom_geremd","aanhangwagen_middenas_geremd","aantal_staanplaatsen","aantal_deuren","aantal_wielen","afstand_hart_koppeling_tot_achterzijde_voertuig","afstand_voorzijde_voertuig_tot_hart_koppeling","afwijkende_maximum_snelheid","lengte","breedte","europese_voertuigcategorie","europese_voertuigcategorie_toevoeging","europese_uitvoeringcategorie_toevoeging","plaats_chassisnummer","technische_max_massa_voertuig","type","type_gasinstallatie","typegoedkeuringsnummer","variant","uitvoering","volgnummer_wijziging_eu_typegoedkeuring","vermogen_massarijklaar","wielbasis","export_indicator","openstaande_terugroepactie_indicator","vervaldatum_tachograaf","taxi_indicator","maximum_massa_samenstelling","aantal_rolstoelplaatsen","maximum_ondersteunende_snelheid","jaar_laatste_registratie_tellerstand","tellerstandoordeel","code_toelichting_tellerstandoordeel","tenaamstellen_mogelijk","vervaldatum_apk_dt","datum_tenaamstelling_dt","datum_eerste_toelating_dt","datum_eerste_tenaamstelling_in_nederland_dt","vervaldatum_tachograaf_dt","maximum_last_onder_de_vooras_sen_tezamen_koppeling","type_remsysteem_voertuig_code","rupsonderstelconfiguratiecode","wielbasis_voertuig_minimum","wielbasis_voertuig_maximum","lengte_voertuig_minimum","lengte_voertuig_maximum","breedte_voertuig_minimum","breedte_voertuig_maximum","hoogte_voertuig","hoogte_voertuig_minimum","hoogte_voertuig_maximum","massa_bedrijfsklaar_minimaal","massa_bedrijfsklaar_maximaal","technisch_toelaatbaar_massa_koppelpunt","maximum_massa_technisch_maximaal","maximum_massa_technisch_minimaal","subcategorie_nederland","verticale_belasting_koppelpunt_getrokken_voertuig","zuinigheidsclassificatie","registratie_datum_goedkeuring_afschrijvingsmoment_bpm","registratie_datum_goedkeuring_afschrijvingsmoment_bpm_dt","gem_lading_wrde","aerodyn_voorz","massa_alt_aandr","verl_cab_ind","api_gekentekende_voertuigen_assen","api_gekentekende_voertuigen_brandstof","api_gekentekende_voertuigen_carrosserie","api_gekentekende_voertuigen_carrosserie_specifiek","api_gekentekende_voertuigen_voertuigklasse"
"G160DX","Personenauto","JAGUAR LAND ROVER","DISCOVERY SPORT","20240629","20200620","11771","stationwagen","7","ZWART","Niet geregistreerd","4","2179","1854","2640","1954","750","2200","20150827","20200620","Geen verstrekking in Open Data","80188","Ja","180",,,,,,"5","4",,,,,"189","M1",,,"r. motorruimte","2640","LC",,"e11*2007/46*1659*03","S5AA2F","A7F1","0","0.06","274","Nee","Nee",,"Nee","4840",,,"2023","Geen oordeel","05","Ja","2024-06-29T00:00:00.000","2020-06-20T00:00:00.000","2015-08-27T00:00:00.000","2020-06-20T00:00:00.000",,,,,,,,,,,,,,,,,,,,,"F",,,,,,,"https://opendata.rdw.nl/resource/3huj-srit.json","https://opendata.rdw.nl/resource/8ys7-d773.json","https://opendata.rdw.nl/resource/vezc-m2t6.json","https://opendata.rdw.nl/resource/jhie-znh9.json","https://opendata.rdw.nl/resource/kmfi-hrps.json"
"G473TD","Personenauto","JAGUAR LAND ROVER","DISCOVERY SPORT","20241011","20191126","4854","stationwagen","5","GRIJS","Niet geregistreerd","4","1999","1755","2505","1855","750","2500","20160519","20191126","Geen verstrekking in Open Data","68419","Ja","200",,,,,,"5","4","0","0",,"0","189","M1",,,,"2505","LC",,"e11*2007/46*1659*06","S5CD2F","A5A2","0","0.07","274","Nee","Nee",,"Nee","5005","0","0.00","2023","Geen oordeel","05","Ja","2024-10-11T00:00:00.000","2019-11-26T00:00:00.000","2016-05-19T00:00:00.000","2019-11-26T00:00:00.000",,,,,,,,,,,,,,,,,,,,,"E",,,,,,,"https://opendata.rdw.nl/resource/3huj-srit.json","https://opendata.rdw.nl/resource/8ys7-d773.json","https://opendata.rdw.nl/resource/vezc-m2t6.json","https://opendata.rdw.nl/resource/jhie-znh9.json","https://opendata.rdw.nl/resource/kmfi-hrps.json"
"G866GF","Personenauto","JAGUAR LAND ROVER","DISCOVERY SPORT","20240911","20190916","10368","stationwagen","5","ROOD","Niet geregistreerd","4","1999","1755","2505","1855","750","2200","20150921","20190916","Geen verstrekking in Open Data","79900","Ja","180",,,,,,"5","4",,,,,"189","M1",,,"r. motorruimte","2505","LC",,"e11*2007/46*1659*05","S5CA2F","A5A1","0","0.06","274","Nee","Nee",,"Nee","4705",,,"2023","Geen oordeel","05","Ja","2024-09-11T00:00:00.000","2019-09-16T00:00:00.000","2015-09-21T00:00:00.000","2019-09-16T00:00:00.000",,,,,,,,,,,,,,,,,,,,,"D",,,,,,,"https://opendata.rdw.nl/resource/3huj-srit.json","https://opendata.rdw.nl/resource/8ys7-d773.json","https://opendata.rdw.nl/resource/vezc-m2t6.json","https://opendata.rdw.nl/resource/jhie-znh9.json","https://opendata.rdw.nl/resource/kmfi-hrps.json"
"GJ446X","Personenauto","JAGUAR LAND ROVER","DISCOVERY SPORT","20241227","20231228","13252","stationwagen","7","ZWART","Niet geregistreerd","4","2179","1833","2600","1933","750","2200","20150224","20150611","Geen verstrekking in Open Data","77135","Ja",,,,,,,"5","4","0","0",,"0","0","M1",,,"r. bodemplaat onder achterzitting","2600","LC",,"e11*2007/46*1659*02","S5AB2F","A7D1","0","0.07","274","Nee","Nee",,"Nee","4800","0","0.00","2023","Geen oordeel","05","Ja","2024-12-27T00:00:00.000","2023-12-28T00:00:00.000","2015-02-24T00:00:00.000","2015-06-11T00:00:00.000",,,,,,,,,,,,,,,,,,,,,"F",,,,,,,"https://opendata.rdw.nl/resource/3huj-srit.json","https://opendata.rdw.nl/resource/8ys7-d773.json","https://opendata.rdw.nl/resource/vezc-m2t6.json","https://opendata.rdw.nl/resource/jhie-znh9.json","https://opendata.rdw.nl/resource/kmfi-hrps.json"
"GJ911H","Personenauto","JAGUAR LAND ROVER","DISCOVERY SPORT","20240604","20150815","16242","stationwagen","5","WIT","Niet geregistreerd","4","2179","1744","2505","1844","750","2500","20150604","20150604","Geen verstrekking in Open Data","76107","Ja",,,,,,,"5","4","0","0",,"0","0","M1",,,"r. motorruimte","2505","LC",,"e11*2007/46*1659*03","S5AB2F","A5A1","0","0.08","274","Nee","Nee",,"Nee","5005","0","0.00","2024","Logisch","00","Ja","2024-06-04T00:00:00.000","2015-08-15T00:00:00.000","2015-06-04T00:00:00.000","2015-06-04T00:00:00.000",,,,,,,,,,,,,,,,,,,,,"F",,,,,,,"https://opendata.rdw.nl/resource/3huj-srit.json","https://opendata.rdw.nl/resource/8ys7-d773.json","https://opendata.rdw.nl/resource/vezc-m2t6.json","https://opendata.rdw.nl/resource/jhie-znh9.json","https://opendata.rdw.nl/resource/kmfi-hrps.json"
"GV735K","Personenauto","JAGUAR LAND ROVER","DISCOVERY SPORT","20250317","20200609","14650","stationwagen","5","GRIJS","Niet geregistreerd","4","1999","1714","2505","1814","750","2000","20150309","20150828","Geen verstrekking in Open Data","71200","Ja",,,,,,,"5","4","0","0",,"0","0","M1",,,"r. motorruimte","2505","LC",,"e11*2007/46*1659*02","S5BC2F","A5A1","0","0.10","274","Nee","Nee",,"Nee","4505","0","0.00","2024","Geen oordeel","05","Ja","2025-03-17T00:00:00.000","2020-06-09T00:00:00.000","2015-03-09T00:00:00.000","2015-08-28T00:00:00.000",,,,,,,,,,,,,,,,,,,,,"E",,,,,,,"https://opendata.rdw.nl/resource/3huj-srit.json","https://opendata.rdw.nl/resource/8ys7-d773.json","https://opendata.rdw.nl/resource/vezc-m2t6.json","https://opendata.rdw.nl/resource/jhie-znh9.json","https://opendata.rdw.nl/resource/kmfi-hrps.json"
"H044HN","Personenauto","JAGUAR LAND ROVER","DISCOVERY SPORT","20250114","20220118","4896","stationwagen","5","GRIJS","Niet geregistreerd","4","1999","1745","2505","1845","750","2000","20151118","20200612","Geen verstrekking in Open Data","73205","Ja","180",,,,,,"5","4",,,,,"189","M1",,,,"2505","LC",,"e11*2007/46*1659*06","S5CA2F","M5A1","0","0.06","274","Nee","Nee",,"Nee","4505",,,"2024","Geen oordeel","05","Ja","2025-01-14T00:00:00.000","2022-01-18T00:00:00.000","2015-11-18T00:00:00.000","2020-06-12T00:00:00.000",,,,,,,,,,,,,,,,,,,,,"D",,,,,,,"https://opendata.rdw.nl/resource/3huj-srit.json","https://opendata.rdw.nl/resource/8ys7-d773.json","https://opendata.rdw.nl/resource/vezc-m2t6.json","https://opendata.rdw.nl/resource/jhie-znh9.json","https://opendata.rdw.nl/resource/kmfi-hrps.json"
"H311GK","Personenauto","JAGUAR LAND ROVER","DISCOVERY SPORT","20240531","20210317","9629","stationwagen","7","ZWART","Niet geregistreerd","4","2179","1833","2600","1933","750","2200","20150303","20200121","Geen verstrekking in Open Data","74715","Ja","180",,,,,,"5","4","0","0",,"0","189","M1",,,,"2600","LC",,"e11*2007/46*1659*02","S5AB2F","A7D1","0","0.07","274","Nee","Nee",,"Nee","4800","0","0.00","2023","Geen oordeel","05","Ja","2024-05-31T00:00:00.000","2021-03-17T00:00:00.000","2015-03-03T00:00:00.000","2020-01-21T00:00:00.000",,,,,,,,,,,,,,,,,,,,,"F",,,,,,,"https://opendata.rdw.nl/resource/3huj-srit.json","https://opendata.rdw.nl/resource/8ys7-d773.json","https://opendata.rdw.nl/resource/vezc-m2t6.json","https://opendata.rdw.nl/resource/jhie-znh9.json","https://opendata.rdw.nl/resource/kmfi-hrps.json"
"H501KZ","Personenauto","JAGUAR LAND ROVER","DISCOVERY SPORT","20240407","20200310","9884","stationwagen","7","GRIJS","Niet geregistreerd","4","2179","1823","2600","1923","750","2000","20150708","20200310","Geen verstrekking in Open Data","93644","Ja","188",,,,,,"5","4",,,,,"189","M1",,,"r. bodemplaat onder achterzitting","2600","LC",,"e11*2007/46*1659*02","S5AB2F","M7D1","0","0.07","274","Nee","Nee",,"Nee","4600",,,"2024","Geen oordeel","05","Ja","2024-04-07T00:00:00.000","2020-03-10T00:00:00.000","2015-07-08T00:00:00.000","2020-03-10T00:00:00.000",,,,,,,,,,,,,,,,,,,,,"F",,,,,,,"https://opendata.rdw.nl/resource/3huj-srit.json","https://opendata.rdw.nl/resource/8ys7-d773.json","https://opendata.rdw.nl/resource/vezc-m2t6.json","https://opendata.rdw.nl/resource/jhie-znh9.json","https://opendata.rdw.nl/resource/kmfi-hrps.json"
"H571HZ","Personenauto","JAGUAR LAND ROVER","DISCOVERY SPORT","20240608","20200220","17313","stationwagen","5","GRIJS","Niet geregistreerd","4","1999","1733","2505","1833","750","2000","20150608","20200220","Geen verstrekking in Open Data","71396","Ja","199",,,,,,"5","4","0","0",,"0","189","M1",,,,"2505","LC",,"e11*2007/46*1659*03","S5BC2F","A5A1","0","0.10","274","Nee","Nee",,"Nee","4505","0","0.00","2023","Geen oordeel","05","Ja","2024-06-08T00:00:00.000","2020-02-20T00:00:00.000","2015-06-08T00:00:00.000","2020-02-20T00:00:00.000",,,,,,,,,,,,,,,,,,,,,"E",,,,,,,"https://opendata.rdw.nl/resource/3huj-srit.json","https://opendata.rdw.nl/resource/8ys7-d773.json","https://opendata.rdw.nl/resource/vezc-m2t6.json","https://opendata.rdw.nl/resource/jhie-znh9.json","https://opendata.rdw.nl/resource/kmfi-hrps.json"
"H869FF","Personenauto","JAGUAR LAND ROVER","DISCOVERY SPORT","20250107","20200108","15007","stationwagen","5","BRUIN","Niet geregistreerd","4","1999","1729","2505","1829","750","2000","20150917","20200108","Geen verstrekking in Open Data","80379","Ja","200",,,,,,"5","4","0","0",,"0","189","M1",,,,"2505","LC",,"e11*2007/46*1659*05","S5BC2F","A5A2","0","0.10","274","Nee","Nee",,"Nee","4505","0","0.00","2023","Geen oordeel","05","Ja","2025-01-07T00:00:00.000","2020-01-08T00:00:00.000","2015-09-17T00:00:00.000","2020-01-08T00:00:00.000",,,,,,,,,,,,,,,,,,,,,"E",,,,,,,"https://opendata.rdw.nl/resource/3huj-srit.json","https://opendata.rdw.nl/resource/8ys7-d773.json","https://opendata.rdw.nl/resource/vezc-m2t6.json","https://opendata.rdw.nl/resource/jhie-znh9.json","https://opendata.rdw.nl/resource/kmfi-hrps.json"
"H969GT","Personenauto","JAGUAR LAND ROVER","DISCOVERY SPORT","20240608","20200131","13257","stationwagen","7","GRIJS","Niet geregistreerd","4","1999","1816","2600","1916","750","2000","20150601","20200131","Geen verstrekking in Open Data","87775","Ja","199",,,,,,"5","4",,,,,"189","M1",,,,"2600","LC",,"e11*2007/46*1659*03","S5BC2F","A7D1","0","0.09","274","Nee","Nee",,"Nee","4600",,,"2023","Geen oordeel","05","Ja","2024-06-08T00:00:00.000","2020-01-31T00:00:00.000","2015-06-01T00:00:00.000","2020-01-31T00:00:00.000",,,,,,,,,,,,,,,,,,,,,"E",,,,,,,"https://opendata.rdw.nl/resource/3huj-srit.json","https://opendata.rdw.nl/resource/8ys7-d773.json","https://opendata.rdw.nl/resource/vezc-m2t6.json","https://opendata.rdw.nl/resource/jhie-znh9.json","https://opendata.rdw.nl/resource/kmfi-hrps.json"
"HF127V","Personenauto","JAGUAR LAND ROVER","DISCOVERY SPORT","20250215","20190506","16242","stationwagen","5","WIT","Niet geregistreerd","4","2179","1744","2505","1844","750","2500","20150526","20151021","Geen verstrekking in Open Data","74790","Ja",,,,,,,"5","4","0","0",,"0","0","M1",,,"r. motorruimte","2505","LC",,"e11*2007/46*1659*03","S5AB2F","A5A1","0","0.08","274","Nee","Nee",,"Nee","5005","0","0.00","2024","Geen oordeel","05","Ja","2025-02-15T00:00:00.000","2019-05-06T00:00:00.000","2015-05-26T00:00:00.000","2015-10-21T00:00:00.000",,,,,,,,,,,,,,,,,,,,,"F",,,,,,,"https://opendata.rdw.nl/resource/3huj-srit.json","https://opendata.rdw.nl/resource/8ys7-d773.json","https://opendata.rdw.nl/resource/vezc-m2t6.json","https://opendata.rdw.nl/resource/jhie-znh9.json","https://opendata.rdw.nl/resource/kmfi-hrps.json"
"HK112F","Personenauto","JAGUAR LAND ROVER","DISCOVERY SPORT","20250419","20230420","10791","stationwagen","5","ZWART","Niet geregistreerd","4","1999","1745","2505","1845","750","2000","20151027","20151118","Geen verstrekking in Open Data","52920","Ja",,,,,,,"5","4","0","0",,"0","0","M1",,,"r. motorruimte","2505","LC",,"e11*2007/46*1659*05","S5CA2F","M5A3","0","0.06","274","Nee","Nee",,"Nee","4505","0",,"2024","Logisch","00","Ja","2025-04-19T00:00:00.000","2023-04-20T00:00:00.000","2015-10-27T00:00:00.000","2015-11-18T00:00:00.000",,,,,,,,,,,,,,,,,,,,,"D",,,,,,,"https://opendata.rdw.nl/resource/3huj-srit.json","https://opendata.rdw.nl/resource/8ys7-d773.json","https://opendata.rdw.nl/resource/vezc-m2t6.json","https://opendata.rdw.nl/resource/jhie-znh9.json","https://opendata.rdw.nl/resource/kmfi-hrps.json"
"HL436S","Personenauto","JAGUAR LAND ROVER","DISCOVERY SPORT","20250416","20230407","13997","stationwagen","7","BRUIN","Niet geregistreerd","4","2179","1833","2600","1933","750","2200","20150416","20151203","Geen verstrekking in Open Data","75205","Ja",,,,,,,"5","4","0","0",,"0","0","M1",,,"r. motorruimte","2600","LC",,"e11*2007/46*1659*02","S5AB2F","A7D1","0","0.07","274","Nee","Nee",,"Nee","4800","0","0.00","2024","Geen oordeel","05","Ja","2025-04-16T00:00:00.000","2023-04-07T00:00:00.000","2015-04-16T00:00:00.000","2015-12-03T00:00:00.000",,,,,,,,,,,,,,,,,,,,,"F",,,,,,,"https://opendata.rdw.nl/resource/3huj-srit.json","https://opendata.rdw.nl/resource/8ys7-d773.json","https://opendata.rdw.nl/resource/vezc-m2t6.json","https://opendata.rdw.nl/resource/jhie-znh9.json","https://opendata.rdw.nl/resource/kmfi-hrps.json"
"HS297L","Personenauto","JAGUAR LAND ROVER","DISCOVERY SPORT","20240714","20230512","14076","stationwagen","5","ZWART","Niet geregistreerd","4","1999","1733","2505","1833","750","2000","20150714","20151223","Geen verstrekking in Open Data","74440","Ja",,,,,,,"5","4","0","0",,"0","0","M1",,,"r. motorruimte","2505","LC",,"e11*2007/46*1659*03","S5BC2F","A5A1","0","0.10","274","Nee","Nee",,"Nee","4505","0","0.00","2023","Geen oordeel","05","Ja","2024-07-14T00:00:00.000","2023-05-12T00:00:00.000","2015-07-14T00:00:00.000","2015-12-23T00:00:00.000",,,,,,,,,,,,,,,,,,,,,"E",,,,,,,"https://opendata.rdw.nl/resource/3huj-srit.json","https://opendata.rdw.nl/resource/8ys7-d773.json","https://opendata.rdw.nl/resource/vezc-m2t6.json","https://opendata.rdw.nl/resource/jhie-znh9.json","https://opendata.rdw.nl/resource/kmfi-hrps.json"
"HZ132G","Personenauto","JAGUAR LAND ROVER","DISCOVERY SPORT","20250213","20220211","14932","stationwagen","5","ZWART","Niet geregistreerd","4","1999","1733","2505","1833","750","2000","20160107","20170322","Geen verstrekking in Open Data","76899","Ja",,,,,,,"5","4","0","0",,"0","0","M1",,,"r. bodemplaat onder achterzitting","2505","LC",,"e11*2007/46*1659*03","S5BC2F","A5A1","0","0.10","274","Nee","Nee",,"Nee","4505","0","0.00","2024","Geen oordeel","05","Ja","2025-02-13T00:00:00.000","2022-02-11T00:00:00.000","2016-01-07T00:00:00.000","2017-03-22T00:00:00.000",,,,,,,,,,,,,,,,,,,,,"F",,,,,,,"https://opendata.rdw.nl/resource/3huj-srit.json","https://opendata.rdw.nl/resource/8ys7-d773.json","https://opendata.rdw.nl/resource/vezc-m2t6.json","https://opendata.rdw.nl/resource/jhie-znh9.json","https://opendata.rdw.nl/resource/kmfi-hrps.json"
"HZ697P","Personenauto","JAGUAR LAND ROVER","DISCOVERY SPORT","20240727","20190601","14605","stationwagen","7","WIT","ZWART","4","2179","1833","2600","1933","750","2200","20150216","20160122","Geen verstrekking in Open Data","81505","Ja",,,,,,,"5","4","0","0",,"0","0","M1",,,"r. motorruimte","2600","LC",,"e11*2007/46*1659*01","S5AB2F","A7D1","0","0.07","274","Nee","Nee",,"Nee","4800","0","0.00","2023","Geen oordeel","05","Ja","2024-07-27T00:00:00.000","2019-06-01T00:00:00.000","2015-02-16T00:00:00.000","2016-01-22T00:00:00.000",,,,,,,,,,,,,,,,,,,,,"F",,,,,,,"https://opendata.rdw.nl/resource/3huj-srit.json","https://opendata.rdw.nl/resource/8ys7-d773.json","https://opendata.rdw.nl/resource/vezc-m2t6.json","https://opendata.rdw.nl/resource/jhie-znh9.json","https://opendata.rdw.nl/resource/kmfi-hrps.json"
"J398BJ","Personenauto","JAGUAR LAND ROVER","DISCOVERY SPORT","20240629","20230803","17313","stationwagen","5","GRIJS","Niet geregistreerd","4","1999","1733","2505","1833","750","2000","20150528","20200722","Geen verstrekking in Open Data","58109","Ja","199",,,,,,"5","4","0","0",,"0","189","M1",,,,"2505","LC",,"e11*2007/46*1659*03","S5BC2F","A5A1","0","0.10","274","Nee","Nee",,"Nee","4505","0","0.00","2023","Geen oordeel","05","Ja","2024-06-29T00:00:00.000","2023-08-03T00:00:00.000","2015-05-28T00:00:00.000","2020-07-22T00:00:00.000",,,,,,,,,,,,,,,,,,,,,"E",,,,,,,"https://opendata.rdw.nl/resource/3huj-srit.json","https://opendata.rdw.nl/resource/8ys7-d773.json","https://opendata.rdw.nl/resource/vezc-m2t6.json","https://opendata.rdw.nl/resource/jhie-znh9.json","https://opendata.rdw.nl/resource/kmfi-hrps.json"
"JF729Z","Personenauto","JAGUAR LAND ROVER","DISCOVERY SPORT","20231002","20230929","9330","stationwagen","5","GRIJS","Niet geregistreerd","4","1999","1755","2505","1855","750","2500","20151002","20160301","Geen verstrekking in Open Data","68733","Ja",,,,,,,"5","4","0","0",,"0","0","M1",,,"r. motorruimte","2505","LC",,"e11*2007/46*1659*05","S5CD2F","A5A2","0","0.07","274","Nee","Nee",,"Nee","5005","0","0.00","2023","Geen oordeel","05","Ja","2023-10-02T00:00:00.000","2023-09-29T00:00:00.000","2015-10-02T00:00:00.000","2016-03-01T00:00:00.000",,,,,,,,,,,,,,,,,,,,,"D",,,,,,,"https://opendata.rdw.nl/resource/3huj-srit.json","https://opendata.rdw.nl/resource/8ys7-d773.json","https://opendata.rdw.nl/resource/vezc-m2t6.json","https://opendata.rdw.nl/resource/jhie-znh9.json","https://opendata.rdw.nl/resource/kmfi-hrps.json"
"JG225D","Personenauto","JAGUAR LAND ROVER","DISCOVERY SPORT","20250404","20170715","10417","stationwagen","5","GRIJS","Niet geregistreerd","4","2179","1734","2505","1834","750","1800","20150303","20170425","Geen verstrekking in Open Data","62570","Ja",,,,,,,"5","4","0","0",,"0","0","M1",,,"r. motorruimte","2505","LC",,"e11*2007/46*1659*02","S5AA2F","M5A3","0","0.06","274","Nee","Nee",,"Nee","4305","0","0.00","2024","Geen oordeel","05","Ja","2025-04-04T00:00:00.000","2017-07-15T00:00:00.000","2015-03-03T00:00:00.000","2017-04-25T00:00:00.000",,,,,,,,,,,,,,,,,,,,,"E",,,,,,,"https://opendata.rdw.nl/resource/3huj-srit.json","https://opendata.rdw.nl/resource/8ys7-d773.json","https://opendata.rdw.nl/resource/vezc-m2t6.json","https://opendata.rdw.nl/resource/jhie-znh9.json","https://opendata.rdw.nl/resource/kmfi-hrps.json"
"JJ754N","Personenauto","JAGUAR LAND ROVER","DISCOVERY SPORT","20250506","20210506","12617","stationwagen","5","GRIJS","Niet geregistreerd","4","1999","1733","2505","1833","750","2000","20160330","20210506","Geen verstrekking in Open Data","75068","Ja",,,,,,,"5","4","0","0",,"0","0","M1",,,"r. motorruimte","2505","LC",,"e11*2007/46*1659*03","S5BC2F","A5A1","0","0.10","274","Nee","Nee",,"Nee","4505","0","0.00","2024","Geen oordeel","05","Ja","2025-05-06T00:00:00.000","2021-05-06T00:00:00.000","2016-03-30T00:00:00.000","2021-05-06T00:00:00.000",,,,,,,,,,,,,,,,,,,,,"F",,,,,,,"https://opendata.rdw.nl/resource/3huj-srit.json","https://opendata.rdw.nl/resource/8ys7-d773.json","https://opendata.rdw.nl/resource/vezc-m2t6.json","https://opendata.rdw.nl/resource/jhie-znh9.json","https://opendata.rdw.nl/resource/kmfi-hrps.json"
"JL457B","Personenauto","JAGUAR LAND ROVER","DISCOVERY SPORT","20241031","20161001","12580","stationwagen","5","GRIJS","Niet geregistreerd","4","1999","1714","2505","1814","750","2000","20141028","20161001","Geen verstrekking in Open Data","67520","Ja",,,,,,,"5","4","0","0",,"0","0","M1",,,"r. motorruimte","2505","LC",,"e11*2007/46*1659*00","S5BC2F","A5A1","0","0.10","274","Nee","Nee",,"Nee","4505","0","0.00","2023","Geen oordeel","05","Ja","2024-10-31T00:00:00.000","2016-10-01T00:00:00.000","2014-10-28T00:00:00.000","2016-10-01T00:00:00.000",,,,,,,,,,,,,,,,,,,,,"E",,,,,,,"https://opendata.rdw.nl/resource/3huj-srit.json","https://opendata.rdw.nl/resource/8ys7-d773.json","https://opendata.rdw.nl/resource/vezc-m2t6.json","https://opendata.rdw.nl/resource/jhie-znh9.json","https://opendata.rdw.nl/resource/kmfi-hrps.json"
"JV071Z","Personenauto","JAGUAR LAND ROVER","DISCOVERY SPORT","20241012","20221010","11297","stationwagen","5","WIT","Niet geregistreerd","4","2179","1744","2505","1844","750","2500","20151228","20160627","Geen verstrekking in Open Data","73678","Ja",,,,,,,"5","4","0","0",,"0","0","M1",,,"r. motorruimte","2505","LC",,"e11*2007/46*1659*03","S5AB2F","A5A1","0","0.08","274","Nee","Nee",,"Nee","5005","0","0.00","2023","Geen oordeel","05","Ja","2024-10-12T00:00:00.000","2022-10-10T00:00:00.000","2015-12-28T00:00:00.000","2016-06-27T00:00:00.000",,,,,,,,,,,,,,,,,,,,,"F",,,,,,,"https://opendata.rdw.nl/resource/3huj-srit.json","https://opendata.rdw.nl/resource/8ys7-d773.json","https://opendata.rdw.nl/resource/vezc-m2t6.json","https://opendata.rdw.nl/resource/jhie-znh9.json","https://opendata.rdw.nl/resource/kmfi-hrps.json"
"JV561B","Personenauto","JAGUAR LAND ROVER","DISCOVERY SPORT","20241026","20201107","16193","stationwagen","5","WIT","Niet geregistreerd","4","1999","1733","2505","1833","750","2000","20160330","20160620","Geen verstrekking in Open Data","80409","Ja",,,,,,,"5","4","0","0",,"0","0","M1",,,"r. motorruimte","2505","LC",,"e11*2007/46*1659*03","S5BC2F","A5A1","0","0.10","274","Nee","Nee",,"Nee","4505","0","0.00","2023","Geen oordeel","05","Ja","2024-10-26T00:00:00.000","2020-11-07T00:00:00.000","2016-03-30T00:00:00.000","2016-06-20T00:00:00.000",,,,,,,,,,,,,,,,,,,,,"F",,,,,,,"https://opendata.rdw.nl/resource/3huj-srit.json","https://opendata.rdw.nl/resource/8ys7-d773.json","https://opendata.rdw.nl/resource/vezc-m2t6.json","https://opendata.rdw.nl/resource/jhie-znh9.json","https://opendata.rdw.nl/resource/kmfi-hrps.json"