"kenteken","voertuigsoort","merk","handelsbenaming","vervaldatum_apk","datum_tenaamstelling","bruto_bpm","inrichting","aantal_zitplaatsen","eerste_kleur","tweede_kleur","aantal_cilinders","cilinderinhoud","massa_ledig_voertuig","toegestane_maximum_massa_voertuig","massa_rijklaar","maximum_massa_trekken_ongeremd","maximum_trekken_massa_geremd","datum_eerste_toelating","datum_eerste_tenaamstelling_in_nederland","wacht_op_keuren","catalogusprijs","wam_verzekerd","maximale_constructiesnelheid","laadvermogen","oplegger_geremd","aanhangwagen_autonoom_geremd","aanhangwagen_middenas_geremd","aantal_staanplaatsen","aantal_deuren","aantal_wielen","afstand_hart_koppeling_tot_achterzijde_voertuig","afstand_voorzijde_voertuig_tot_hart_koppeling","afwijkende_maximum_snelheid","lengte","breedte","europese_voertuigcategorie","europese_voertuigcategorie_toevoeging","europese_uitvoeringcategorie_toevoeging","plaats_chassisnummer","technische_max_massa_voertuig","type","type_gasinstallatie","typegoedkeuringsnummer","variant","uitvoering","volgnummer_wijziging_eu_typegoedkeuring","vermogen_massarijklaar","wielbasis","export_indicator","openstaande_terugroepactie_indicator","vervaldatum_tachograaf","taxi_indicator","maximum_massa_samenstelling","aantal_rolstoelplaatsen","maximum_ondersteunende_snelheid","jaar_laatste_registratie_tellerstand","tellerstandoordeel","code_toelichting_tellerstandoordeel","tenaamstellen_mogelijk","vervaldatum_apk_dt","datum_tenaamstelling_dt","datum_eerste_toelating_dt","datum_eerste_tenaamstelling_in_nederland_dt","vervaldatum_tachograaf_dt","maximum_last_onder_de_vooras_sen_tezamen_koppeling","type_remsysteem_voertuig_code","rupsonderstelconfiguratiecode","wielbasis_voertuig_minimum","wielbasis_voertuig_maximum","lengte_voertuig_minimum","lengte_voertuig_maximum","breedte_voertuig_minimum","breedte_voertuig_maximum","hoogte_voertuig","hoogte_voertuig_minimum","hoogte_voertuig_maximum","massa_bedrijfsklaar_minimaal","massa_bedrijfsklaar_maximaal","technisch_toelaatbaar_massa_koppelpunt","maximum_massa_technisch_maximaal","maximum_massa_technisch_minimaal","subcategorie_nederland","verticale_belasting_koppelpunt_getrokken_voertuig","zuinigheidsclassificatie","registratie_datum_goedkeuring_afschrijvingsmoment_bpm","registratie_datum_goedkeuring_afschrijvingsmoment_bpm_dt","gem_lading_wrde","aerodyn_voorz","massa_alt_aandr","verl_cab_ind","api_gekentekende_voertuigen_assen","api_gekentekende_voertuigen_brandstof","api_gekentekende_voertuigen_carrosserie","api_gekentekende_voertuigen_carrosserie_specifiek","api_gekentekende_voertuigen_voertuigklasse"
"25TJT2","Personenauto","HYUNDAI","I10","20241204","20140222","1844","MPV","5","ROOD","Niet geregistreerd","4","1248","935","1430","1035",,,"20101201","20120227","Geen verstrekking in Open Data","12981","Ja",,,,,,,"4","4",,,,,,"M1",,,"r. dwarsbalk by voorwielscherm","1430",,,,,,,"0.06","238","Nee","Nee",,"Nee",,,,"2023","Geen oordeel","05","Ja","2024-12-04T00:00:00.000","2014-02-22T00:00:00.000","2010-12-01T00:00:00.000","2012-02-27T00:00:00.000",,"0",,,,,,,,,,,,,,,,,,,,,,,,,,"https://opendata.rdw.nl/resource/3huj-srit.json","https://opendata.rdw.nl/resource/8ys7-d773.json","https://opendata.rdw.nl/resource/vezc-m2t6.json","https://opendata.rdw.nl/resource/jhie-znh9.json","https://opendata.rdw.nl/resource/kmfi-hrps.json"
"5XSP29","Personenauto","HYUNDAI","I10","20241110","20141113","2122","MPV","5","GRIJS","Niet geregistreerd","4","1086","930","1430","1030",,"700","20100831","20141113","Geen verstrekking in Open Data","12650","Ja",,,,,,,"4","4",,,,,,"M1",,,"bodemplaat r. voorzitting","1430",,,,,,,"0.05","238","Nee","Nee",,"Nee","2130",,,"2023","Geen oordeel","05","Ja","2024-11-10T00:00:00.000","2014-11-13T00:00:00.000","2010-08-31T00:00:00.000","2014-11-13T00:00:00.000",,"0",,,,,,,,,,,,,,,,,,,,,,,,,,"https://opendata.rdw.nl/resource/3huj-srit.json","https://opendata.rdw.nl/resource/8ys7-d773.json","https://opendata.rdw.nl/resource/vezc-m2t6.json","https://opendata.rdw.nl/resource/jhie-znh9.json","https://opendata.rdw.nl/resource/kmfi-hrps.json"
"69NVD2","Personenauto","HYUNDAI","I10","20241231","20220926","139","MPV","5","ZWART","Niet geregistreerd","4","1086","900","1405","1000","400","700","20101125","20220926","Geen verstrekking in Open Data","9095","Ja","151",,,,,,"4","4",,,,,,"M1",,,,"1405","PA",,,,,,"0.05","238","Nee","Nee",,"Nee","2105",,,"2023","Geen oordeel","05","Ja","2024-12-31T00:00:00.000","2022-09-26T00:00:00.000","2010-11-25T00:00:00.000","2022-09-26T00:00:00.000",,,,,,,,,,,,,,,,,,,,,,"20220808","2022-08-08T00:00:00.000",,,,,"https://opendata.rdw.nl/resource/3huj-srit.json","https://opendata.rdw.nl/resource/8ys7-d773.json","https://opendata.rdw.nl/resource/vezc-m2t6.json","https://opendata.rdw.nl/resource/jhie-znh9.json","https://opendata.rdw.nl/resource/kmfi-hrps.json"
"H263NT","Personenauto","HYUNDAI","I10","20250326","20201130","2336","MPV","5","ZWART","Niet geregistreerd","4","1248","935","1430","1035",,"700","20090317","20200313","Geen verstrekking in Open Data",,"Ja",,,,,,,"4","4",,,,,,"M1",,,,"1430","PA",,,,,,"0.06","238","Nee","Nee",,"Nee","2130",,,"2024","Geen oordeel","05","Ja","2025-03-26T00:00:00.000","2020-11-30T00:00:00.000","2009-03-17T00:00:00.000","2020-03-13T00:00:00.000",,,,,,,,,,,,,,,,,,,,,,,,,,,,"https://opendata.rdw.nl/resource/3huj-srit.json","https://opendata.rdw.nl/resource/8ys7-d773.json","https://opendata.rdw.nl/resource/vezc-m2t6.json","https://opendata.rdw.nl/resource/jhie-znh9.json","https://opendata.rdw.nl/resource/kmfi-hrps.json"
"JZ855J","Personenauto","HYUNDAI","I10","20240727","20221222","484","MPV","5","ZWART","Niet geregistreerd","4","1086","900","1405","1000","400","700","20110606","20160718","Geen verstrekking in Open Data","8375","Ja",,,,,,,"4","4","0","0",,"357","0","M1",,,"r. voorzitting","1405","PAG","Af-fabriek gasinstallatie","e11*2001/116*0357*01","F5P11","M51AZ1","0","0.05","238","Nee","Nee",,"Nee","2105","0","0.00","2023","Geen oordeel","05","Ja","2024-07-27T00:00:00.000","2022-12-22T00:00:00.000","2011-06-06T00:00:00.000","2016-07-18T00:00:00.000",,,,,,,,,,,,,,,,,,,,,"B",,,,,,,"https://opendata.rdw.nl/resource/3huj-srit.json","https://opendata.rdw.nl/resource/8ys7-d773.json","https://opendata.rdw.nl/resource/vezc-m2t6.json","https://opendata.rdw.nl/resource/jhie-znh9.json","https://opendata.rdw.nl/resource/kmfi-hrps.json"
"KB384N","Personenauto","HYUNDAI","I10","20250501","20230429","3292","MPV","5","ZWART","Niet geregistreerd","4","1086","983","1405","1083","400","700","20090302","20160725","Geen verstrekking in Open Data",,"Ja",,,,,,,"4","4",,,,,,"M1",,,"r. dwarsbalk by voorzitting","1405","F51AZ1",,,,,,"0.04","238","Nee","Nee",,"Nee","2105",,,"2024","Geen oordeel","05","Ja","2025-05-01T00:00:00.000","2023-04-29T00:00:00.000","2009-03-02T00:00:00.000","2016-07-25T00:00:00.000",,,,,,,,,,,,,,,,,,,,,,,,,,,,"https://opendata.rdw.nl/resource/3huj-srit.json","https://opendata.rdw.nl/resource/8ys7-d773.json","https://opendata.rdw.nl/resource/vezc-m2t6.json","https://opendata.rdw.nl/resource/jhie-znh9.json","https://opendata.rdw.nl/resource/kmfi-hrps.json"
"KH708L","Personenauto","HYUNDAI","I10 1,2 FL","20240909","20161217",,"MPV","5","WIT","Niet geregistreerd","4","1248","928","1410","1028",,"800","20120111","20160912","Geen verstrekking in Open Data","9195","Ja",,,,,,,"4","4",,,,,,"M1",,,"r. dwarsbalk by voorzitting","1410","PA",,,,,,"0.06","238","Nee","Nee",,"Nee","2210",,,"2023","Geen oordeel","05","Ja","2024-09-09T00:00:00.000","2016-12-17T00:00:00.000","2012-01-11T00:00:00.000","2016-09-12T00:00:00.000",,,,,,,,,,,,,,,,,,,,,,,,,,,,"https://opendata.rdw.nl/resource/3huj-srit.json","https://opendata.rdw.nl/resource/8ys7-d773.json","https://opendata.rdw.nl/resource/vezc-m2t6.json","https://opendata.rdw.nl/resource/jhie-znh9.json","https://opendata.rdw.nl/resource/kmfi-hrps.json"
"KN084J","Personenauto","HYUNDAI","I10","20241223","20230501","240","MPV","5","GRIJS","Niet geregistreerd","4","1086","983","1405","1083","400","700","20110222","20161206","Geen verstrekking in Open Data","8131","Ja",,,,,,,"4","4",,,,,,"M1",,,"r. voorzitting","1405","PAG",,,,,,"0.05","238","Nee","Nee",,"Nee","2105",,,"2023","Geen oordeel","05","Ja","2024-12-23T00:00:00.000","2023-05-01T00:00:00.000","2011-02-22T00:00:00.000","2016-12-06T00:00:00.000",,,,,,,,,,,,,,,,,,,,,,,,,,,,"https://opendata.rdw.nl/resource/3huj-srit.json","https://opendata.rdw.nl/resource/8ys7-d773.json","https://opendata.rdw.nl/resource/vezc-m2t6.json","https://opendata.rdw.nl/resource/jhie-znh9.json","https://opendata.rdw.nl/resource/kmfi-hrps.json"
"KN110S","Personenauto","HYUNDAI","I10","20250202","20231107","2868","MPV","5","ZWART","Niet geregistreerd","4","1086","900","1405","1000","400","700","20090324","20161018","Geen verstrekking in Open Data",,"Ja",,,,,,,"4","4","0","0",,"357","0","M1",,,"r. voorzitting","1405","PAG","G3 gasinstallatie","e11*2001/116*0357*00","F5P11","M51AZ1","0","0.05","238","Nee","Nee",,"Nee","2105","0",,"2024","Geen oordeel","05","Ja","2025-02-02T00:00:00.000","2023-11-07T00:00:00.000","2009-03-24T00:00:00.000","2016-10-18T00:00:00.000",,,,,,,,,,,,,,,,,,,,,"B",,,,,,,"https://opendata.rdw.nl/resource/3huj-srit.json","https://opendata.rdw.nl/resource/8ys7-d773.json","https://opendata.rdw.nl/resource/vezc-m2t6.json","https://opendata.rdw.nl/resource/jhie-znh9.json","https://opendata.rdw.nl/resource/kmfi-hrps.json"
"KP074N","Personenauto","HYUNDAI","I10","20240911","20230525","294","MPV","5","ZWART","Niet geregistreerd","4","1086","900","1405","1000","400","700","20100930","20161101","Geen verstrekking in Open Data","9095","Ja",,,,,,,"4","4",,,,,,"M1",,,"r. voorzitting","1405","PAG","Af-fabriek gasinstallatie",,,,,"0.05","238","Nee","Nee",,"Nee","2105",,,"2023","Geen oordeel","05","Ja","2024-09-11T00:00:00.000","2023-05-25T00:00:00.000","2010-09-30T00:00:00.000","2016-11-01T00:00:00.000",,,,,,,,,,,,,,,,,,,,,,,,,,,,"https://opendata.rdw.nl/resource/3huj-srit.json","https://opendata.rdw.nl/resource/8ys7-d773.json","https://opendata.rdw.nl/resource/vezc-m2t6.json","https://opendata.rdw.nl/resource/jhie-znh9.json","https://opendata.rdw.nl/resource/kmfi-hrps.json"
"KP186N","Personenauto","HYUNDAI","I10","20250114","20200505","548","MPV","5","ZWART","Niet geregistreerd","4","1086","983","1405","1083","400","700","20110727","20161028","Geen verstrekking in Open Data","8838","Ja",,,,,,,"4","4",,,,,,"M1",,,"r. voorzitting","1405","PAG","Af-fabriek gasinstallatie",,,,,"0.05","238","Nee","Nee",,"Nee","2105",,,"2024","Geen oordeel","05","Ja","2025-01-14T00:00:00.000","2020-05-05T00:00:00.000","2011-07-27T00:00:00.000","2016-10-28T00:00:00.000",,,,,,,,,,,,,,,,,,,,,,,,,,,,"https://opendata.rdw.nl/resource/3huj-srit.json","https://opendata.rdw.nl/resource/8ys7-d773.json","https://opendata.rdw.nl/resource/vezc-m2t6.json","https://opendata.rdw.nl/resource/jhie-znh9.json","https://opendata.rdw.nl/resource/kmfi-hrps.json"
"KP430N","Personenauto","HYUNDAI","I10","20240531","20230714","548","MPV","5","ZWART","Niet geregistreerd","4","1086","900","1405","1000","400","700","20110513","20161101","Geen verstrekking in Open Data","8838","Ja",,,,,,,"4","4",,,,,,"M1",,,"r. voorzitting","1405","PAG","Af-fabriek gasinstallatie",,,,,"0.05","238","Nee","Nee",,"Nee","2105",,,"2023","Geen oordeel","05","Ja","2024-05-31T00:00:00.000","2023-07-14T00:00:00.000","2011-05-13T00:00:00.000","2016-11-01T00:00:00.000",,,,,,,,,,,,,,,,,,,,,,,,,,,,"https://opendata.rdw.nl/resource/3huj-srit.json","https://opendata.rdw.nl/resource/8ys7-d773.json","https://opendata.rdw.nl/resource/vezc-m2t6.json","https://opendata.rdw.nl/resource/jhie-znh9.json","https://opendata.rdw.nl/resource/kmfi-hrps.json"
"KP829L","Personenauto","HYUNDAI","I10","20250422","20210811","144","MPV","5","ZWART","Niet geregistreerd","4","1086","900","1405","1000","400","700","20100929","20161101","Geen verstrekking in Open Data","8294","Ja",,,,,,,"4","4",,,,,,"M1",,,"r. voorzitting","1405","PAG","Af-fabriek gasinstallatie",,,,,"0.05","238","Nee","Nee",,"Nee","2105",,,"2024","Geen oordeel","05","Ja","2025-04-22T00:00:00.000","2021-08-11T00:00:00.000","2010-09-29T00:00:00.000","2016-11-01T00:00:00.000",,,,,,,,,,,,,,,,,,,,,,,,,,,,"https://opendata.rdw.nl/resource/3huj-srit.json","https://opendata.rdw.nl/resource/8ys7-d773.json","https://opendata.rdw.nl/resource/vezc-m2t6.json","https://opendata.rdw.nl/resource/jhie-znh9.json","https://opendata.rdw.nl/resource/kmfi-hrps.json"
"KR574T","Personenauto","HYUNDAI","I10","20250706","20230911","285","MPV","5","ZWART","Niet geregistreerd","4","1086","900","1405","1000","400","700","20100929","20161122","Geen verstrekking in Open Data","8490","Ja",,,,,,,"4","4",,,,,,"M1",,,"r. voorzitting","1405","PAG","Af-fabriek gasinstallatie",,,,,"0.05","238","Nee","Nee",,"Nee","2105",,,"2024","Geen oordeel","05","Ja","2025-07-06T00:00:00.000","2023-09-11T00:00:00.000","2010-09-29T00:00:00.000","2016-11-22T00:00:00.000",,,,,,,,,,,,,,,,,,,,,,,,,,,,"https://opendata.rdw.nl/resource/3huj-srit.json","https://opendata.rdw.nl/resource/8ys7-d773.json","https://opendata.rdw.nl/resource/vezc-m2t6.json","https://opendata.rdw.nl/resource/jhie-znh9.json","https://opendata.rdw.nl/resource/kmfi-hrps.json"
"KR604P","Personenauto","HYUNDAI","I10","20250228","20201118","573","MPV","5","ZWART","Niet geregistreerd","4","1086","900","1405","1000","400","700","20110215","20161108","Geen verstrekking in Open Data","9021","Ja",,,,,,,"4","4",,,,,,"M1",,,"r. voorzitting","1405","PAG","Af-fabriek gasinstallatie",,,,,"0.05","238","Nee","Nee",,"Nee","2105",,,"2024","Geen oordeel","05","Ja","2025-02-28T00:00:00.000","2020-11-18T00:00:00.000","2011-02-15T00:00:00.000","2016-11-08T00:00:00.000",,,,,,,,,,,,,,,,,,,,,,,,,,,,"https://opendata.rdw.nl/resource/3huj-srit.json","https://opendata.rdw.nl/resource/8ys7-d773.json","https://opendata.rdw.nl/resource/vezc-m2t6.json","https://opendata.rdw.nl/resource/jhie-znh9.json","https://opendata.rdw.nl/resource/kmfi-hrps.json"
"KV080B","Personenauto","HYUNDAI","I10","20250104","20170220","1646","MPV","5","WIT","Niet geregistreerd","3","998","951","1310","1051",,,"20160104","20170220","Geen verstrekking in Open Data","12495","Ja",,,,,,,"4","4",,,,,,"M1",,,"r. voorzitting","1310","IA",,,,,,"0.05","239","Nee","Nee",,"Nee",,,,"2024","Geen oordeel","05","Ja","2025-01-04T00:00:00.000","2017-02-20T00:00:00.000","2016-01-04T00:00:00.000","2017-02-20T00:00:00.000",,,,,,,,,,,,,,,,,,,,,,,,,,,,"https://opendata.rdw.nl/resource/3huj-srit.json","https://opendata.rdw.nl/resource/8ys7-d773.json","https://opendata.rdw.nl/resource/vezc-m2t6.json","https://opendata.rdw.nl/resource/jhie-znh9.json","https://opendata.rdw.nl/resource/kmfi-hrps.json"
"NG260N","Personenauto","HYUNDAI","I10","20250418","20230421","466","MPV","5","ZWART","Niet geregistreerd","4","1086","900","1405","1000","400","700","20110207","20170206","Geen verstrekking in Open Data","9767","Ja",,,,,,,"4","4","0","0",,"357","0","M1",,,"r. voorzitting","1405","PAG","Af-fabriek gasinstallatie","e11*2001/116*0357*01","F5P11","M51AZ1","0","0.05","238","Nee","Nee",,"Nee","2105","0","0.00","2024","Geen oordeel","05","Ja","2025-04-18T00:00:00.000","2023-04-21T00:00:00.000","2011-02-07T00:00:00.000","2017-02-06T00:00:00.000",,,,,,,,,,,,,,,,,,,,,"B",,,,,,,"https://opendata.rdw.nl/resource/3huj-srit.json","https://opendata.rdw.nl/resource/8ys7-d773.json","https://opendata.rdw.nl/resource/vezc-m2t6.json","https://opendata.rdw.nl/resource/jhie-znh9.json","https://opendata.rdw.nl/resource/kmfi-hrps.json"
"NG876D","Personenauto","HYUNDAI","I10","20240830","20170830","2100","MPV","5","WIT","Niet geregistreerd","3","998","908","1420","1008",,,"20140205","20170830","Geen verstrekking in Open Data","13624","Ja",,,,,,,"4","4",,,,,,"M1",,,"r. dwarsbalk by voorzitting","1420","IA",,,,,,"0.05","239","Nee","Nee",,"Nee",,,,"2023","Geen oordeel","05","Ja","2024-08-30T00:00:00.000","2017-08-30T00:00:00.000","2014-02-05T00:00:00.000","2017-08-30T00:00:00.000",,,,,,,,,,,,,,,,,,,,,,,,,,,,"https://opendata.rdw.nl/resource/3huj-srit.json","https://opendata.rdw.nl/resource/8ys7-d773.json","https://opendata.rdw.nl/resource/vezc-m2t6.json","https://opendata.rdw.nl/resource/jhie-znh9.json","https://opendata.rdw.nl/resource/kmfi-hrps.json"
"NK928D","Personenauto","HYUNDAI","I10","20240605","20170614","433","MPV","5","ZWART","Niet geregistreerd","4","1086","900","1405","1000","400","700","20110421","20170614","Geen verstrekking in Open Data","9531","Ja",,,,,,,"4","4",,,,,,"M1",,,"r. voorzitting","1405","PAG","Af-fabriek gasinstallatie",,,,,"0.05","238","Nee","Nee",,"Nee","2105",,,"2023","Geen oordeel","05","Ja","2024-06-05T00:00:00.000","2017-06-14T00:00:00.000","2011-04-21T00:00:00.000","2017-06-14T00:00:00.000",,,,,,,,,,,,,,,,,,,,,,,,,,,,"https://opendata.rdw.nl/resource/3huj-srit.json","https://opendata.rdw.nl/resource/8ys7-d773.json","https://opendata.rdw.nl/resource/vezc-m2t6.json","https://opendata.rdw.nl/resource/jhie-znh9.json","https://opendata.rdw.nl/resource/kmfi-hrps.json"
"NX980G","Personenauto","HYUNDAI","I10","20240904","20210705","900","MPV","5","GEEL","Niet geregistreerd","4","1086","983","1405","1083","400","700","20090327","20170904","Geen verstrekking in Open Data",,"Ja",,,,,,,"4","4",,,,,,"M1",,,"r. bodemplaat onder voorzitting","1405",,,,,,,"0.05","238","Nee","Nee",,"Nee",,,,"2024","Geen oordeel","05","Ja","2024-09-04T00:00:00.000","2021-07-05T00:00:00.000","2009-03-27T00:00:00.000","2017-09-04T00:00:00.000",,,,,,,,,,,,,,,,,,,,,,,,,,,,"https://opendata.rdw.nl/resource/3huj-srit.json","https://opendata.rdw.nl/resource/8ys7-d773.json","https://opendata.rdw.nl/resource/vezc-m2t6.json","https://opendata.rdw.nl/resource/jhie-znh9.json","https://opendata.rdw.nl/resource/kmfi-hrps.json"
"RD317G","Personenauto","HYUNDAI","HYUNDAI I10","20241122","20200806",,"MPV","5","ZWART","Niet geregistreerd","4","1086","983","1405","1083",,,"20101013","20171024","Geen verstrekking in Open Data","7595","Ja",,,,,,,"4","4",,,,,,"M1",,,"by r. voorzitting","1405",,,,,,,"0.05","238","Nee","Nee",,"Nee",,,,"2023","Geen oordeel","05","Ja","2024-11-22T00:00:00.000","2020-08-06T00:00:00.000","2010-10-13T00:00:00.000","2017-10-24T00:00:00.000",,,,,,,,,,,,,,,,,,,,,,,,,,,,"https://opendata.rdw.nl/resource/3huj-srit.json","https://opendata.rdw.nl/resource/8ys7-d773.json","https://opendata.rdw.nl/resource/vezc-m2t6.json","https://opendata.rdw.nl/resource/jhie-znh9.json","https://opendata.rdw.nl/resource/kmfi-hrps.json"
"RJ681L","Personenauto","HYUNDAI","I10","20240809","20221118","304","MPV","5","BLAUW","Niet geregistreerd","4","1086","946","1405","1046","400","700","20110901","20171202","Geen verstrekking in Open Data","8594","Ja",,,,,,,"4","4",,,,,,"M1",,,"r. voorzitting","1405","PAG",,,,,,"0.04","238","Nee","Nee",,"Nee","2105",,,"2023","Geen oordeel","05","Ja","2024-08-09T00:00:00.000","2022-11-18T00:00:00.000","2011-09-01T00:00:00.000","2017-12-02T00:00:00.000",,,,,,,,,,,,,,,,,,,,,,,,,,,,"https://opendata.rdw.nl/resource/3huj-srit.json","https://opendata.rdw.nl/resource/8ys7-d773.json","https://opendata.rdw.nl/resource/vezc-m2t6.json","https://opendata.rdw.nl/resource/jhie-znh9.json","https://opendata.rdw.nl/resource/kmfi-hrps.json"
"S389KJ","Personenauto","HYUNDAI","I10","20250423","20230905","240","MPV","5","BLAUW","Niet geregistreerd","4","1086","983","1405","1083","400","700","20111018","20230407","Geen verstrekking in Open Data","8593","Ja","151",,,,,,"4","4",,,,"357","160","M1",,,,"1405","PAG","G3 gasinstallatie",,,,,"0.05","238","Nee","Nee",,"Nee","2105",,,"2024","Geen oordeel","05","Ja","2025-04-23T00:00:00.000","2023-09-05T00:00:00.000","2011-10-18T00:00:00.000","2023-04-07T00:00:00.000",,,,,,,,,,,"154",,,,,,,,,,,"20221221","2022-12-21T00:00:00.000",,,,,"https://opendata.rdw.nl/resource/3huj-srit.json","https://opendata.rdw.nl/resource/8ys7-d773.json","https://opendata.rdw.nl/resource/vezc-m2t6.json","https://opendata.rdw.nl/resource/jhie-znh9.json","https://opendata.rdw.nl/resource/kmfi-hrps.json"
"TZ496T","Personenauto","HYUNDAI","I10","20241109","20181120","1968","MPV","5","BLAUW","Niet geregistreerd","4","1086","900","1405","1000",,,"20110408","20181120","Geen verstrekking in Open Data","11621","Ja",,,,,,,"4","4",,,,,,"M1",,,"r. dwarsbalk onder voorzitting","1405","PA",,,,,,"0.05","238","Nee","Nee",,"Nee",,,,"2023","Geen oordeel","05","Ja","2024-11-09T00:00:00.000","2018-11-20T00:00:00.000","2011-04-08T00:00:00.000","2018-11-20T00:00:00.000",,,,,,,,,,,,,,,,,,,,,,,,,,,,"https://opendata.rdw.nl/resource/3huj-srit.json","https://opendata.rdw.nl/resource/8ys7-d773.json","https://opendata.rdw.nl/resource/vezc-m2t6.json","https://opendata.rdw.nl/resource/jhie-znh9.json","https://opendata.rdw.nl/resource/kmfi-hrps.json"
