"kenteken","voertuigsoort","merk","handelsbenaming","vervaldatum_apk","datum_tenaamstelling","bruto_bpm","inrichting","aantal_zitplaatsen","eerste_kleur","tweede_kleur","aantal_cilinders","cilinderinhoud","massa_ledig_voertuig","toegestane_maximum_massa_voertuig","massa_rijklaar","maximum_massa_trekken_ongeremd","maximum_trekken_massa_geremd","datum_eerste_toelating","datum_eerste_tenaamstelling_in_nederland","wacht_op_keuren","catalogusprijs","wam_verzekerd","maximale_constructiesnelheid","laadvermogen","oplegger_geremd","aanhangwagen_autonoom_geremd","aanhangwagen_middenas_geremd","aantal_staanplaatsen","aantal_deuren","aantal_wielen","afstand_hart_koppeling_tot_achterzijde_voertuig","afstand_voorzijde_voertuig_tot_hart_koppeling","afwijkende_maximum_snelheid","lengte","breedte","europese_voertuigcategorie","europese_voertuigcategorie_toevoeging","europese_uitvoeringcategorie_toevoeging","plaats_chassisnummer","technische_max_massa_voertuig","type","type_gasinstallatie","typegoedkeuringsnummer","variant","uitvoering","volgnummer_wijziging_eu_typegoedkeuring","vermogen_massarijklaar","wielbasis","export_indicator","openstaande_terugroepactie_indicator","vervaldatum_tachograaf","taxi_indicator","maximum_massa_samenstelling","aantal_rolstoelplaatsen","maximum_ondersteunende_snelheid","jaar_laatste_registratie_tellerstand","tellerstandoordeel","code_toelichting_tellerstandoordeel","tenaamstellen_mogelijk","vervaldatum_apk_dt","datum_tenaamstelling_dt","datum_eerste_toelating_dt","datum_eerste_tenaamstelling_in_nederland_dt","vervaldatum_tachograaf_dt","maximum_last_onder_de_vooras_sen_tezamen_koppeling","type_remsysteem_voertuig_code","rupsonderstelconfiguratiecode","wielbasis_voertuig_minimum","wielbasis_voertuig_maximum","lengte_voertuig_minimum","lengte_voertuig_maximum","breedte_voertuig_minimum","breedte_voertuig_maximum","hoogte_voertuig","hoogte_voertuig_minimum","hoogte_voertuig_maximum","massa_bedrijfsklaar_minimaal","massa_bedrijfsklaar_maximaal","technisch_toelaatbaar_massa_koppelpunt","maximum_massa_technisch_maximaal","maximum_massa_technisch_minimaal","subcategorie_nederland","verticale_belasting_koppelpunt_getrokken_voertuig","zuinigheidsclassificatie","registratie_datum_goedkeuring_afschrijvingsmoment_bpm","registratie_datum_goedkeuring_afschrijvingsmoment_bpm_dt","gem_lading_wrde","aerodyn_voorz","massa_alt_aandr","verl_cab_ind","api_gekentekende_voertuigen_assen","api_gekentekende_voertuigen_brandstof","api_gekentekende_voertuigen_carrosserie","api_gekentekende_voertuigen_carrosserie_specifiek","api_gekentekende_voertuigen_voertuigklasse"
"00RXT1","Personenauto","FORD","GRAND C-MAX","20250310","20150312","5873","stationwagen","5","ZWART","Niet geregistreerd","4","1596","1396","2200","1496","745","1200","20110817","20110817","Geen verstrekking in Open Data","31045","Ja",,,,,,,"4","4","0","0",,"0","0","M1",,,"r. bodemplaat by voorzitting","2200","DXA",,"e13*2007/46*1103*04","JQDB1H","5CGCNF","0","0.07","279","Nee","Nee",,"Nee","3400","0","0.00","2024","Logisch","00","Ja","2025-03-10T00:00:00.000","2015-03-12T00:00:00.000","2011-08-17T00:00:00.000","2011-08-17T00:00:00.000",,,,,,,,,,,,,,,,,,,,,"B",,,,,,,"https://opendata.rdw.nl/resource/3huj-srit.json","https://opendata.rdw.nl/resource/8ys7-d773.json","https://opendata.rdw.nl/resource/vezc-m2t6.json","https://opendata.rdw.nl/resource/jhie-znh9.json","https://opendata.rdw.nl/resource/kmfi-hrps.json"
"00XHZ9","Personenauto","FORD","GRAND C-MAX","20240629","20240202","6220","stationwagen","7","ORANJE","Niet geregistreerd","4","1596","1377","2135","1477","735","750","20120629","20120629","Geen verstrekking in Open Data","28395","Ja",,,,,,,"4","4","0","0",,"452","0","M1",,,"r. bodemplaat by voorzitting","2135","DXA",,"e13*2007/46*1103*05","PNDA1H","7BGBNE","0","0.06","279","Nee","Nee",,"Nee","2885","0","0.00","2024","Logisch","00","Ja","2024-06-29T00:00:00.000","2024-02-02T00:00:00.000","2012-06-29T00:00:00.000","2012-06-29T00:00:00.000",,,,,,,,,,,,,,,,,,,,,"C",,,,,,,"https://opendata.rdw.nl/resource/3huj-srit.json","https://opendata.rdw.nl/resource/8ys7-d773.json","https://opendata.rdw.nl/resource/vezc-m2t6.json","https://opendata.rdw.nl/resource/jhie-znh9.json","https://opendata.rdw.nl/resource/kmfi-hrps.json"
"00ZDF7","Personenauto","FORD","FOCUS C-MAX","20240728","20220908","4884","stationwagen","5","GROEN","Niet geregistreerd","4","1596","1234","1855","1334","665","1200","20051018","20121008","Geen verstrekking in Open Data",,"Ja",,,,,,,"4","4","0","0",,"0","0","M1",,,"op bodemplaat by r. voorzitting","1855",,,"e13*2001/116*0109*11","HWDA1","5ABAMG","0","0.06","264","Nee","Nee",,"Nee","3055","0",,"2023","Onlogisch","04","Ja","2024-07-28T00:00:00.000","2022-09-08T00:00:00.000","2005-10-18T00:00:00.000","2012-10-08T00:00:00.000",,"0",,,,,,,,,,,,,,,,,,,"B",,,,,,,"https://opendata.rdw.nl/resource/3huj-srit.json","https://opendata.rdw.nl/resource/8ys7-d773.json","https://opendata.rdw.nl/resource/vezc-m2t6.json","https://opendata.rdw.nl/resource/jhie-znh9.json","https://opendata.rdw.nl/resource/kmfi-hrps.json"
"01JRH3","Personenauto","FORD","C-MAX","20240918","20130920","5730","stationwagen","5","BRUIN","Niet geregistreerd","4","1798","1275","1910","1375","685","1200","20090731","20090731","Geen verstrekking in Open Data","26648","Ja",,,,,,,"4","4","0","0",,"0","0","M1",,,"op bodemplaat by r. voorzitting","1910","DM2",,"e13*2001/116*0109*22","Q7DA1E","5ABAMU","0","0.07","264","Nee","Nee",,"Nee","3110","0","0.00","2023","Logisch","00","Ja","2024-09-18T00:00:00.000","2013-09-20T00:00:00.000","2009-07-31T00:00:00.000","2009-07-31T00:00:00.000",,"0",,,,,,,,,,,,,,,,,,,"C",,,,,,,"https://opendata.rdw.nl/resource/3huj-srit.json","https://opendata.rdw.nl/resource/8ys7-d773.json","https://opendata.rdw.nl/resource/vezc-m2t6.json","https://opendata.rdw.nl/resource/jhie-znh9.json","https://opendata.rdw.nl/resource/kmfi-hrps.json"
"01PLSN","Personenauto","FORD","FOCUS C-MAX","20241031","20211215","6089","stationwagen","5","GRIJS","Niet geregistreerd","4","1798","1287","1910","1387","690","1200","20040827","20040827","Geen verstrekking in Open Data",,"Ja",,,,,,,"4","4","0","0",,"0","0","M1",,,"op bodemplaat by r. voorzitting","1910",,,"e13*2001/116*0109*03","CSDA1","5BBBMK","0","0.06","264","Nee","Nee",,"Nee","3110","0",,"2023","Logisch","00","Ja","2024-10-31T00:00:00.000","2021-12-15T00:00:00.000","2004-08-27T00:00:00.000","2004-08-27T00:00:00.000",,"0",,,,,,,,,,,,,,,,,,,"B",,,,,,,"https://opendata.rdw.nl/resource/3huj-srit.json","https://opendata.rdw.nl/resource/8ys7-d773.json","https://opendata.rdw.nl/resource/vezc-m2t6.json","https://opendata.rdw.nl/resource/jhie-znh9.json","https://opendata.rdw.nl/resource/kmfi-hrps.json"
"01RHZB","Personenauto","FORD","FOCUS C-MAX","20240719","20240405","5398","stationwagen","5","ZWART","Niet geregistreerd","4","1596","1281","1855","1381","665","1200","20050412","20050412","Geen verstrekking in Open Data",,"Ja",,,,,,,"4","4","0","0",,"0","0","M1",,,"op bodemplaat by r. voorzitting","1855",,"G3 gasinstallatie","e13*2001/116*0109*06","HWDA1","5ABAMG","0","0.05","264","Nee","Nee",,"Nee","3055","0",,"2024","Logisch","00","Ja","2024-07-19T00:00:00.000","2024-04-05T00:00:00.000","2005-04-12T00:00:00.000","2005-04-12T00:00:00.000",,"0",,,,,,,,,,,,,,,,,,,"B",,,,,,,"https://opendata.rdw.nl/resource/3huj-srit.json","https://opendata.rdw.nl/resource/8ys7-d773.json","https://opendata.rdw.nl/resource/vezc-m2t6.json","https://opendata.rdw.nl/resource/jhie-znh9.json","https://opendata.rdw.nl/resource/kmfi-hrps.json"
"01RXG8","Personenauto","FORD","GRAND C-MAX","20240812","20110812","6151","stationwagen","7","ZWART","Niet geregistreerd","4","1596","1396","2200","1496","745","1200","20110812","20110812","Geen verstrekking in Open Data","33065","Ja",,,,,,,"4","4","0","0",,"0","0","M1",,,"r. bodemplaat by voorzitting","2200","DXA",,"e13*2007/46*1103*04","JQDB1H","7CGCNF","0","0.07","279","Nee","Nee",,"Nee","3400","0","0.00","2023","Logisch","00","Ja","2024-08-12T00:00:00.000","2011-08-12T00:00:00.000","2011-08-12T00:00:00.000","2011-08-12T00:00:00.000",,,,,,,,,,,,,,,,,,,,,"B",,,,,,,"https://opendata.rdw.nl/resource/3huj-srit.json","https://opendata.rdw.nl/resource/8ys7-d773.json","https://opendata.rdw.nl/resource/vezc-m2t6.json","https://opendata.rdw.nl/resource/jhie-znh9.json","https://opendata.rdw.nl/resource/kmfi-hrps.json"
"01RZB9","Personenauto","FORD","FOCUS C-MAX","20240924","20240414","5002","stationwagen","5","GRIJS","Niet geregistreerd","4","1800","1440","1910","1540","750","1200","20040129","20110816","Geen verstrekking in Open Data",,"Nee",,,,,,,"4","4",,,,,,"M1",,,"r. bodemplaat v. voorzitting","1910",,,,,,,"0.06","264","Nee","Nee",,"Nee","3110",,,"2023","Geen oordeel","05","Ja","2024-09-24T00:00:00.000","2024-04-14T00:00:00.000","2004-01-29T00:00:00.000","2011-08-16T00:00:00.000",,"0",,,,,,,,,,,,,,,,,,,,,,,,,,"https://opendata.rdw.nl/resource/3huj-srit.json","https://opendata.rdw.nl/resource/8ys7-d773.json","https://opendata.rdw.nl/resource/vezc-m2t6.json","https://opendata.rdw.nl/resource/jhie-znh9.json","https://opendata.rdw.nl/resource/kmfi-hrps.json"
"01SVVG","Personenauto","FORD","FOCUS C-MAX","20240703","20080704","5044","stationwagen","5","BLAUW","Niet geregistreerd","4","1596","1234","1855","1334","665","1200","20060526","20060526","Geen verstrekking in Open Data",,"Ja",,,,,,,"4","4","0","0",,"0","0","M1",,,"op bodemplaat by r. voorzitting","1855",,,"e13*2001/116*0109*11","HWDA1","5ABAMG","0","0.06","264","Nee","Nee",,"Nee","3055","0",,"2023","Logisch","00","Ja","2024-07-03T00:00:00.000","2008-07-04T00:00:00.000","2006-05-26T00:00:00.000","2006-05-26T00:00:00.000",,"0",,,,,,,,,,,,,,,,,,,"B",,,,,,,"https://opendata.rdw.nl/resource/3huj-srit.json","https://opendata.rdw.nl/resource/8ys7-d773.json","https://opendata.rdw.nl/resource/vezc-m2t6.json","https://opendata.rdw.nl/resource/jhie-znh9.json","https://opendata.rdw.nl/resource/kmfi-hrps.json"
"01SXFT","Personenauto","FORD","FOCUS C-MAX","20241115","20140403","7255","stationwagen","5","GRIJS","Niet geregistreerd","4","1798","1275","1910","1375","685","1200","20060530","20060530","Geen verstrekking in Open Data",,"Ja",,,,,,,"4","4","0","0",,"0","0","M1",,,"op bodemplaat by r. voorzitting","1910",,,"e13*2001/116*0109*12","QQDB1","5ABCMK","0","0.07","264","Nee","Nee",,"Nee","3110","0",,"2024","Logisch","00","Ja","2024-11-15T00:00:00.000","2014-04-03T00:00:00.000","2006-05-30T00:00:00.000","2006-05-30T00:00:00.000",,"0",,,,,,,,,,,,,,,,,,,"C",,,,,,,"https://opendata.rdw.nl/resource/3huj-srit.json","https://opendata.rdw.nl/resource/8ys7-d773.json","https://opendata.rdw.nl/resource/vezc-m2t6.json","https://opendata.rdw.nl/resource/jhie-znh9.json","https://opendata.rdw.nl/resource/kmfi-hrps.json"
"01ZDX2","Personenauto","FORD","GRAND C-MAX","20241022","20221006","7313","stationwagen","5","GRIJS","Niet geregistreerd","4","1596","1396","2200","1496","745","1200","20121022","20121022","Geen verstrekking in Open Data","34733","Ja",,,,,,,"4","4","0","0",,"452","0","M1",,,"r. bodemplaat by voorzitting","2200","DXA",,"e13*2007/46*1103*06","JQDB1H","5CGCNF","0","0.07","279","Nee","Nee",,"Nee","3400","0","0.00","2023","Logisch","00","Ja","2024-10-22T00:00:00.000","2022-10-06T00:00:00.000","2012-10-22T00:00:00.000","2012-10-22T00:00:00.000",,,,,,,,,,,,,,,,,,,,,"B",,,,,,,"https://opendata.rdw.nl/resource/3huj-srit.json","https://opendata.rdw.nl/resource/8ys7-d773.json","https://opendata.rdw.nl/resource/vezc-m2t6.json","https://opendata.rdw.nl/resource/jhie-znh9.json","https://opendata.rdw.nl/resource/kmfi-hrps.json"
"01ZVT7","Personenauto","FORD","GRAND C-MAX","20240729","20170525","3000","stationwagen","7","ZWART","Niet geregistreerd","3","998","1393","2150","1493","745","900","20130228","20130228","Geen verstrekking in Open Data","31550","Ja",,,,,,,"4","4","0","0",,"452","0","M1",,,"r. bodemplaat by voorzitting","2150","DXA",,"e13*2007/46*1103*09","M1DA1H","7CCCNH","0","0.06","279","Nee","Nee",,"Nee","3050","0","0.00","2023","Logisch","00","Ja","2024-07-29T00:00:00.000","2017-05-25T00:00:00.000","2013-02-28T00:00:00.000","2013-02-28T00:00:00.000",,,,,,,,,,,,,,,,,,,,,"A",,,,,,,"https://opendata.rdw.nl/resource/3huj-srit.json","https://opendata.rdw.nl/resource/8ys7-d773.json","https://opendata.rdw.nl/resource/vezc-m2t6.json","https://opendata.rdw.nl/resource/jhie-znh9.json","https://opendata.rdw.nl/resource/kmfi-hrps.json"
"02JGN8","Personenauto","FORD","C-MAX","20250228","20230520","5609","stationwagen","5","WIT","Niet geregistreerd","4","1798","1275","1910","1375","685","1200","20090518","20090518","Geen verstrekking in Open Data","26170","Ja",,,,,,,"4","4","0","0",,"0","0","M1",,,"op bodemplaat by r. voorzitting","1910","DM2",,"e13*2001/116*0109*22","Q7DA1E","5ABAMU","0","0.07","264","Nee","Nee",,"Nee","3110","0","0.00","2024","Logisch","00","Ja","2025-02-28T00:00:00.000","2023-05-20T00:00:00.000","2009-05-18T00:00:00.000","2009-05-18T00:00:00.000",,"0",,,,,,,,,,,,,,,,,,,"C",,,,,,,"https://opendata.rdw.nl/resource/3huj-srit.json","https://opendata.rdw.nl/resource/8ys7-d773.json","https://opendata.rdw.nl/resource/vezc-m2t6.json","https://opendata.rdw.nl/resource/jhie-znh9.json","https://opendata.rdw.nl/resource/kmfi-hrps.json"
"02KGX9","Personenauto","FORD","C-MAX","20250202","20180202","1685","stationwagen","5","GRIJS","Niet geregistreerd","4","1596","1234","1855","1334","665","1200","20090629","20100315","Geen verstrekking in Open Data",,"Ja",,,,,,,"4","4","0","0",,"0","0","M1",,,"bodemplaat r. voorzitting","1855","DM2",,"e13*2001/116*0109*22","SHDA1E","5ABCMK","0","0.06","264","Nee","Nee",,"Nee","3055","0","0.00","2024","Geen oordeel","05","Ja","2025-02-02T00:00:00.000","2018-02-02T00:00:00.000","2009-06-29T00:00:00.000","2010-03-15T00:00:00.000",,"0",,,,,,,,,,,,,,,,,,,"B",,,,,,,"https://opendata.rdw.nl/resource/3huj-srit.json","https://opendata.rdw.nl/resource/8ys7-d773.json","https://opendata.rdw.nl/resource/vezc-m2t6.json","https://opendata.rdw.nl/resource/jhie-znh9.json","https://opendata.rdw.nl/resource/kmfi-hrps.json"
"02RTS7","Personenauto","FORD","GRAND C-MAX","20240810","20110729","6054","stationwagen","5","BLAUW","Niet geregistreerd","4","1596","1396","2200","1496","745","1200","20110729","20110729","Geen verstrekking in Open Data","32365","Ja",,,,,,,"4","4","0","0",,"0","0","M1",,,"r. bodemplaat by voorzitting","2200","DXA",,"e13*2007/46*1103*04","JQDB1H","5CGCNF","0","0.07","279","Nee","Nee",,"Nee","3400","0","0.00","2024","Onlogisch","04","Ja","2024-08-10T00:00:00.000","2011-07-29T00:00:00.000","2011-07-29T00:00:00.000","2011-07-29T00:00:00.000",,,,,,,,,,,,,,,,,,,,,"B",,,,,,,"https://opendata.rdw.nl/resource/3huj-srit.json","https://opendata.rdw.nl/resource/8ys7-d773.json","https://opendata.rdw.nl/resource/vezc-m2t6.json","https://opendata.rdw.nl/resource/jhie-znh9.json","https://opendata.rdw.nl/resource/kmfi-hrps.json"
"02SNF7","Personenauto","FORD","GRAND C-MAX","20250126","20160127","6065","stationwagen","7","ZWART","Niet geregistreerd","4","1596","1396","2200","1496","745","1200","20111028","20111028","Geen verstrekking in Open Data","32445","Ja",,,,,,,"4","4","0","0",,"0","0","M1",,,"r. bodemplaat by voorzitting","2200","DXA",,"e13*2007/46*1103*04","JQDB1H","7CGCNF","0","0.07","279","Nee","Nee",,"Nee","3400","0","0.00","2024","Logisch","00","Ja","2025-01-26T00:00:00.000","2016-01-27T00:00:00.000","2011-10-28T00:00:00.000","2011-10-28T00:00:00.000",,,,,,,,,,,,,,,,,,,,,"B",,,,,,,"https://opendata.rdw.nl/resource/3huj-srit.json","https://opendata.rdw.nl/resource/8ys7-d773.json","https://opendata.rdw.nl/resource/vezc-m2t6.json","https://opendata.rdw.nl/resource/jhie-znh9.json","https://opendata.rdw.nl/resource/kmfi-hrps.json"
"02SVZS","Personenauto","FORD","FOCUS C-MAX","20250228","20240301","5920","stationwagen","5","GRIJS","Niet geregistreerd","4","1798","1275","1910","1375","685","1200","20060530","20060530","Geen verstrekking in Open Data",,"Ja",,,,,,,"4","4","0","0",,"0","0","M1",,,"op bodemplaat by r. voorzitting","1910",,,"e13*2001/116*0109*12","QQDB1","5ABCMK","0","0.07","264","Nee","Nee",,"Nee","3110","0",,"2024","Logisch","00","Ja","2025-02-28T00:00:00.000","2024-03-01T00:00:00.000","2006-05-30T00:00:00.000","2006-05-30T00:00:00.000",,"0",,,,,,,,,,,,,,,,,,,"C",,,,,,,"https://opendata.rdw.nl/resource/3huj-srit.json","https://opendata.rdw.nl/resource/8ys7-d773.json","https://opendata.rdw.nl/resource/vezc-m2t6.json","https://opendata.rdw.nl/resource/jhie-znh9.json","https://opendata.rdw.nl/resource/kmfi-hrps.json"
"02TKT2","Personenauto","FORD","GRAND C-MAX","20250223","20120223","8641","stationwagen","5","BRUIN","Niet geregistreerd","4","1997","1475","2300","1575","750","1500","20120223","20120223","Geen verstrekking in Open Data","36614","Ja",,,,,,,"4","4","0","0",,"452","0","M1",,,"r. bodemplaat by voorzitting","2300","DXA",,"e13*2007/46*1103*05","UFDB1H","5NLCPG","0","0.07","279","Nee","Nee",,"Nee","3800","0","0.00","2024","Logisch","00","Ja","2025-02-23T00:00:00.000","2012-02-23T00:00:00.000","2012-02-23T00:00:00.000","2012-02-23T00:00:00.000",,,,,,,,,,,,,,,,,,,,,"C",,,,,,,"https://opendata.rdw.nl/resource/3huj-srit.json","https://opendata.rdw.nl/resource/8ys7-d773.json","https://opendata.rdw.nl/resource/vezc-m2t6.json","https://opendata.rdw.nl/resource/jhie-znh9.json","https://opendata.rdw.nl/resource/kmfi-hrps.json"
"02ZXR8","Personenauto","FORD","GRAND C-MAX","20250425","20180718","3000","stationwagen","7","ZWART","Niet geregistreerd","3","998","1393","2150","1493","745","900","20130307","20130307","Geen verstrekking in Open Data","27885","Ja",,,,,,,"4","4","0","0",,"452","0","M1",,,"r. bodemplaat by voorzitting","2150","DXA",,"e13*2007/46*1103*09","M1DA1H","7CCCNH","0","0.06","279","Nee","Nee",,"Nee","3050","0","0.00","2024","Logisch","00","Ja","2025-04-25T00:00:00.000","2018-07-18T00:00:00.000","2013-03-07T00:00:00.000","2013-03-07T00:00:00.000",,,,,,,,,,,,,,,,,,,,,"A",,,,,,,"https://opendata.rdw.nl/resource/3huj-srit.json","https://opendata.rdw.nl/resource/8ys7-d773.json","https://opendata.rdw.nl/resource/vezc-m2t6.json","https://opendata.rdw.nl/resource/jhie-znh9.json","https://opendata.rdw.nl/resource/kmfi-hrps.json"
"03JRD8","Personenauto","FORD","C-MAX","20241121","20141111","5189","stationwagen","5","ZWART","Niet geregistreerd","4","1798","1275","1910","1375","685","1200","20090731","20090731","Geen verstrekking in Open Data","24499","Ja",,,,,,,"4","4","0","0",,"0","0","M1",,,"op bodemplaat by r. voorzitting","1910","DM2",,"e13*2001/116*0109*22","Q7DA1E","5ABAMU","0","0.07","264","Nee","Nee",,"Nee","3110","0","0.00","2023","Onlogisch","04","Ja","2024-11-21T00:00:00.000","2014-11-11T00:00:00.000","2009-07-31T00:00:00.000","2009-07-31T00:00:00.000",,"0",,,,,,,,,,,,,,,,,,,"C",,,,,,,"https://opendata.rdw.nl/resource/3huj-srit.json","https://opendata.rdw.nl/resource/8ys7-d773.json","https://opendata.rdw.nl/resource/vezc-m2t6.json","https://opendata.rdw.nl/resource/jhie-znh9.json","https://opendata.rdw.nl/resource/kmfi-hrps.json"
"03RHV6","Personenauto","FORD","GRAND C-MAX","20240531","20180315","6432","stationwagen","5","GRIJS","Niet geregistreerd","4","1596","1396","2200","1496","745","1200","20110531","20110531","Geen verstrekking in Open Data","33195","Ja",,,,,,,"4","4","0","0",,"0","0","M1",,,"r. bodemplaat by voorzitting","2200","DXA",,"e13*2007/46*1103*04","JQDA1H","5CGCNF","0","0.07","279","Nee","Nee",,"Nee","3400","0","0.00","2023","Logisch","00","Ja","2024-05-31T00:00:00.000","2018-03-15T00:00:00.000","2011-05-31T00:00:00.000","2011-05-31T00:00:00.000",,,,,,,,,,,,,,,,,,,,,"B",,,,,,,"https://opendata.rdw.nl/resource/3huj-srit.json","https://opendata.rdw.nl/resource/8ys7-d773.json","https://opendata.rdw.nl/resource/vezc-m2t6.json","https://opendata.rdw.nl/resource/jhie-znh9.json","https://opendata.rdw.nl/resource/kmfi-hrps.json"
"03RXN2","Personenauto","FORD","GRAND C-MAX","20241015","20211016","6546","stationwagen","7","ZWART","Niet geregistreerd","4","1596","1396","2200","1496","745","1200","20110816","20110816","Geen verstrekking in Open Data","35935","Ja",,,,,,,"4","4","0","0",,"0","0","M1",,,"r. bodemplaat by voorzitting","2200","DXA",,"e13*2007/46*1103*04","JQDB1H","7CGCNF","0","0.07","279","Nee","Nee",,"Nee","3400","0","0.00","2023","Logisch","00","Ja","2024-10-15T00:00:00.000","2021-10-16T00:00:00.000","2011-08-16T00:00:00.000","2011-08-16T00:00:00.000",,,,,,,,,,,,,,,,,,,,,"B",,,,,,,"https://opendata.rdw.nl/resource/3huj-srit.json","https://opendata.rdw.nl/resource/8ys7-d773.json","https://opendata.rdw.nl/resource/vezc-m2t6.json","https://opendata.rdw.nl/resource/jhie-znh9.json","https://opendata.rdw.nl/resource/kmfi-hrps.json"
"03SXT6","Personenauto","FORD","GRAND C-MAX","20250323","20180323","7551","stationwagen","7","GRIJS","Niet geregistreerd","4","1560","1404","2200","1504","750","1200","20120110","20120110","Geen verstrekking in Open Data","32336","Ja",,,,,,,"4","4","0","0",,"0","0","M1",,,"r. bodemplaat by voorzitting","2200","DXA",,"e13*2007/46*1103*04","T1DA1H","7DDCNF","0","0.06","279","Nee","Nee",,"Nee","3400","0","0.00","2024","Logisch","00","Ja","2025-03-23T00:00:00.000","2018-03-23T00:00:00.000","2012-01-10T00:00:00.000","2012-01-10T00:00:00.000",,,,,,,,,,,,,,,,,,,,,"C",,,,,,,"https://opendata.rdw.nl/resource/3huj-srit.json","https://opendata.rdw.nl/resource/8ys7-d773.json","https://opendata.rdw.nl/resource/vezc-m2t6.json","https://opendata.rdw.nl/resource/jhie-znh9.json","https://opendata.rdw.nl/resource/kmfi-hrps.json"
"03TFZ6","Personenauto","FORD","GRAND C-MAX","20240919","20230920","10119","stationwagen","5","GRIJS","Niet geregistreerd","4","1997","1534","2300","1634","750","1500","20120117","20120117","Geen verstrekking in Open Data","38815","Ja",,,,,,,"4","4","0","0",,"0","0","M1",,,"r. bodemplaat by voorzitting","2300","DXA",,"e13*2007/46*1103*04","TYDA1H","5QNCQG","0","0.05","279","Nee","Nee",,"Nee","3800","0","0.00","2023","Logisch","00","Ja","2024-09-19T00:00:00.000","2023-09-20T00:00:00.000","2012-01-17T00:00:00.000","2012-01-17T00:00:00.000",,,,,,,,,,,,,,,,,,,,,"D",,,,,,,"https://opendata.rdw.nl/resource/3huj-srit.json","https://opendata.rdw.nl/resource/8ys7-d773.json","https://opendata.rdw.nl/resource/vezc-m2t6.json","https://opendata.rdw.nl/resource/jhie-znh9.json","https://opendata.rdw.nl/resource/kmfi-hrps.json"
"03TSFK","Personenauto","FORD","FOCUS C-MAX","20220127","20230124","6787","stationwagen","5","ZWART","Niet geregistreerd","4","1798","1356","1930","1456","700","1000","20070117","20070117","Geen verstrekking in Open Data",,"Ja",,,,,,,"4","4","0","0",,"0","0","M1",,,"op bodemplaat by r. voorzitting","1930",,"G3 gasinstallatie","e13*2001/116*0109*14","QQDB1","5EECNN","0","0.06","264","Nee","Nee",,"Nee","2930","0",,"2023","Onlogisch","04","Ja","2022-01-27T00:00:00.000","2023-01-24T00:00:00.000","2007-01-17T00:00:00.000","2007-01-17T00:00:00.000",,"0",,,,,,,,,,,,,,,,,,,"C",,,,,,,"https://opendata.rdw.nl/resource/3huj-srit.json","https://opendata.rdw.nl/resource/8ys7-d773.json","https://opendata.rdw.nl/resource/vezc-m2t6.json","https://opendata.rdw.nl/resource/jhie-znh9.json","https://opendata.rdw.nl/resource/kmfi-hrps.json"
"03XLH1","Personenauto","FORD","GRAND C-MAX","20241226","20240420","6662","stationwagen","7","BRUIN","Niet geregistreerd","4","1596","1396","2200","1496","745","1200","20120702","20120702","Geen verstrekking in Open Data","26608","Nee",,,,,,,"4","4","0","0",,"452","0","M1",,,"r. bodemplaat by voorzitting","2200","DXA",,"e13*2007/46*1103*05","JQDB1H","7CGCNF","0","0.07","279","Nee","Nee",,"Nee","3400","0","0.00","2024","Geen oordeel","05","Ja","2024-12-26T00:00:00.000","2024-04-20T00:00:00.000","2012-07-02T00:00:00.000","2012-07-02T00:00:00.000",,,,,,,,,,,,,,,,,,,,,"B",,,,,,,"https://opendata.rdw.nl/resource/3huj-srit.json","https://opendata.rdw.nl/resource/8ys7-d773.json","https://opendata.rdw.nl/resource/vezc-m2t6.json","https://opendata.rdw.nl/resource/jhie-znh9.json","https://opendata.rdw.nl/resource/kmfi-hrps.json"