"kenteken","voertuigsoort","merk","handelsbenaming","vervaldatum_apk","datum_tenaamstelling","bruto_bpm","inrichting","aantal_zitplaatsen","eerste_kleur","tweede_kleur","aantal_cilinders","cilinderinhoud","massa_ledig_voertuig","toegestane_maximum_massa_voertuig","massa_rijklaar","maximum_massa_trekken_ongeremd","maximum_trekken_massa_geremd","datum_eerste_toelating","datum_eerste_tenaamstelling_in_nederland","wacht_op_keuren","catalogusprijs","wam_verzekerd","maximale_constructiesnelheid","laadvermogen","oplegger_geremd","aanhangwagen_autonoom_geremd","aanhangwagen_middenas_geremd","aantal_staanplaatsen","aantal_deuren","aantal_wielen","afstand_hart_koppeling_tot_achterzijde_voertuig","afstand_voorzijde_voertuig_tot_hart_koppeling","afwijkende_maximum_snelheid","lengte","breedte","europese_voertuigcategorie","europese_voertuigcategorie_toevoeging","europese_uitvoeringcategorie_toevoeging","plaats_chassisnummer","technische_max_massa_voertuig","type","type_gasinstallatie","typegoedkeuringsnummer","variant","uitvoering","volgnummer_wijziging_eu_typegoedkeuring","vermogen_massarijklaar","wielbasis","export_indicator","openstaande_terugroepactie_indicator","vervaldatum_tachograaf","taxi_indicator","maximum_massa_samenstelling","aantal_rolstoelplaatsen","maximum_ondersteunende_snelheid","jaar_laatste_registratie_tellerstand","tellerstandoordeel","code_toelichting_tellerstandoordeel","tenaamstellen_mogelijk","vervaldatum_apk_dt","datum_tenaamstelling_dt","datum_eerste_toelating_dt","datum_eerste_tenaamstelling_in_nederland_dt","vervaldatum_tachograaf_dt","maximum_last_onder_de_vooras_sen_tezamen_koppeling","type_remsysteem_voertuig_code","rupsonderstelconfiguratiecode","wielbasis_voertuig_minimum","wielbasis_voertuig_maximum","lengte_voertuig_minimum","lengte_voertuig_maximum","breedte_voertuig_minimum","breedte_voertuig_maximum","hoogte_voertuig","hoogte_voertuig_minimum","hoogte_voertuig_maximum","massa_bedrijfsklaar_minimaal","massa_bedrijfsklaar_maximaal","technisch_toelaatbaar_massa_koppelpunt","maximum_massa_technisch_maximaal","maximum_massa_technisch_minimaal","subcategorie_nederland","verticale_belasting_koppelpunt_getrokken_voertuig","zuinigheidsclassificatie","registratie_datum_goedkeuring_afschrijvingsmoment_bpm","registratie_datum_goedkeuring_afschrijvingsmoment_bpm_dt","gem_lading_wrde","aerodyn_voorz","massa_alt_aandr","verl_cab_ind","api_gekentekende_voertuigen_assen","api_gekentekende_voertuigen_brandstof","api_gekentekende_voertuigen_carrosserie","api_gekentekende_voertuigen_carrosserie_specifiek","api_gekentekende_voertuigen_voertuigklasse"
"G092HG","Personenauto","FORD","TOURNEO CONNECT","20240722","20191124","2476","MPV","7","GRIJS","Niet geregistreerd","4","1499","1505","2325","1605","750","959","20170713","20190924","Geen verstrekking in Open Data","46248","Ja","169",,,,,,"4","4","0","0",,"0","184","M1",,,,"2325","PJ2",,"e1*2001/116*0207*24","XWGB1BSX","E7EHBZCBSAPP","0","0.05","306","Nee","Nee",,"Nee","3100","0","0.00","2023","Geen oordeel","05","Ja","2024-07-22T00:00:00.000","2019-11-24T00:00:00.000","2017-07-13T00:00:00.000","2019-09-24T00:00:00.000",,,,,,,,,,,"184",,,,,,,,,,"E",,,,,,,"https://opendata.rdw.nl/resource/3huj-srit.json","https://opendata.rdw.nl/resource/8ys7-d773.json","https://opendata.rdw.nl/resource/vezc-m2t6.json","https://opendata.rdw.nl/resource/jhie-znh9.json","https://opendata.rdw.nl/resource/kmfi-hrps.json"
"G751GS","Personenauto","FORD","TOURNEO CONNECT","20240919","20220421","425","MPV","5","GRIJS","Niet geregistreerd","3","998","1392","2000","1492","735","1200","20171128","20191102","Geen verstrekking in Open Data","29699","Ja","165",,,,,,"4","4","0","0",,"0","184","M1",,,,"2000","PJ2",,"e1*2001/116*0207*25","M2GB1BSX","B5AFAZBBSANA","0","0.05","266","Nee","Nee",,"Nee","3145","0","0.00","2022","Geen oordeel","05","Ja","2024-09-19T00:00:00.000","2022-04-21T00:00:00.000","2017-11-28T00:00:00.000","2019-11-02T00:00:00.000",,,,,,,,,,,"185",,,,,,,,,,"C",,,,,,,"https://opendata.rdw.nl/resource/3huj-srit.json","https://opendata.rdw.nl/resource/8ys7-d773.json","https://opendata.rdw.nl/resource/vezc-m2t6.json","https://opendata.rdw.nl/resource/jhie-znh9.json","https://opendata.rdw.nl/resource/kmfi-hrps.json"
"H032JJ","Personenauto","FORD","TOURNEO CONNECT","20250316","20200316","4727","MPV","5","GRIJS","Niet geregistreerd","3","998","1434","2000","1534","750","1200","20151214","20200316","Geen verstrekking in Open Data","24299","Ja","165",,,,,,"4","4","0","0",,"442","184","M1",,,,"2000","PJ2",,"e1*2001/116*0207*21","M2GB1BHX","B5AFAZBBSANA","0","0.05","266","Nee","Nee",,"Nee","3145","0",,"2024","Geen oordeel","05","Ja","2025-03-16T00:00:00.000","2020-03-16T00:00:00.000","2015-12-14T00:00:00.000","2020-03-16T00:00:00.000",,,,,,,,,,,"185",,,,,,,,,,"B",,,,,,,"https://opendata.rdw.nl/resource/3huj-srit.json","https://opendata.rdw.nl/resource/8ys7-d773.json","https://opendata.rdw.nl/resource/vezc-m2t6.json","https://opendata.rdw.nl/resource/jhie-znh9.json","https://opendata.rdw.nl/resource/kmfi-hrps.json"
"H089KP","Personenauto","FORD","TOURNEO CONNECT","20241027","20201102","2239","MPV","7","GRIJS","Niet geregistreerd","4","1499","1528","2330","1628","750","1037","20151026","20200227","Geen verstrekking in Open Data","37950","Ja","173",,,,,,"4","4","0","0",,"482","184","M1",,,,"2330","PJ2",,"e1*2001/116*0207*20","XWGA1BHX","E7AGBZCBSAPG","0","0.05","306","Nee","Ja",,"Nee","3200","0",,"2023","Geen oordeel","05","Ja","2024-10-27T00:00:00.000","2020-11-02T00:00:00.000","2015-10-26T00:00:00.000","2020-02-27T00:00:00.000",,,,,,,,,,,"184",,,,,,,,,,"C",,,,,,,"https://opendata.rdw.nl/resource/3huj-srit.json","https://opendata.rdw.nl/resource/8ys7-d773.json","https://opendata.rdw.nl/resource/vezc-m2t6.json","https://opendata.rdw.nl/resource/jhie-znh9.json","https://opendata.rdw.nl/resource/kmfi-hrps.json"
"H356FS","Personenauto","FORD","TOURNEO CONNECT","20240601","20200205","380","MPV","5","WIT","Niet geregistreerd","3","998","1392","2000","1492","735","1200","20180601","20200205","Geen verstrekking in Open Data","25700","Ja","165",,,,,,"4","4","0","0",,"0","184","M1",,,,"2000","PJ2",,"e1*2001/116*0207*25","M2GB1BSX","B5AFAZBBSANA","0","0.05","266","Nee","Nee",,"Nee","3145","0","0.00","2023","Geen oordeel","05","Ja","2024-06-01T00:00:00.000","2020-02-05T00:00:00.000","2018-06-01T00:00:00.000","2020-02-05T00:00:00.000",,,,,,,,,,,"185",,,,,,,,,,"C",,,,,,,"https://opendata.rdw.nl/resource/3huj-srit.json","https://opendata.rdw.nl/resource/8ys7-d773.json","https://opendata.rdw.nl/resource/vezc-m2t6.json","https://opendata.rdw.nl/resource/jhie-znh9.json","https://opendata.rdw.nl/resource/kmfi-hrps.json"
"H375PG","Personenauto","FORD","TOURNEO CONNECT","20250419","20200320","3180","MPV","5","ZWART","Niet geregistreerd","3","998","1402","2000","1502","750","1022","20160419","20200320","Geen verstrekking in Open Data","23555","Ja","165",,,,,,"4","4","0","0",,"442","184","M1",,,"r. bodemplaat v. voorzitting","2000","PJ2",,"e1*2001/116*0207*21","M2GB1BEX","B5AFAZBBSANA","0","0.05","266","Nee","Nee",,"Nee","2910","0","0.00","2024","Geen oordeel","05","Ja","2025-04-19T00:00:00.000","2020-03-20T00:00:00.000","2016-04-19T00:00:00.000","2020-03-20T00:00:00.000",,,,,,,,,,,"185",,,,,,,,,,"C",,,,,,,"https://opendata.rdw.nl/resource/3huj-srit.json","https://opendata.rdw.nl/resource/8ys7-d773.json","https://opendata.rdw.nl/resource/vezc-m2t6.json","https://opendata.rdw.nl/resource/jhie-znh9.json","https://opendata.rdw.nl/resource/kmfi-hrps.json"
"HB824K","Personenauto","FORD","TOURNEO CONNECT","20250308","20210309","4727","MPV","5","GRIJS","Niet geregistreerd","3","998","1434","2000","1534","750","981","20151006","20151006","Geen verstrekking in Open Data","26050","Ja",,,,,,,"0","4","0","0",,"442","0","M1",,,"op r. bodemplaat onder voorzitting","2000","PJ2",,"e1*2001/116*0207*20","M2GB1BHX","B5AFAZBBSANA","0","0.05","266","Nee","Nee",,"Nee","2900","0",,"2024","Logisch","00","Ja","2025-03-08T00:00:00.000","2021-03-09T00:00:00.000","2015-10-06T00:00:00.000","2015-10-06T00:00:00.000",,,,,,,,,,,,,,,,,,,,,"B",,,,,,,"https://opendata.rdw.nl/resource/3huj-srit.json","https://opendata.rdw.nl/resource/8ys7-d773.json","https://opendata.rdw.nl/resource/vezc-m2t6.json","https://opendata.rdw.nl/resource/jhie-znh9.json","https://opendata.rdw.nl/resource/kmfi-hrps.json"
"HF758K","Personenauto","FORD","TOURNEO CONNECT","20241022","20170831","4727","MPV","5","ZWART","Niet geregistreerd","3","998","1434","2000","1534","750","981","20151022","20151022","Geen verstrekking in Open Data","26851","Ja",,,,,,,"0","4","0","0",,"442","0","M1",,,"op r. bodemplaat onder voorzitting","2000","PJ2",,"e1*2001/116*0207*20","M2GB1BHX","B5AFAZBBSANA","0","0.05","266","Nee","Nee",,"Nee","2900","0",,"2023","Logisch","00","Ja","2024-10-22T00:00:00.000","2017-08-31T00:00:00.000","2015-10-22T00:00:00.000","2015-10-22T00:00:00.000",,,,,,,,,,,,,,,,,,,,,"B",,,,,,,"https://opendata.rdw.nl/resource/3huj-srit.json","https://opendata.rdw.nl/resource/8ys7-d773.json","https://opendata.rdw.nl/resource/vezc-m2t6.json","https://opendata.rdw.nl/resource/jhie-znh9.json","https://opendata.rdw.nl/resource/kmfi-hrps.json"
"HG346S","Personenauto","FORD","TOURNEO CONNECT","20241111","20170422","7821","MPV","7","GRIJS","Niet geregistreerd","4","1499","1528","2330","1628","750","1037","20151103","20151103","Geen verstrekking in Open Data","38877","Ja",,,,,,,"0","4","0","0",,"482","0","M1",,,"op r. bodemplaat onder voorzitting","2330","PJ2",,"e1*2001/116*0207*21","XWGA1BHX","E7AGBZCBSAPG","0","0.05","306","Nee","Nee",,"Nee","3200","0",,"2023","Logisch","00","Ja","2024-11-11T00:00:00.000","2017-04-22T00:00:00.000","2015-11-03T00:00:00.000","2015-11-03T00:00:00.000",,,,,,,,,,,,,,,,,,,,,"C",,,,,,,"https://opendata.rdw.nl/resource/3huj-srit.json","https://opendata.rdw.nl/resource/8ys7-d773.json","https://opendata.rdw.nl/resource/vezc-m2t6.json","https://opendata.rdw.nl/resource/jhie-znh9.json","https://opendata.rdw.nl/resource/kmfi-hrps.json"
"HG874V","Personenauto","FORD","TOURNEO CONNECT","20250501","20200709","4727","MPV","5","WIT","Niet geregistreerd","3","998","1434","2000","1534","750","981","20151031","20151031","Geen verstrekking in Open Data","25800","Ja",,,,,,,"0","4","0","0",,"442","0","M1",,,"op r. bodemplaat onder voorzitting","2000","PJ2",,"e1*2001/116*0207*20","M2GB1BHX","B5AFAZBBSANA","0","0.05","266","Nee","Nee",,"Nee","2900","0",,"2024","Logisch","00","Ja","2025-05-01T00:00:00.000","2020-07-09T00:00:00.000","2015-10-31T00:00:00.000","2015-10-31T00:00:00.000",,,,,,,,,,,,,,,,,,,,,"B",,,,,,,"https://opendata.rdw.nl/resource/3huj-srit.json","https://opendata.rdw.nl/resource/8ys7-d773.json","https://opendata.rdw.nl/resource/vezc-m2t6.json","https://opendata.rdw.nl/resource/jhie-znh9.json","https://opendata.rdw.nl/resource/kmfi-hrps.json"
"HH175P","Personenauto","FORD","TOURNEO CONNECT","20241113","20160910","4727","MPV","5","BLAUW","Niet geregistreerd","3","998","1434","2000","1534","750","981","20151107","20151107","Geen verstrekking in Open Data","27550","Ja",,,,,,,"0","4","0","0",,"442","0","M1",,,"op r. bodemplaat onder voorzitting","2000","PJ2",,"e1*2001/116*0207*20","M2GB1BHX","B5AFAZBBSANA","0","0.05","266","Nee","Nee",,"Nee","2900","0",,"2024","Logisch","00","Ja","2024-11-13T00:00:00.000","2016-09-10T00:00:00.000","2015-11-07T00:00:00.000","2015-11-07T00:00:00.000",,,,,,,,,,,,,,,,,,,,,"B",,,,,,,"https://opendata.rdw.nl/resource/3huj-srit.json","https://opendata.rdw.nl/resource/8ys7-d773.json","https://opendata.rdw.nl/resource/vezc-m2t6.json","https://opendata.rdw.nl/resource/jhie-znh9.json","https://opendata.rdw.nl/resource/kmfi-hrps.json"
"HH983T","Personenauto","FORD","TOURNEO CONNECT","20241125","20240422","9801","MPV","7","GRIJS","Niet geregistreerd","4","1499","1551","2320","1651","750","913","20151104","20151104","Geen verstrekking in Open Data","40726","Ja",,,,,,,"0","4","0","0",,"482","0","M1",,,"op r. bodemplaat onder voorzitting","2320","PJ2",,"e1*2001/116*0207*20","XWGB1BHX","E7EHBZCBSAPF","0","0.05","306","Nee","Nee",,"Nee","3100","0",,"2024","Logisch","00","Ja","2024-11-25T00:00:00.000","2024-04-22T00:00:00.000","2015-11-04T00:00:00.000","2015-11-04T00:00:00.000",,,,,,,,,,,,,,,,,,,,,"C",,,,,,,"https://opendata.rdw.nl/resource/3huj-srit.json","https://opendata.rdw.nl/resource/8ys7-d773.json","https://opendata.rdw.nl/resource/vezc-m2t6.json","https://opendata.rdw.nl/resource/jhie-znh9.json","https://opendata.rdw.nl/resource/kmfi-hrps.json"
"HJ726L","Personenauto","FORD","TOURNEO CONNECT","20240712","20171028","4727","MPV","5","ZWART","Niet geregistreerd","3","998","1434","2000","1534","750","1200","20151113","20151113","Geen verstrekking in Open Data","24800","Ja",,,,,,,"0","4","0","0",,"442","0","M1",,,"op r. bodemplaat onder voorzitting","2000","PJ2",,"e1*2001/116*0207*21","M2GB1BHX","B5AFAZBBSANA","0","0.05","266","Nee","Nee",,"Nee","3145","0",,"2023","Logisch","00","Ja","2024-07-12T00:00:00.000","2017-10-28T00:00:00.000","2015-11-13T00:00:00.000","2015-11-13T00:00:00.000",,,,,,,,,,,,,,,,,,,,,"B",,,,,,,"https://opendata.rdw.nl/resource/3huj-srit.json","https://opendata.rdw.nl/resource/8ys7-d773.json","https://opendata.rdw.nl/resource/vezc-m2t6.json","https://opendata.rdw.nl/resource/jhie-znh9.json","https://opendata.rdw.nl/resource/kmfi-hrps.json"
"HJ731J","Personenauto","FORD","TOURNEO CONNECT","20241115","20151113","4727","MPV","5","ROOD","Niet geregistreerd","3","998","1434","2000","1534","750","1200","20151113","20151113","Geen verstrekking in Open Data","24300","Ja",,,,,,,"0","4","0","0",,"442","0","M1",,,"op r. bodemplaat onder voorzitting","2000","PJ2",,"e1*2001/116*0207*21","M2GB1BHX","B5AFAZBBSANA","0","0.05","266","Nee","Nee",,"Nee","3145","0",,"2024","Logisch","00","Ja","2024-11-15T00:00:00.000","2015-11-13T00:00:00.000","2015-11-13T00:00:00.000","2015-11-13T00:00:00.000",,,,,,,,,,,,,,,,,,,,,"B",,,,,,,"https://opendata.rdw.nl/resource/3huj-srit.json","https://opendata.rdw.nl/resource/8ys7-d773.json","https://opendata.rdw.nl/resource/vezc-m2t6.json","https://opendata.rdw.nl/resource/jhie-znh9.json","https://opendata.rdw.nl/resource/kmfi-hrps.json"
"HK111L","Personenauto","FORD","TOURNEO CONNECT","20241123","20151123","4727","MPV","5","GEEL","Niet geregistreerd","3","998","1434","2000","1534","750","1200","20151123","20151123","Geen verstrekking in Open Data","25176","Ja",,,,,,,"0","4","0","0",,"442","0","M1",,,"op r. bodemplaat onder voorzitting","2000","PJ2",,"e1*2001/116*0207*21","M2GB1BHX","B5AFAZBBSANA","0","0.05","266","Nee","Nee",,"Nee","3145","0",,"2023","Logisch","00","Ja","2024-11-23T00:00:00.000","2015-11-23T00:00:00.000","2015-11-23T00:00:00.000","2015-11-23T00:00:00.000",,,,,,,,,,,,,,,,,,,,,"B",,,,,,,"https://opendata.rdw.nl/resource/3huj-srit.json","https://opendata.rdw.nl/resource/8ys7-d773.json","https://opendata.rdw.nl/resource/vezc-m2t6.json","https://opendata.rdw.nl/resource/jhie-znh9.json","https://opendata.rdw.nl/resource/kmfi-hrps.json"
"HL261H","Personenauto","FORD","TOURNEO CONNECT","20250506","20151126","4727","MPV","5","GRIJS","Niet geregistreerd","3","998","1434","2000","1534","750","1200","20151126","20151126","Geen verstrekking in Open Data","26050","Ja",,,,,,,"4","4","0","0",,"442","184","M1",,,"in bodemplaat r. v.","2000","PJ2",,"e1*2001/116*0207*21","M2GB1BHX","B5AFAZBBSANA","0","0.05","266","Nee","Nee",,"Nee","3145","0",,"2024","Logisch","00","Ja","2025-05-06T00:00:00.000","2015-11-26T00:00:00.000","2015-11-26T00:00:00.000","2015-11-26T00:00:00.000",,,,,,,,,,,"185",,,,,,,,,,"B",,,,,,,"https://opendata.rdw.nl/resource/3huj-srit.json","https://opendata.rdw.nl/resource/8ys7-d773.json","https://opendata.rdw.nl/resource/vezc-m2t6.json","https://opendata.rdw.nl/resource/jhie-znh9.json","https://opendata.rdw.nl/resource/kmfi-hrps.json"
"HN256V","Personenauto","FORD","TOURNEO CONNECT","20241215","20151211","4727","MPV","5","GRIJS","Niet geregistreerd","3","998","1434","2000","1534","750","1200","20151211","20151211","Geen verstrekking in Open Data","27600","Ja",,,,,,,"4","4","0","0",,"442","184","M1",,,"in bodemplaat r. v.","2000","PJ2",,"e1*2001/116*0207*21","M2GB1BHX","B5AFAZBBSANA","0","0.05","266","Nee","Nee",,"Nee","3145","0",,"2023","Logisch","00","Ja","2024-12-15T00:00:00.000","2015-12-11T00:00:00.000","2015-12-11T00:00:00.000","2015-12-11T00:00:00.000",,,,,,,,,,,"185",,,,,,,,,,"B",,,,,,,"https://opendata.rdw.nl/resource/3huj-srit.json","https://opendata.rdw.nl/resource/8ys7-d773.json","https://opendata.rdw.nl/resource/vezc-m2t6.json","https://opendata.rdw.nl/resource/jhie-znh9.json","https://opendata.rdw.nl/resource/kmfi-hrps.json"
"HR096S","Personenauto","FORD","TOURNEO CONNECT","20241222","20151222","4727","MPV","5","BLAUW","Niet geregistreerd","3","998","1434","2000","1534","750","1200","20151222","20151222","Geen verstrekking in Open Data","25350","Ja",,,,,,,"4","4","0","0",,"442","184","M1",,,"in bodemplaat r. v.","2000","PJ2",,"e1*2001/116*0207*21","M2GB1BHX","B5AFAZBBSANA","0","0.05","266","Nee","Ja",,"Nee","3145","0",,"2023","Logisch","00","Ja","2024-12-22T00:00:00.000","2015-12-22T00:00:00.000","2015-12-22T00:00:00.000","2015-12-22T00:00:00.000",,,,,,,,,,,"185",,,,,,,,,,"B",,,,,,,"https://opendata.rdw.nl/resource/3huj-srit.json","https://opendata.rdw.nl/resource/8ys7-d773.json","https://opendata.rdw.nl/resource/vezc-m2t6.json","https://opendata.rdw.nl/resource/jhie-znh9.json","https://opendata.rdw.nl/resource/kmfi-hrps.json"
"HZ371K","Personenauto","FORD","TOURNEO CONNECT","20250115","20181213","5364","MPV","5","BLAUW","Niet geregistreerd","3","998","1434","2000","1534","750","1200","20160115","20160115","Geen verstrekking in Open Data","26950","Ja",,,,,,,"4","4","0","0",,"442","184","M1",,,"in bodemplaat r. v.","2000","PJ2",,"e1*2001/116*0207*21","M2GB1BHX","B5AFAZBBSANA","0","0.05","266","Nee","Nee",,"Nee","3145","0",,"2023","Logisch","00","Ja","2025-01-15T00:00:00.000","2018-12-13T00:00:00.000","2016-01-15T00:00:00.000","2016-01-15T00:00:00.000",,,,,,,,,,,"185",,,,,,,,,,"C",,,,,,,"https://opendata.rdw.nl/resource/3huj-srit.json","https://opendata.rdw.nl/resource/8ys7-d773.json","https://opendata.rdw.nl/resource/vezc-m2t6.json","https://opendata.rdw.nl/resource/jhie-znh9.json","https://opendata.rdw.nl/resource/kmfi-hrps.json"
"J019TN","Personenauto","FORD","TOURNEO CONNECT","20251201","20231110","1913","MPV","5","ZWART","Niet geregistreerd","3","998","1392","2000","1492","735","1200","20170517","20201114","Geen verstrekking in Open Data","24849","Ja","165",,,,,,"4","4","0","0",,"0","184","M1",,,,"2000","PJ2",,"e1*2001/116*0207*24","M2GB1BSX","B5AFAZBBSANA","0","0.05","266","Nee","Nee",,"Nee","3145","0","0.00","2023","Geen oordeel","05","Ja","2025-12-01T00:00:00.000","2023-11-10T00:00:00.000","2017-05-17T00:00:00.000","2020-11-14T00:00:00.000",,,,,,,,,,,"185",,,,,,,,,,"C",,,,,,,"https://opendata.rdw.nl/resource/3huj-srit.json","https://opendata.rdw.nl/resource/8ys7-d773.json","https://opendata.rdw.nl/resource/vezc-m2t6.json","https://opendata.rdw.nl/resource/jhie-znh9.json","https://opendata.rdw.nl/resource/kmfi-hrps.json"
"J095VN","Personenauto","FORD","TOURNEO CONNECT","20241110","20201112","656","MPV","5","ZWART","Niet geregistreerd","3","998","1393","2000","1493","735","1200","20160714","20201112","Geen verstrekking in Open Data","26699","Ja","165",,,,,,"4","4","0","0",,"442","184","M1",,,,"2000","PJ2",,"e1*2001/116*0207*22","M2GB1BSX","B5AFAZBBSANA","0","0.05","266","Nee","Nee",,"Nee","3145","0","0.00","2023","Geen oordeel","05","Ja","2024-11-10T00:00:00.000","2020-11-12T00:00:00.000","2016-07-14T00:00:00.000","2020-11-12T00:00:00.000",,,,,,,,,,,"185",,,,,,,,,,"C",,,,,,,"https://opendata.rdw.nl/resource/3huj-srit.json","https://opendata.rdw.nl/resource/8ys7-d773.json","https://opendata.rdw.nl/resource/vezc-m2t6.json","https://opendata.rdw.nl/resource/jhie-znh9.json","https://opendata.rdw.nl/resource/kmfi-hrps.json"
"J251PB","Personenauto","FORD","TOURNEO CONNECT","20250312","20210312","922","MPV","5","ZWART","Niet geregistreerd","3","998","1392","2000","1492","735","1200","20160728","20201002","Geen verstrekking in Open Data","27721","Ja","165",,,,,,"4","4","0","0",,"442","184","M1",,,,"2000","PJ2",,"e1*2001/116*0207*23","M2GB1BSX","B5AFAZBBSANA","0","0.05","266","Nee","Nee",,"Nee","3145","0","0.00","2023","Geen oordeel","05","Ja","2025-03-12T00:00:00.000","2021-03-12T00:00:00.000","2016-07-28T00:00:00.000","2020-10-02T00:00:00.000",,,,,,,,,,,"185",,,,,,,,,,"C",,,,,,,"https://opendata.rdw.nl/resource/3huj-srit.json","https://opendata.rdw.nl/resource/8ys7-d773.json","https://opendata.rdw.nl/resource/vezc-m2t6.json","https://opendata.rdw.nl/resource/jhie-znh9.json","https://opendata.rdw.nl/resource/kmfi-hrps.json"
"JD649R","Personenauto","FORD","TOURNEO CONNECT","20250222","20220706","5364","MPV","5","GRIJS","Niet geregistreerd","3","998","1434","2000","1534","750","1200","20160220","20160220","Geen verstrekking in Open Data","27501","Ja",,,,,,,"4","4","0","0",,"442","184","M1",,,"in bodemplaat r. v.","2000","PJ2",,"e1*2001/116*0207*21","M2GB1BHX","B5AFAZBBSANA","0","0.05","266","Nee","Nee",,"Nee","3145","0",,"2024","Logisch","00","Ja","2025-02-22T00:00:00.000","2022-07-06T00:00:00.000","2016-02-20T00:00:00.000","2016-02-20T00:00:00.000",,,,,,,,,,,"185",,,,,,,,,,"C",,,,,,,"https://opendata.rdw.nl/resource/3huj-srit.json","https://opendata.rdw.nl/resource/8ys7-d773.json","https://opendata.rdw.nl/resource/vezc-m2t6.json","https://opendata.rdw.nl/resource/jhie-znh9.json","https://opendata.rdw.nl/resource/kmfi-hrps.json"
"JD678V","Personenauto","FORD","TOURNEO CONNECT","20250313","20160304","6934","MPV","5","BLAUW","Niet geregistreerd","4","1499","1468","2045","1568","750","1192","20160304","20160304","Geen verstrekking in Open Data","34300","Ja",,,,,,,"4","4","0","0",,"442","184","M1",,,"in bodemplaat r. v.","2045","PJ2",,"e1*2001/116*0207*21","XVGA1BHX","B5CDAZCBSANC","0","0.05","266","Nee","Nee",,"Nee","3145","0","0.00","2024","Logisch","00","Ja","2025-03-13T00:00:00.000","2016-03-04T00:00:00.000","2016-03-04T00:00:00.000","2016-03-04T00:00:00.000",,,,,,,,,,,"185",,,,,,,,,,"E",,,,,,,"https://opendata.rdw.nl/resource/3huj-srit.json","https://opendata.rdw.nl/resource/8ys7-d773.json","https://opendata.rdw.nl/resource/vezc-m2t6.json","https://opendata.rdw.nl/resource/jhie-znh9.json","https://opendata.rdw.nl/resource/kmfi-hrps.json"
"JG134G","Personenauto","FORD","TOURNEO CONNECT","20250309","20170413","5364","MPV","5","WIT","Niet geregistreerd","3","998","1434","2000","1534","750","1200","20160309","20160309","Geen verstrekking in Open Data","25351","Ja",,,,,,,"4","4","0","0",,"442","184","M1",,,"in bodemplaat r. v.","2000","PJ2",,"e1*2001/116*0207*21","M2GB1BHX","B5AFAZBBSANA","0","0.05","266","Nee","Nee",,"Nee","3145","0",,"2024","Logisch","00","Ja","2025-03-09T00:00:00.000","2017-04-13T00:00:00.000","2016-03-09T00:00:00.000","2016-03-09T00:00:00.000",,,,,,,,,,,"185",,,,,,,,,,"C",,,,,,,"https://opendata.rdw.nl/resource/3huj-srit.json","https://opendata.rdw.nl/resource/8ys7-d773.json","https://opendata.rdw.nl/resource/vezc-m2t6.json","https://opendata.rdw.nl/resource/jhie-znh9.json","https://opendata.rdw.nl/resource/kmfi-hrps.json"
"JH743B","Personenauto","FORD","TOURNEO CONNECT","20250325","20160325","5364","MPV","5","BLAUW","Niet geregistreerd","3","998","1434","2000","1534","750","1200","20160325","20160325","Geen verstrekking in Open Data","27501","Ja",,,,,,,"4","4","0","0",,"442","184","M1",,,"in bodemplaat r. v.","2000","PJ2",,"e1*2001/116*0207*21","M2GB1BHX","B5AFAZBBSANA","0","0.05","266","Nee","Ja",,"Nee","3145","0",,"2024","Logisch","00","Ja","2025-03-25T00:00:00.000","2016-03-25T00:00:00.000","2016-03-25T00:00:00.000","2016-03-25T00:00:00.000",,,,,,,,,,,"185",,,,,,,,,,"C",,,,,,,"https://opendata.rdw.nl/resource/3huj-srit.json","https://opendata.rdw.nl/resource/8ys7-d773.json","https://opendata.rdw.nl/resource/vezc-m2t6.json","https://opendata.rdw.nl/resource/jhie-znh9.json","https://opendata.rdw.nl/resource/kmfi-hrps.json"