"kenteken","voertuigsoort","merk","handelsbenaming","vervaldatum_apk","datum_tenaamstelling","bruto_bpm","inrichting","aantal_zitplaatsen","eerste_kleur","tweede_kleur","aantal_cilinders","cilinderinhoud","massa_ledig_voertuig","toegestane_maximum_massa_voertuig","massa_rijklaar","maximum_massa_trekken_ongeremd","maximum_trekken_massa_geremd","datum_eerste_toelating","datum_eerste_tenaamstelling_in_nederland","wacht_op_keuren","catalogusprijs","wam_verzekerd","maximale_constructiesnelheid","laadvermogen","oplegger_geremd","aanhangwagen_autonoom_geremd","aanhangwagen_middenas_geremd","aantal_staanplaatsen","aantal_deuren","aantal_wielen","afstand_hart_koppeling_tot_achterzijde_voertuig","afstand_voorzijde_voertuig_tot_hart_koppeling","afwijkende_maximum_snelheid","lengte","breedte","europese_voertuigcategorie","europese_voertuigcategorie_toevoeging","europese_uitvoeringcategorie_toevoeging","plaats_chassisnummer","technische_max_massa_voertuig","type","type_gasinstallatie","typegoedkeuringsnummer","variant","uitvoering","volgnummer_wijziging_eu_typegoedkeuring","vermogen_massarijklaar","wielbasis","export_indicator","openstaande_terugroepactie_indicator","vervaldatum_tachograaf","taxi_indicator","maximum_massa_samenstelling","aantal_rolstoelplaatsen","maximum_ondersteunende_snelheid","jaar_laatste_registratie_tellerstand","tellerstandoordeel","code_toelichting_tellerstandoordeel","tenaamstellen_mogelijk","vervaldatum_apk_dt","datum_tenaamstelling_dt","datum_eerste_toelating_dt","datum_eerste_tenaamstelling_in_nederland_dt","vervaldatum_tachograaf_dt","maximum_last_onder_de_vooras_sen_tezamen_koppeling","type_remsysteem_voertuig_code","rupsonderstelconfiguratiecode","wielbasis_voertuig_minimum","wielbasis_voertuig_maximum","lengte_voertuig_minimum","lengte_voertuig_maximum","breedte_voertuig_minimum","breedte_voertuig_maximum","hoogte_voertuig","hoogte_voertuig_minimum","hoogte_voertuig_maximum","massa_bedrijfsklaar_minimaal","massa_bedrijfsklaar_maximaal","technisch_toelaatbaar_massa_koppelpunt","maximum_massa_technisch_maximaal","maximum_massa_technisch_minimaal","subcategorie_nederland","verticale_belasting_koppelpunt_getrokken_voertuig","zuinigheidsclassificatie","registratie_datum_goedkeuring_afschrijvingsmoment_bpm","registratie_datum_goedkeuring_afschrijvingsmoment_bpm_dt","gem_lading_wrde","aerodyn_voorz","massa_alt_aandr","verl_cab_ind","api_gekentekende_voertuigen_assen","api_gekentekende_voertuigen_brandstof","api_gekentekende_voertuigen_carrosserie","api_gekentekende_voertuigen_carrosserie_specifiek","api_gekentekende_voertuigen_voertuigklasse"
"G191ZJ","Personenauto","FIAT","500E","20240801","20220103",,"sedan","4","BLAUW","Niet geregistreerd",,,"1285","1701","1385",,,"20160801","20191218","Geen verstrekking in Open Data","24203","Ja","137",,,,,,"2","4",,,,,,"M1",,,,"1701",,,,,,,"0.06","230","Nee","Nee",,"Nee",,,,"2023","Geen oordeel","05","Ja","2024-08-01T00:00:00.000","2022-01-03T00:00:00.000","2016-08-01T00:00:00.000","2019-12-18T00:00:00.000",,,,,,,,,,,,,,,,,,,,,,,,,,,,"https://opendata.rdw.nl/resource/3huj-srit.json","https://opendata.rdw.nl/resource/8ys7-d773.json","https://opendata.rdw.nl/resource/vezc-m2t6.json","https://opendata.rdw.nl/resource/jhie-znh9.json","https://opendata.rdw.nl/resource/kmfi-hrps.json"
"H475LT","Personenauto","FIAT","500E","20250622","20230218",,"sedan","4","GRIJS","Niet geregistreerd",,,"1284","1701","1384",,,"20160413","20200304","Geen verstrekking in Open Data","26123","Ja","137",,,,,,"2","4",,,,,,"M1",,,,"1701",,,,,,,"0.06","232","Nee","Nee",,"Nee",,,,"2024","Geen oordeel","05","Ja","2025-06-22T00:00:00.000","2023-02-18T00:00:00.000","2016-04-13T00:00:00.000","2020-03-04T00:00:00.000",,,,,,,,,,,,,,,,,,,,,,,,,,,,"https://opendata.rdw.nl/resource/3huj-srit.json","https://opendata.rdw.nl/resource/8ys7-d773.json","https://opendata.rdw.nl/resource/vezc-m2t6.json","https://opendata.rdw.nl/resource/jhie-znh9.json","https://opendata.rdw.nl/resource/kmfi-hrps.json"
"J592FS","Personenauto","FIAT","FIAT 500E","20250718","20200722",,"sedan","4","GRIJS","Niet geregistreerd",,,"1284","1701","1384",,,"20170701","20200722","Geen verstrekking in Open Data","18018","Ja","137",,,,,,"2","4",,,,,,"M1",,,,"1701",,,,,,,"0.00","230","Nee","Nee",,"Nee",,,,"2023","Geen oordeel","05","Ja","2025-07-18T00:00:00.000","2020-07-22T00:00:00.000","2017-07-01T00:00:00.000","2020-07-22T00:00:00.000",,,,,,,,,,,,,,,,,,,,,,,,,,,,"https://opendata.rdw.nl/resource/3huj-srit.json","https://opendata.rdw.nl/resource/8ys7-d773.json","https://opendata.rdw.nl/resource/vezc-m2t6.json","https://opendata.rdw.nl/resource/jhie-znh9.json","https://opendata.rdw.nl/resource/kmfi-hrps.json"
"J606HT","Personenauto","FIAT","500E","20240812","20200818",,"sedan","4","GRIJS","Niet geregistreerd",,,"1285","1701","1385",,,"20150331","20200818","Geen verstrekking in Open Data","16804","Ja","137",,,,,,"2","4",,,,,,"M1",,,,"1701",,,,,,,"0.06","230","Nee","Nee",,"Nee",,,,"2023","Geen oordeel","05","Ja","2024-08-12T00:00:00.000","2020-08-18T00:00:00.000","2015-03-31T00:00:00.000","2020-08-18T00:00:00.000",,,,,,,,,,,,,,,,,,,,,,,,,,,,"https://opendata.rdw.nl/resource/3huj-srit.json","https://opendata.rdw.nl/resource/8ys7-d773.json","https://opendata.rdw.nl/resource/vezc-m2t6.json","https://opendata.rdw.nl/resource/jhie-znh9.json","https://opendata.rdw.nl/resource/kmfi-hrps.json"
"L814SR","Personenauto","FIAT","FIAT 500E","20241102","20210723",,"sedan","4","ZWART","Niet geregistreerd",,,"1340","1701","1440",,,"20181102","20210723","Geen verstrekking in Open Data","18177","Ja","141",,,,,,"2","4",,,,,,"M1",,,,"1701",,,,,,,"0.00","230","Nee","Nee",,"Nee",,,,"2022","Geen oordeel","05","Ja","2024-11-02T00:00:00.000","2021-07-23T00:00:00.000","2018-11-02T00:00:00.000","2021-07-23T00:00:00.000",,,,,,,,,,,,,,,,,,,,,,,,,,,,"https://opendata.rdw.nl/resource/3huj-srit.json","https://opendata.rdw.nl/resource/8ys7-d773.json","https://opendata.rdw.nl/resource/vezc-m2t6.json","https://opendata.rdw.nl/resource/jhie-znh9.json","https://opendata.rdw.nl/resource/kmfi-hrps.json"
"PD686S","Personenauto","FIAT","500E","20250510","20171116",,"sedan","4","ORANJE","Niet geregistreerd","0",,"1314","1701","1414",,,"20131222","20170601","Geen verstrekking in Open Data","20443","Ja",,,,,,,"2","4",,,,,,"M1",,,"r. deurdorpel by voorzitting","1701",,,,,,,"0.06","230","Nee","Nee",,"Nee",,,,"2024","Geen oordeel","05","Ja","2025-05-10T00:00:00.000","2017-11-16T00:00:00.000","2013-12-22T00:00:00.000","2017-06-01T00:00:00.000",,,,,,,,,,,,,,,,,,,,,,,,,,,,"https://opendata.rdw.nl/resource/3huj-srit.json","https://opendata.rdw.nl/resource/8ys7-d773.json","https://opendata.rdw.nl/resource/vezc-m2t6.json","https://opendata.rdw.nl/resource/jhie-znh9.json","https://opendata.rdw.nl/resource/kmfi-hrps.json"
"RJ848H","Personenauto","FIAT","FIAT 500E","20240621","20190511",,"sedan","4","ZWART","Niet geregistreerd","0",,"1284","1701","1384",,,"20140903","20171214","Geen verstrekking in Open Data","32011","Ja",,,,,,,"2","4",,,,,,"M1",,,,"1701","500E",,,,,,"0.06","230","Nee","Nee",,"Nee",,,,"2023","Geen oordeel","05","Ja","2024-06-21T00:00:00.000","2019-05-11T00:00:00.000","2014-09-03T00:00:00.000","2017-12-14T00:00:00.000",,,,,,,,,,,,,,,,,,,,,,,,,,,,"https://opendata.rdw.nl/resource/3huj-srit.json","https://opendata.rdw.nl/resource/8ys7-d773.json","https://opendata.rdw.nl/resource/vezc-m2t6.json","https://opendata.rdw.nl/resource/jhie-znh9.json","https://opendata.rdw.nl/resource/kmfi-hrps.json"
"RR201P","Personenauto","FIAT","500E","20250223","20220112",,"sedan","4","ZWART","Niet geregistreerd",,,"1285","1701","1385",,,"20170220","20171229","Geen verstrekking in Open Data","41876","Ja",,,,,,,"2","4",,,,,,"M1",,,"r. deurdorpel","1701",,,,,,,"0.06","230","Nee","Nee",,"Nee",,,,"2024","Geen oordeel","05","Ja","2025-02-23T00:00:00.000","2022-01-12T00:00:00.000","2017-02-20T00:00:00.000","2017-12-29T00:00:00.000",,,,,,,,,,,,,,,,,,,,,,,,,,,,"https://opendata.rdw.nl/resource/3huj-srit.json","https://opendata.rdw.nl/resource/8ys7-d773.json","https://opendata.rdw.nl/resource/vezc-m2t6.json","https://opendata.rdw.nl/resource/jhie-znh9.json","https://opendata.rdw.nl/resource/kmfi-hrps.json"
"RS009N","Personenauto","FIAT","500E","20241013","20201126",,"sedan","4","BLAUW","Niet geregistreerd",,,"1284","1701","1384",,,"20141013","20180116","Geen verstrekking in Open Data","26124","Ja",,,,,,,"2","4",,,,,,"M1",,,"r. deurdorpel","1701","500E",,,,,,"0.06","230","Nee","Ja",,"Nee",,,,"2023","Geen oordeel","05","Ja","2024-10-13T00:00:00.000","2020-11-26T00:00:00.000","2014-10-13T00:00:00.000","2018-01-16T00:00:00.000",,,,,,,,,,,,,,,,,,,,,,,,,,,,"https://opendata.rdw.nl/resource/3huj-srit.json","https://opendata.rdw.nl/resource/8ys7-d773.json","https://opendata.rdw.nl/resource/vezc-m2t6.json","https://opendata.rdw.nl/resource/jhie-znh9.json","https://opendata.rdw.nl/resource/kmfi-hrps.json"
"RV627X","Personenauto","FIAT","500E","20240929","20201001",,"sedan","4","BLAUW","Niet geregistreerd",,,"1285","1701","1385",,,"20140925","20180212","Geen verstrekking in Open Data","36010","Ja",,,,,,,"2","4",,,,,,"M1",,,,"1701","500E",,,,,,"0.06","230","Nee","Nee",,"Nee",,,,"2023","Geen oordeel","05","Ja","2024-09-29T00:00:00.000","2020-10-01T00:00:00.000","2014-09-25T00:00:00.000","2018-02-12T00:00:00.000",,,,,,,,,,,,,,,,,,,,,,,,,,,,"https://opendata.rdw.nl/resource/3huj-srit.json","https://opendata.rdw.nl/resource/8ys7-d773.json","https://opendata.rdw.nl/resource/vezc-m2t6.json","https://opendata.rdw.nl/resource/jhie-znh9.json","https://opendata.rdw.nl/resource/kmfi-hrps.json"
"SF266G","Personenauto","FIAT","FIAT 500E","20240721","20210109",,"sedan","4","ZWART","Niet geregistreerd","0",,"1284","1701","1384",,,"20140721","20180313","Geen verstrekking in Open Data","26124","Ja",,,,,,,"2","4",,,,,,"M1",,,,"1701","500E",,,,,,"0.06","230","Nee","Nee",,"Nee",,,,"2023","Geen oordeel","05","Ja","2024-07-21T00:00:00.000","2021-01-09T00:00:00.000","2014-07-21T00:00:00.000","2018-03-13T00:00:00.000",,,,,,,,,,,,,,,,,,,,,,,,,,,,"https://opendata.rdw.nl/resource/3huj-srit.json","https://opendata.rdw.nl/resource/8ys7-d773.json","https://opendata.rdw.nl/resource/vezc-m2t6.json","https://opendata.rdw.nl/resource/jhie-znh9.json","https://opendata.rdw.nl/resource/kmfi-hrps.json"
"SJ146V","Personenauto","FIAT","500E","20241016","20180417",,"sedan","4","GRIJS","Niet geregistreerd",,,"1359","1701","1459",,,"20141016","20180417","Geen verstrekking in Open Data","34879","Ja",,,,,,,"2","4",,,,,,"M1",,,"r. deurdorpel","1701",,,,,,,"0.06","230","Nee","Nee",,"Nee",,,,"2023","Geen oordeel","05","Ja","2024-10-16T00:00:00.000","2018-04-17T00:00:00.000","2014-10-16T00:00:00.000","2018-04-17T00:00:00.000",,,,,,,,,,,,,,,,,,,,,,,,,,,,"https://opendata.rdw.nl/resource/3huj-srit.json","https://opendata.rdw.nl/resource/8ys7-d773.json","https://opendata.rdw.nl/resource/vezc-m2t6.json","https://opendata.rdw.nl/resource/jhie-znh9.json","https://opendata.rdw.nl/resource/kmfi-hrps.json"
"SK528G","Personenauto","FIAT","FIAT 500E","20240831","20210107",,"sedan","4","WIT","Niet geregistreerd","0",,"1284","1701","1384",,,"20140729","20180801","Geen verstrekking in Open Data","32521","Ja",,,,,,,"2","4",,,,,,"M1",,,"r. deurdorpel","1701","500E",,,,,,"0.06","230","Nee","Nee",,"Nee",,,,"2023","Geen oordeel","05","Ja","2024-08-31T00:00:00.000","2021-01-07T00:00:00.000","2014-07-29T00:00:00.000","2018-08-01T00:00:00.000",,,,,,,,,,,,,,,,,,,,,,,,,,,,"https://opendata.rdw.nl/resource/3huj-srit.json","https://opendata.rdw.nl/resource/8ys7-d773.json","https://opendata.rdw.nl/resource/vezc-m2t6.json","https://opendata.rdw.nl/resource/jhie-znh9.json","https://opendata.rdw.nl/resource/kmfi-hrps.json"
"SN538V","Personenauto","FIAT","FIAT 500E","20250117","20240102",,"sedan","4","GRIJS","Niet geregistreerd","0",,"1284","1701","1384",,,"20150102","20180508","Geen verstrekking in Open Data","26124","Ja",,,,,,,"2","4",,,,,,"M1",,,"r. balk by voorzitting","1701",,,,,,,"0.06","230","Nee","Nee",,"Nee",,,,"2024","Geen oordeel","05","Ja","2025-01-17T00:00:00.000","2024-01-02T00:00:00.000","2015-01-02T00:00:00.000","2018-05-08T00:00:00.000",,,,,,,,,,,,,,,,,,,,,,,,,,,,"https://opendata.rdw.nl/resource/3huj-srit.json","https://opendata.rdw.nl/resource/8ys7-d773.json","https://opendata.rdw.nl/resource/vezc-m2t6.json","https://opendata.rdw.nl/resource/jhie-znh9.json","https://opendata.rdw.nl/resource/kmfi-hrps.json"
"TH519S","Personenauto","FIAT","FIAT 500E","20250406","20220312",,"sedan","4","WIT","Niet geregistreerd","0",,"1284","1701","1384",,,"20150406","20180802","Geen verstrekking in Open Data","26124","Ja",,,,,,,"2","4",,,,,,"M1",,,"r. deurdorpel by voorzitting","1701",,,,,,,"0.06","230","Nee","Nee",,"Nee",,,,"2024","Geen oordeel","05","Ja","2025-04-06T00:00:00.000","2022-03-12T00:00:00.000","2015-04-06T00:00:00.000","2018-08-02T00:00:00.000",,,,,,,,,,,,,,,,,,,,,,,,,,,,"https://opendata.rdw.nl/resource/3huj-srit.json","https://opendata.rdw.nl/resource/8ys7-d773.json","https://opendata.rdw.nl/resource/vezc-m2t6.json","https://opendata.rdw.nl/resource/jhie-znh9.json","https://opendata.rdw.nl/resource/kmfi-hrps.json"
"TH726P","Personenauto","FIAT","FIAT 500E","20250108","20240320",,"sedan","4","GRIJS","Niet geregistreerd","0",,"1284","1701","1384",,,"20150108","20180801","Geen verstrekking in Open Data","26124","Ja",,,,,,,"2","4",,,,,,"M1",,,"r. deurdorpel by voorzitting","1701",,,,,,,"0.06","230","Nee","Ja",,"Nee",,,,"2024","Geen oordeel","05","Ja","2025-01-08T00:00:00.000","2024-03-20T00:00:00.000","2015-01-08T00:00:00.000","2018-08-01T00:00:00.000",,,,,,,,,,,,,,,,,,,,,,,,,,,,"https://opendata.rdw.nl/resource/3huj-srit.json","https://opendata.rdw.nl/resource/8ys7-d773.json","https://opendata.rdw.nl/resource/vezc-m2t6.json","https://opendata.rdw.nl/resource/jhie-znh9.json","https://opendata.rdw.nl/resource/kmfi-hrps.json"
"TT112N","Personenauto","FIAT","FIAT 500E","20240823","20231005",,"sedan","4","GRIJS","Niet geregistreerd","0",,"1284","1701","1384",,,"20141204","20181022","Geen verstrekking in Open Data","31582","Ja",,,,,,,"2","4",,,,,,"M1",,,,"1701",,,,,,,"0.06","230","Nee","Nee",,"Nee",,,,"2023","Geen oordeel","05","Ja","2024-08-23T00:00:00.000","2023-10-05T00:00:00.000","2014-12-04T00:00:00.000","2018-10-22T00:00:00.000",,,,,,,,,,,,,,,,,,,,,,,,,,,,"https://opendata.rdw.nl/resource/3huj-srit.json","https://opendata.rdw.nl/resource/8ys7-d773.json","https://opendata.rdw.nl/resource/vezc-m2t6.json","https://opendata.rdw.nl/resource/jhie-znh9.json","https://opendata.rdw.nl/resource/kmfi-hrps.json"
"TX522B","Personenauto","FIAT","500E","20250618","20210703",,"sedan","4","GRIJS","Niet geregistreerd",,,"1284","1701","1384",,,"20150618","20181031","Geen verstrekking in Open Data","26124","Ja",,,,,,,"2","4",,,,,,"M1",,,,"1701","500E",,,,,,"0.06","230","Nee","Nee",,"Nee",,,,"2024","Geen oordeel","05","Ja","2025-06-18T00:00:00.000","2021-07-03T00:00:00.000","2015-06-18T00:00:00.000","2018-10-31T00:00:00.000",,,,,,,,,,,,,,,,,,,,,,,,,,,,"https://opendata.rdw.nl/resource/3huj-srit.json","https://opendata.rdw.nl/resource/8ys7-d773.json","https://opendata.rdw.nl/resource/vezc-m2t6.json","https://opendata.rdw.nl/resource/jhie-znh9.json","https://opendata.rdw.nl/resource/kmfi-hrps.json"
"X110GZ","Personenauto","FIAT","500E","20250227","20240314",,"sedan","4","ZWART","Niet geregistreerd",,,"1255","1701","1355",,,"20150701","20240302","Geen verstrekking in Open Data","23899","Ja",,,,,,,"3","4",,,,,,"M1",,,,"1701","500E",,,,,,"0.00","230","Nee","Nee",,"Nee",,,,"2024","Geen oordeel","05","Ja","2025-02-27T00:00:00.000","2024-03-14T00:00:00.000","2015-07-01T00:00:00.000","2024-03-02T00:00:00.000",,,,,,,,,,,,,,,,,,,,,,"20231107","2023-11-07T00:00:00.000",,,,,"https://opendata.rdw.nl/resource/3huj-srit.json","https://opendata.rdw.nl/resource/8ys7-d773.json","https://opendata.rdw.nl/resource/vezc-m2t6.json","https://opendata.rdw.nl/resource/jhie-znh9.json","https://opendata.rdw.nl/resource/kmfi-hrps.json"
"XN870K","Personenauto","FIAT","500E","20241020","20190212",,"sedan","4","ZWART","Niet geregistreerd",,,"1284","1701","1384",,,"20151012","20190207","Geen verstrekking in Open Data","26123","Ja",,,,,,,"2","4",,,,,,"M1",,,"r. deurdorpel by voorzitting","1701","500E",,,,,,"0.06","230","Nee","Ja",,"Nee",,,,"2023","Geen oordeel","05","Ja","2024-10-20T00:00:00.000","2019-02-12T00:00:00.000","2015-10-12T00:00:00.000","2019-02-07T00:00:00.000",,,,,,,,,,,,,,,,,,,,,,,,,,,,"https://opendata.rdw.nl/resource/3huj-srit.json","https://opendata.rdw.nl/resource/8ys7-d773.json","https://opendata.rdw.nl/resource/vezc-m2t6.json","https://opendata.rdw.nl/resource/jhie-znh9.json","https://opendata.rdw.nl/resource/kmfi-hrps.json"
"XR607T","Personenauto","FIAT","500E","20250126","20190302",,"sedan","4","ZWART","Niet geregistreerd",,,"1284","1701","1384",,,"20160106","20190227","Geen verstrekking in Open Data","26123","Ja",,,,,,,"2","4",,,,,,"M1",,,"r. deurdorpel","1701",,,,,,,"0.06","230","Nee","Ja",,"Nee",,,,"2024","Geen oordeel","05","Ja","2025-01-26T00:00:00.000","2019-03-02T00:00:00.000","2016-01-06T00:00:00.000","2019-02-27T00:00:00.000",,,,,,,,,,,,,,,,,,,,,,,,,,,,"https://opendata.rdw.nl/resource/3huj-srit.json","https://opendata.rdw.nl/resource/8ys7-d773.json","https://opendata.rdw.nl/resource/vezc-m2t6.json","https://opendata.rdw.nl/resource/jhie-znh9.json","https://opendata.rdw.nl/resource/kmfi-hrps.json"
"XR608T","Personenauto","FIAT","500E","20250102","20190302",,"sedan","4","GRIJS","Niet geregistreerd",,,"1284","1701","1384",,,"20160102","20190227","Geen verstrekking in Open Data","26123","Ja",,,,,,,"2","4",,,,,,"M1",,,"r. deurdorpel","1701",,,,,,,"0.06","230","Nee","Nee",,"Nee",,,,"2023","Geen oordeel","05","Ja","2025-01-02T00:00:00.000","2019-03-02T00:00:00.000","2016-01-02T00:00:00.000","2019-02-27T00:00:00.000",,,,,,,,,,,,,,,,,,,,,,,,,,,,"https://opendata.rdw.nl/resource/3huj-srit.json","https://opendata.rdw.nl/resource/8ys7-d773.json","https://opendata.rdw.nl/resource/vezc-m2t6.json","https://opendata.rdw.nl/resource/jhie-znh9.json","https://opendata.rdw.nl/resource/kmfi-hrps.json"
"XR609T","Personenauto","FIAT","500E","20241110","20190306",,"sedan","4","ZWART","Niet geregistreerd",,,"1284","1701","1384",,,"20151110","20190227","Geen verstrekking in Open Data","26123","Ja",,,,,,,"2","4",,,,,,"M1",,,"r. deurdorpel","1701",,,,,,,"0.06","230","Nee","Nee",,"Nee",,,,"2023","Geen oordeel","05","Ja","2024-11-10T00:00:00.000","2019-03-06T00:00:00.000","2015-11-10T00:00:00.000","2019-02-27T00:00:00.000",,,,,,,,,,,,,,,,,,,,,,,,,,,,"https://opendata.rdw.nl/resource/3huj-srit.json","https://opendata.rdw.nl/resource/8ys7-d773.json","https://opendata.rdw.nl/resource/vezc-m2t6.json","https://opendata.rdw.nl/resource/jhie-znh9.json","https://opendata.rdw.nl/resource/kmfi-hrps.json"
"ZT111Z","Personenauto","FIAT","500E","20250421","20220325",,"sedan","4","GRIJS","Niet geregistreerd",,,"1284","1701","1384",,,"20160421","20190806","Geen verstrekking in Open Data","26123","Ja","137",,,,,,"2","4",,,,,,"M1",,,,"1701",,,,,,,"0.06","230","Nee","Ja",,"Nee",,,,"2024","Geen oordeel","05","Ja","2025-04-21T00:00:00.000","2022-03-25T00:00:00.000","2016-04-21T00:00:00.000","2019-08-06T00:00:00.000",,,,,,,,,,,,,,,,,,,,,,,,,,,,"https://opendata.rdw.nl/resource/3huj-srit.json","https://opendata.rdw.nl/resource/8ys7-d773.json","https://opendata.rdw.nl/resource/vezc-m2t6.json","https://opendata.rdw.nl/resource/jhie-znh9.json","https://opendata.rdw.nl/resource/kmfi-hrps.json"
"ZT115Z","Personenauto","FIAT","500E","20250102","20220101",,"sedan","4","ZWART","Niet geregistreerd",,,"1284","1701","1384",,,"20170102","20190806","Geen verstrekking in Open Data","26123","Ja","137",,,,,,"2","4",,,,,,"M1",,,,"1701",,,,,,,"0.06","230","Nee","Nee",,"Nee",,,,"2022","Geen oordeel","05","Ja","2025-01-02T00:00:00.000","2022-01-01T00:00:00.000","2017-01-02T00:00:00.000","2019-08-06T00:00:00.000",,,,,,,,,,,,,,,,,,,,,,,,,,,,"https://opendata.rdw.nl/resource/3huj-srit.json","https://opendata.rdw.nl/resource/8ys7-d773.json","https://opendata.rdw.nl/resource/vezc-m2t6.json","https://opendata.rdw.nl/resource/jhie-znh9.json","https://opendata.rdw.nl/resource/kmfi-hrps.json"
"ZV241D","Personenauto","FIAT","500E","20250422","20190812",,"sedan","4","GRIJS","Niet geregistreerd",,,"1284","1701","1384",,,"20160418","20190807","Geen verstrekking in Open Data","26123","Ja","137",,,,,,"2","4",,,,,,"M1",,,,"1701",,,,,,,"0.06","230","Nee","Nee",,"Nee",,,,"2024","Geen oordeel","05","Ja","2025-04-22T00:00:00.000","2019-08-12T00:00:00.000","2016-04-18T00:00:00.000","2019-08-07T00:00:00.000",,,,,,,,,,,,,,,,,,,,,,,,,,,,"https://opendata.rdw.nl/resource/3huj-srit.json","https://opendata.rdw.nl/resource/8ys7-d773.json","https://opendata.rdw.nl/resource/vezc-m2t6.json","https://opendata.rdw.nl/resource/jhie-znh9.json","https://opendata.rdw.nl/resource/kmfi-hrps.json"
