"kenteken","voertuigsoort","merk","handelsbenaming","vervaldatum_apk","datum_tenaamstelling","bruto_bpm","inrichting","aantal_zitplaatsen","eerste_kleur","tweede_kleur","aantal_cilinders","cilinderinhoud","massa_ledig_voertuig","toegestane_maximum_massa_voertuig","massa_rijklaar","maximum_massa_trekken_ongeremd","maximum_trekken_massa_geremd","datum_eerste_toelating","datum_eerste_tenaamstelling_in_nederland","wacht_op_keuren","catalogusprijs","wam_verzekerd","maximale_constructiesnelheid","laadvermogen","oplegger_geremd","aanhangwagen_autonoom_geremd","aanhangwagen_middenas_geremd","aantal_staanplaatsen","aantal_deuren","aantal_wielen","afstand_hart_koppeling_tot_achterzijde_voertuig","afstand_voorzijde_voertuig_tot_hart_koppeling","afwijkende_maximum_snelheid","lengte","breedte","europese_voertuigcategorie","europese_voertuigcategorie_toevoeging","europese_uitvoeringcategorie_toevoeging","plaats_chassisnummer","technische_max_massa_voertuig","type","type_gasinstallatie","typegoedkeuringsnummer","variant","uitvoering","volgnummer_wijziging_eu_typegoedkeuring","vermogen_massarijklaar","wielbasis","export_indicator","openstaande_terugroepactie_indicator","vervaldatum_tachograaf","taxi_indicator","maximum_massa_samenstelling","aantal_rolstoelplaatsen","maximum_ondersteunende_snelheid","jaar_laatste_registratie_tellerstand","tellerstandoordeel","code_toelichting_tellerstandoordeel","tenaamstellen_mogelijk","vervaldatum_apk_dt","datum_tenaamstelling_dt","datum_eerste_toelating_dt","datum_eerste_tenaamstelling_in_nederland_dt","vervaldatum_tachograaf_dt","maximum_last_onder_de_vooras_sen_tezamen_koppeling","type_remsysteem_voertuig_code","rupsonderstelconfiguratiecode","wielbasis_voertuig_minimum","wielbasis_voertuig_maximum","lengte_voertuig_minimum","lengte_voertuig_maximum","breedte_voertuig_minimum","breedte_voertuig_maximum","hoogte_voertuig","hoogte_voertuig_minimum","hoogte_voertuig_maximum","massa_bedrijfsklaar_minimaal","massa_bedrijfsklaar_maximaal","technisch_toelaatbaar_massa_koppelpunt","maximum_massa_technisch_maximaal","maximum_massa_technisch_minimaal","subcategorie_nederland","verticale_belasting_koppelpunt_getrokken_voertuig","zuinigheidsclassificatie","registratie_datum_goedkeuring_afschrijvingsmoment_bpm","registratie_datum_goedkeuring_afschrijvingsmoment_bpm_dt","gem_lading_wrde","aerodyn_voorz","massa_alt_aandr","verl_cab_ind","api_gekentekende_voertuigen_assen","api_gekentekende_voertuigen_brandstof","api_gekentekende_voertuigen_carrosserie","api_gekentekende_voertuigen_carrosserie_specifiek","api_gekentekende_voertuigen_voertuigklasse"
"V08FBL","Bedrijfsauto","FIAT","E-SCUDO OPEN LAADBAK","20280328","20240328",,"neerklapbare zijschotten","3","N.v.t.","N.v.t.",,,"2024","3100","2124","750",,"20240328","20240328","Geen verstrekking in Open Data","53421","Ja","130","1076",,,"1000",,"2","4",,,,"508","195","N1",,,,"3100","V",,,,,,"0.03","328","Nee","Nee",,"Nee","4100",,,"2024","Logisch","00","Ja","2028-03-28T00:00:00.000","2024-03-28T00:00:00.000","2024-03-28T00:00:00.000","2024-03-28T00:00:00.000",,,,,,,,,,,"198",,,,,,,,,,,"20240328","2024-03-28T00:00:00.000",,,,,"https://opendata.rdw.nl/resource/3huj-srit.json","https://opendata.rdw.nl/resource/8ys7-d773.json","https://opendata.rdw.nl/resource/vezc-m2t6.json","https://opendata.rdw.nl/resource/jhie-znh9.json","https://opendata.rdw.nl/resource/kmfi-hrps.json"
"VG955K","Bedrijfsauto","FIAT","SCUDO","20241203","20131210","8583","neerklapbare zijschotten","3","N.v.t.","N.v.t.","4","1997","1780","2950","1880","750",,"20131203","20131203","Geen verstrekking in Open Data","35257","Ja",,"1170",,"1930","1930",,,"4",,,,,"194","N1",,,"r. watergoot","2950","270",,,,,,"0.05","312","Nee","Nee",,"Nee","4880",,,"2023","Logisch","00","Ja","2024-12-03T00:00:00.000","2013-12-10T00:00:00.000","2013-12-03T00:00:00.000","2013-12-03T00:00:00.000",,"0",,,,,,,,,,,,,,,,,,,,,,,,,,"https://opendata.rdw.nl/resource/3huj-srit.json","https://opendata.rdw.nl/resource/8ys7-d773.json","https://opendata.rdw.nl/resource/vezc-m2t6.json","https://opendata.rdw.nl/resource/jhie-znh9.json","https://opendata.rdw.nl/resource/kmfi-hrps.json"
"VT015D","Bedrijfsauto","FIAT","SCUDO BUSINESSVAN","20250122","20230118","9931","neerklapbare zijschotten","5","N.v.t.","N.v.t.","4","1997","1870","2932","1970","750",,"20160122","20160122","Geen verstrekking in Open Data","40932","Ja",,"1062",,,"2000",,"0","4","0","0",,"514","190","N1",,,"in motorruimte r.","2932","270-SA",,"e4*2007/46*0473*07","ZXL1B","WAL5","0","0.05","312","Nee","Nee",,"Nee","4932","0","0.00","2024","Logisch","00","Ja","2025-01-22T00:00:00.000","2023-01-18T00:00:00.000","2016-01-22T00:00:00.000","2016-01-22T00:00:00.000",,,,,,,,,,,,,,,,,,,,,,,,,,,,"https://opendata.rdw.nl/resource/3huj-srit.json","https://opendata.rdw.nl/resource/8ys7-d773.json","https://opendata.rdw.nl/resource/vezc-m2t6.json","https://opendata.rdw.nl/resource/jhie-znh9.json","https://opendata.rdw.nl/resource/kmfi-hrps.json"
"VT020D","Bedrijfsauto","FIAT","SCUDO BUSINESSVAN","20250102","20230104","9711","neerklapbare zijschotten","5","N.v.t.","N.v.t.","4","1997","1870","2932","1970","750",,"20160119","20160119","Geen verstrekking in Open Data","40004","Ja",,"1062",,,"2000",,"0","4","0","0",,"514","190","N1",,,"in motorruimte r.","2932","270-SA",,"e4*2007/46*0473*07","ZXL1B","WAL5","0","0.05","312","Nee","Nee",,"Nee","4932","0","0.00","2023","Logisch","00","Ja","2025-01-02T00:00:00.000","2023-01-04T00:00:00.000","2016-01-19T00:00:00.000","2016-01-19T00:00:00.000",,,,,,,,,,,,,,,,,,,,,,,,,,,,"https://opendata.rdw.nl/resource/3huj-srit.json","https://opendata.rdw.nl/resource/8ys7-d773.json","https://opendata.rdw.nl/resource/vezc-m2t6.json","https://opendata.rdw.nl/resource/jhie-znh9.json","https://opendata.rdw.nl/resource/kmfi-hrps.json"
"VT212G","Bedrijfsauto","FIAT","SCUDO BUSINESSVAN","20250508","20230906","8968","neerklapbare zijschotten","6","N.v.t.","N.v.t.","4","1560","1831","2880","1931","750",,"20160129","20160129","Geen verstrekking in Open Data","36877","Ja",,"1049",,,"1453",,"0","4","0","0",,"514","190","N1",,,"in motorruimte r.","2880","270-SA",,"e4*2007/46*0473*07","ZXH1A","WAL6","0","0.03","312","Nee","Nee",,"Nee","4333","0","0.00","2024","Logisch","00","Ja","2025-05-08T00:00:00.000","2023-09-06T00:00:00.000","2016-01-29T00:00:00.000","2016-01-29T00:00:00.000",,,,,,,,,,,"198",,,,,,,,,,,,,,,,,"https://opendata.rdw.nl/resource/3huj-srit.json","https://opendata.rdw.nl/resource/8ys7-d773.json","https://opendata.rdw.nl/resource/vezc-m2t6.json","https://opendata.rdw.nl/resource/jhie-znh9.json","https://opendata.rdw.nl/resource/kmfi-hrps.json"
"VT292F","Bedrijfsauto","FIAT","SCUDO BUSINESSVAN","20240926","20211220","8968","neerklapbare zijschotten","6","N.v.t.","N.v.t.","4","1560","1831","2880","1931","750",,"20160129","20160129","Geen verstrekking in Open Data","36877","Ja",,"1049",,,"1453",,"0","4","0","0",,"0","190","N1",,,"in motorruimte r.","2880","270-SA",,"e4*2007/46*0473*05","ZXH1A","WAL6","0","0.03","312","Nee","Nee",,"Nee","4333","0",,"2023","Logisch","00","Ja","2024-09-26T00:00:00.000","2021-12-20T00:00:00.000","2016-01-29T00:00:00.000","2016-01-29T00:00:00.000",,,,,,,,,,,,,,,,,,,,,,,,,,,,"https://opendata.rdw.nl/resource/3huj-srit.json","https://opendata.rdw.nl/resource/8ys7-d773.json","https://opendata.rdw.nl/resource/vezc-m2t6.json","https://opendata.rdw.nl/resource/jhie-znh9.json","https://opendata.rdw.nl/resource/kmfi-hrps.json"
"VT297Z","Bedrijfsauto","FIAT","SCUDO BUSINESSVAN","20250517","20220514","10140","neerklapbare zijschotten","5","N.v.t.","N.v.t.","4","1997","1870","2932","1970","750",,"20160331","20160331","Geen verstrekking in Open Data","41813","Ja",,"1062",,,"2000",,"0","4","0","0",,"514","190","N1",,,"in motorruimte r.","2932","270-SA",,"e4*2007/46*0473*07","ZXL1B","WAL5","0","0.05","312","Nee","Nee",,"Nee","4932","0","0.00","2024","Logisch","00","Ja","2025-05-17T00:00:00.000","2022-05-14T00:00:00.000","2016-03-31T00:00:00.000","2016-03-31T00:00:00.000",,,,,,,,,,,,,,,,,,,,,,,,,,,,"https://opendata.rdw.nl/resource/3huj-srit.json","https://opendata.rdw.nl/resource/8ys7-d773.json","https://opendata.rdw.nl/resource/vezc-m2t6.json","https://opendata.rdw.nl/resource/jhie-znh9.json","https://opendata.rdw.nl/resource/kmfi-hrps.json"
"VT306P","Bedrijfsauto","FIAT","SCUDO BUSINESSVAN","20240829","20220923","8968","neerklapbare zijschotten","6","N.v.t.","N.v.t.","4","1560","1831","2880","1931","750",,"20160303","20160303","Geen verstrekking in Open Data","36877","Ja",,"1049",,,"1453",,"0","4","0","0",,"514","190","N1",,,"in motorruimte r.","2880","270-SA",,"e4*2007/46*0473*07","ZXH1A","WAL6","0","0.03","312","Nee","Nee",,"Nee","4333","0","0.00","2023","Logisch","00","Ja","2024-08-29T00:00:00.000","2022-09-23T00:00:00.000","2016-03-03T00:00:00.000","2016-03-03T00:00:00.000",,,,,,,,,,,,,,,,,,,,,,,,,,,,"https://opendata.rdw.nl/resource/3huj-srit.json","https://opendata.rdw.nl/resource/8ys7-d773.json","https://opendata.rdw.nl/resource/vezc-m2t6.json","https://opendata.rdw.nl/resource/jhie-znh9.json","https://opendata.rdw.nl/resource/kmfi-hrps.json"
"VT307P","Bedrijfsauto","FIAT","SCUDO BUSINESSVAN","20250508","20240511","9494","neerklapbare zijschotten","5","N.v.t.","N.v.t.","4","1560","1831","2880","1931","750",,"20160226","20160226","Geen verstrekking in Open Data","39091","Ja",,"1049",,,"1453",,"0","4","0","0",,"514","190","N1",,,"in motorruimte r.","2880","270-SA",,"e4*2007/46*0473*07","ZXH1A","WAL5","0","0.03","312","Nee","Nee",,"Nee","4333","0","0.00","2024","Logisch","00","Ja","2025-05-08T00:00:00.000","2024-05-11T00:00:00.000","2016-02-26T00:00:00.000","2016-02-26T00:00:00.000",,,,,,,,,,,,,,,,,,,,,,,,,,,,"https://opendata.rdw.nl/resource/3huj-srit.json","https://opendata.rdw.nl/resource/8ys7-d773.json","https://opendata.rdw.nl/resource/vezc-m2t6.json","https://opendata.rdw.nl/resource/jhie-znh9.json","https://opendata.rdw.nl/resource/kmfi-hrps.json"
"VT544F","Bedrijfsauto","FIAT","SCUDO BUSINESSVAN","20240202","20240214","9558","neerklapbare zijschotten","6","N.v.t.","N.v.t.","4","1560","1831","2880","1931","750",,"20160202","20160202","Geen verstrekking in Open Data","39361","Ja",,"1049",,,"1453",,"0","4","0","0",,"514","190","N1",,,"in motorruimte r.","2880","270-SA",,"e4*2007/46*0473*07","ZXH1A","WAL6","0","0.03","312","Nee","Nee",,"Nee","4333","0","0.00","2024","Logisch","00","Ja","2024-02-02T00:00:00.000","2024-02-14T00:00:00.000","2016-02-02T00:00:00.000","2016-02-02T00:00:00.000",,,,,,,,,,,,,,,,,,,,,,,,,,,,"https://opendata.rdw.nl/resource/3huj-srit.json","https://opendata.rdw.nl/resource/8ys7-d773.json","https://opendata.rdw.nl/resource/vezc-m2t6.json","https://opendata.rdw.nl/resource/jhie-znh9.json","https://opendata.rdw.nl/resource/kmfi-hrps.json"
"VT638T","Bedrijfsauto","FIAT","SCUDO BUSINESSVAN","20250416","20230918","11058","neerklapbare zijschotten","5","N.v.t.","N.v.t.","4","1997","1891","2973","1991","750",,"20160311","20160311","Geen verstrekking in Open Data","45677","Ja",,"1082",,,"2000",,"0","4","0","0",,"514","190","N1",,,"in motorruimte r.","2973","270-SA",,"e4*2007/46*0473*07","ZXG1B","WAL5","0","0.06","312","Nee","Nee",,"Nee","4973","0","0.00","2024","Logisch","00","Ja","2025-04-16T00:00:00.000","2023-09-18T00:00:00.000","2016-03-11T00:00:00.000","2016-03-11T00:00:00.000",,,,,,,,,,,,,,,,,,,,,,,,,,,,"https://opendata.rdw.nl/resource/3huj-srit.json","https://opendata.rdw.nl/resource/8ys7-d773.json","https://opendata.rdw.nl/resource/vezc-m2t6.json","https://opendata.rdw.nl/resource/jhie-znh9.json","https://opendata.rdw.nl/resource/kmfi-hrps.json"
"VT896F","Bedrijfsauto","FIAT","SCUDO BUSINESSVAN","20250205","20210630","11123","neerklapbare zijschotten","6","N.v.t.","N.v.t.","4","1997","1890","2973","1990","750",,"20160205","20160205","Geen verstrekking in Open Data","45947","Ja",,"1083",,,"2000",,"0","4","0","0",,"514","190","N1",,,"in motorruimte r.","2973","270-SA",,"e4*2007/46*0473*07","ZXG1B","WAL6","0","0.06","312","Nee","Nee",,"Nee","4973","0","0.00","2024","Logisch","00","Ja","2025-02-05T00:00:00.000","2021-06-30T00:00:00.000","2016-02-05T00:00:00.000","2016-02-05T00:00:00.000",,,,,,,,,,,,,,,,,,,,,,,,,,,,"https://opendata.rdw.nl/resource/3huj-srit.json","https://opendata.rdw.nl/resource/8ys7-d773.json","https://opendata.rdw.nl/resource/vezc-m2t6.json","https://opendata.rdw.nl/resource/jhie-znh9.json","https://opendata.rdw.nl/resource/kmfi-hrps.json"
"VTH41R","Bedrijfsauto","FIAT","SCUDO","20260123","20230123","10091","neerklapbare zijschotten","3","N.v.t.","N.v.t.","4","1997","1721","3100","1821","750",,"20230123","20230123","Geen verstrekking in Open Data","41605","Ja","185","1379",,,"1900",,"2","4",,,,"512","196","N1",,,,"3100","V",,,,,,"0.06","328","Nee","Ja",,"Nee","5000",,,"2023","Logisch","00","Ja","2026-01-23T00:00:00.000","2023-01-23T00:00:00.000","2023-01-23T00:00:00.000","2023-01-23T00:00:00.000",,,,,,,,,,,"207",,,,,,,,,,,"20230105","2023-01-05T00:00:00.000",,,,,"https://opendata.rdw.nl/resource/3huj-srit.json","https://opendata.rdw.nl/resource/8ys7-d773.json","https://opendata.rdw.nl/resource/vezc-m2t6.json","https://opendata.rdw.nl/resource/jhie-znh9.json","https://opendata.rdw.nl/resource/kmfi-hrps.json"
"VTH44R","Bedrijfsauto","FIAT","SCUDO","20260123","20230123","10582","neerklapbare zijschotten","3","N.v.t.","N.v.t.","4","1997","1720","3100","1820",,,"20230123","20230123","Geen verstrekking in Open Data","43669","Ja","185","1380",,,,,"2","4",,,,"512","196","N1",,,,"3100","V",,,,,,"0.06","328","Nee","Nee",,"Nee",,,,"2023","Logisch","00","Ja","2026-01-23T00:00:00.000","2023-01-23T00:00:00.000","2023-01-23T00:00:00.000","2023-01-23T00:00:00.000",,,,,,,,,,,"207",,,,,,,,,,,"20230106","2023-01-06T00:00:00.000",,,,,"https://opendata.rdw.nl/resource/3huj-srit.json","https://opendata.rdw.nl/resource/8ys7-d773.json","https://opendata.rdw.nl/resource/vezc-m2t6.json","https://opendata.rdw.nl/resource/jhie-znh9.json","https://opendata.rdw.nl/resource/kmfi-hrps.json"
"VV062H","Bedrijfsauto","FIAT","SCUDO BUSINESSVAN","20241005","20210930","9183","neerklapbare zijschotten","5","N.v.t.","N.v.t.","4","1560","1831","2880","1931","750",,"20160401","20160401","Geen verstrekking in Open Data","37782","Ja",,"1049",,,"1453",,"0","4","0","0",,"514","190","N1",,,"in motorruimte r.","2880","270-SA",,"e4*2007/46*0473*07","ZXH1A","WAL5","0","0.03","312","Nee","Nee",,"Nee","4333","0","0.00","2023","Logisch","00","Ja","2024-10-05T00:00:00.000","2021-09-30T00:00:00.000","2016-04-01T00:00:00.000","2016-04-01T00:00:00.000",,,,,,,,,,,,,,,,,,,,,,,,,,,,"https://opendata.rdw.nl/resource/3huj-srit.json","https://opendata.rdw.nl/resource/8ys7-d773.json","https://opendata.rdw.nl/resource/vezc-m2t6.json","https://opendata.rdw.nl/resource/jhie-znh9.json","https://opendata.rdw.nl/resource/kmfi-hrps.json"
"VV376L","Bedrijfsauto","FIAT","SCUDO BUSINESSVAN","20240531","20220623","8968","neerklapbare zijschotten","6","N.v.t.","N.v.t.","4","1560","1831","2880","1931","750",,"20160420","20160420","Geen verstrekking in Open Data","36877","Ja",,"1049",,,"1453",,"0","4","0","0",,"514","190","N1",,,"in motorruimte r.","2880","270-SA",,"e4*2007/46*0473*07","ZXH1A","WAL6","0","0.03","312","Nee","Nee",,"Nee","4333","0","0.00","2023","Logisch","00","Ja","2024-05-31T00:00:00.000","2022-06-23T00:00:00.000","2016-04-20T00:00:00.000","2016-04-20T00:00:00.000",,,,,,,,,,,,,,,,,,,,,,,,,,,,"https://opendata.rdw.nl/resource/3huj-srit.json","https://opendata.rdw.nl/resource/8ys7-d773.json","https://opendata.rdw.nl/resource/vezc-m2t6.json","https://opendata.rdw.nl/resource/jhie-znh9.json","https://opendata.rdw.nl/resource/kmfi-hrps.json"
"VV490P","Bedrijfsauto","FIAT","SCUDO BUSINESSVAN","20250429","20160429","10563","neerklapbare zijschotten","5","N.v.t.","N.v.t.","4","1997","1870","2932","1970","750",,"20160429","20160429","Geen verstrekking in Open Data","43590","Ja",,"1062",,,"2000",,"0","4","0","0",,"514","190","N1",,,"in motorruimte r.","2932","270-SA",,"e4*2007/46*0473*07","ZXL1B","WAL5","0","0.05","312","Nee","Nee",,"Nee","4932","0","0.00","2024","Logisch","00","Ja","2025-04-29T00:00:00.000","2016-04-29T00:00:00.000","2016-04-29T00:00:00.000","2016-04-29T00:00:00.000",,,,,,,,,,,,,,,,,,,,,,,,,,,,"https://opendata.rdw.nl/resource/3huj-srit.json","https://opendata.rdw.nl/resource/8ys7-d773.json","https://opendata.rdw.nl/resource/vezc-m2t6.json","https://opendata.rdw.nl/resource/jhie-znh9.json","https://opendata.rdw.nl/resource/kmfi-hrps.json"
"VV544H","Bedrijfsauto","FIAT","SCUDO BUSINESSVAN","20250321","20210727","10140","neerklapbare zijschotten","5","N.v.t.","N.v.t.","4","1997","1870","2932","1970","750",,"20160405","20160405","Geen verstrekking in Open Data","41813","Ja",,"1062",,,"2000",,"0","4","0","0",,"514","190","N1",,,"in motorruimte r.","2932","270-SA",,"e4*2007/46*0473*07","ZXL1B","WAL5","0","0.05","312","Nee","Nee",,"Nee","4932","0","0.00","2024","Logisch","00","Ja","2025-03-21T00:00:00.000","2021-07-27T00:00:00.000","2016-04-05T00:00:00.000","2016-04-05T00:00:00.000",,,,,,,,,,,,,,,,,,,,,,,,,,,,"https://opendata.rdw.nl/resource/3huj-srit.json","https://opendata.rdw.nl/resource/8ys7-d773.json","https://opendata.rdw.nl/resource/vezc-m2t6.json","https://opendata.rdw.nl/resource/jhie-znh9.json","https://opendata.rdw.nl/resource/kmfi-hrps.json"
"VV744F","Bedrijfsauto","FIAT","SCUDO BUSINESSVAN","20250119","20160330","8968","neerklapbare zijschotten","6","N.v.t.","N.v.t.","4","1560","1831","2880","1931","750",,"20160330","20160330","Geen verstrekking in Open Data","36877","Ja",,"1049",,,"1453",,"0","4","0","0",,"514","190","N1",,,"in motorruimte r.","2880","270-SA",,"e4*2007/46*0473*07","ZXH1A","WAL6","0","0.03","312","Nee","Nee",,"Nee","4333","0","0.00","2024","Logisch","00","Ja","2025-01-19T00:00:00.000","2016-03-30T00:00:00.000","2016-03-30T00:00:00.000","2016-03-30T00:00:00.000",,,,,,,,,,,,,,,,,,,,,,,,,,,,"https://opendata.rdw.nl/resource/3huj-srit.json","https://opendata.rdw.nl/resource/8ys7-d773.json","https://opendata.rdw.nl/resource/vezc-m2t6.json","https://opendata.rdw.nl/resource/jhie-znh9.json","https://opendata.rdw.nl/resource/kmfi-hrps.json"
"VV870B","Bedrijfsauto","FIAT","SCUDO BUSINESSVAN","20250325","20230315","10389","neerklapbare zijschotten","5","N.v.t.","N.v.t.","4","1997","1870","2932","1970","750",,"20160325","20160325","Geen verstrekking in Open Data","42860","Ja",,"1062",,,"2000",,"0","4","0","0",,"514","190","N1",,,"in motorruimte r.","2932","270-SA",,"e4*2007/46*0473*07","ZXL1B","WAL5","0","0.05","312","Nee","Nee",,"Nee","4932","0","0.00","2024","Logisch","00","Ja","2025-03-25T00:00:00.000","2023-03-15T00:00:00.000","2016-03-25T00:00:00.000","2016-03-25T00:00:00.000",,,,,,,,,,,,,,,,,,,,,,,,,,,,"https://opendata.rdw.nl/resource/3huj-srit.json","https://opendata.rdw.nl/resource/8ys7-d773.json","https://opendata.rdw.nl/resource/vezc-m2t6.json","https://opendata.rdw.nl/resource/jhie-znh9.json","https://opendata.rdw.nl/resource/kmfi-hrps.json"
"VXJ79H","Bedrijfsauto","FIAT","SCUDO","20271228","20231228",,"neerklapbare zijschotten","3","N.v.t.","N.v.t.",,,"2104","3100","2204","750",,"20231228","20231228","Geen verstrekking in Open Data","50995","Ja","130","996",,,"1000",,"2","4",,,,"512","197","N1",,,,"3100","V",,,,,,"0.03","328","Nee","Ja",,"Nee","4100",,,"2023","Logisch","00","Ja","2027-12-28T00:00:00.000","2023-12-28T00:00:00.000","2023-12-28T00:00:00.000","2023-12-28T00:00:00.000",,,,,,,,,,,"190",,,,,,,,,,,"20230721","2023-07-21T00:00:00.000",,,,,"https://opendata.rdw.nl/resource/3huj-srit.json","https://opendata.rdw.nl/resource/8ys7-d773.json","https://opendata.rdw.nl/resource/vezc-m2t6.json","https://opendata.rdw.nl/resource/jhie-znh9.json","https://opendata.rdw.nl/resource/kmfi-hrps.json"
