"kenteken","voertuigsoort","merk","handelsbenaming","vervaldatum_apk","datum_tenaamstelling","bruto_bpm","inrichting","aantal_zitplaatsen","eerste_kleur","tweede_kleur","aantal_cilinders","cilinderinhoud","massa_ledig_voertuig","toegestane_maximum_massa_voertuig","massa_rijklaar","maximum_massa_trekken_ongeremd","maximum_trekken_massa_geremd","datum_eerste_toelating","datum_eerste_tenaamstelling_in_nederland","wacht_op_keuren","catalogusprijs","wam_verzekerd","maximale_constructiesnelheid","laadvermogen","oplegger_geremd","aanhangwagen_autonoom_geremd","aanhangwagen_middenas_geremd","aantal_staanplaatsen","aantal_deuren","aantal_wielen","afstand_hart_koppeling_tot_achterzijde_voertuig","afstand_voorzijde_voertuig_tot_hart_koppeling","afwijkende_maximum_snelheid","lengte","breedte","europese_voertuigcategorie","europese_voertuigcategorie_toevoeging","europese_uitvoeringcategorie_toevoeging","plaats_chassisnummer","technische_max_massa_voertuig","type","type_gasinstallatie","typegoedkeuringsnummer","variant","uitvoering","volgnummer_wijziging_eu_typegoedkeuring","vermogen_massarijklaar","wielbasis","export_indicator","openstaande_terugroepactie_indicator","vervaldatum_tachograaf","taxi_indicator","maximum_massa_samenstelling","aantal_rolstoelplaatsen","maximum_ondersteunende_snelheid","jaar_laatste_registratie_tellerstand","tellerstandoordeel","code_toelichting_tellerstandoordeel","tenaamstellen_mogelijk","vervaldatum_apk_dt","datum_tenaamstelling_dt","datum_eerste_toelating_dt","datum_eerste_tenaamstelling_in_nederland_dt","vervaldatum_tachograaf_dt","maximum_last_onder_de_vooras_sen_tezamen_koppeling","type_remsysteem_voertuig_code","rupsonderstelconfiguratiecode","wielbasis_voertuig_minimum","wielbasis_voertuig_maximum","lengte_voertuig_minimum","lengte_voertuig_maximum","breedte_voertuig_minimum","breedte_voertuig_maximum","hoogte_voertuig","hoogte_voertuig_minimum","hoogte_voertuig_maximum","massa_bedrijfsklaar_minimaal","massa_bedrijfsklaar_maximaal","technisch_toelaatbaar_massa_koppelpunt","maximum_massa_technisch_maximaal","maximum_massa_technisch_minimaal","subcategorie_nederland","verticale_belasting_koppelpunt_getrokken_voertuig","zuinigheidsclassificatie","registratie_datum_goedkeuring_afschrijvingsmoment_bpm","registratie_datum_goedkeuring_afschrijvingsmoment_bpm_dt","gem_lading_wrde","aerodyn_voorz","massa_alt_aandr","verl_cab_ind","api_gekentekende_voertuigen_assen","api_gekentekende_voertuigen_brandstof","api_gekentekende_voertuigen_carrosserie","api_gekentekende_voertuigen_carrosserie_specifiek","api_gekentekende_voertuigen_voertuigklasse"
"V156VL","Bedrijfsauto","FIAT","FIAT DUCATO","20250116","20190218","11832","huifopbouw","3","N.v.t.","N.v.t.","4","2287","2540","3500","2640",,,"20190116","20190116","Geen verstrekking in Open Data","48931","Ja",,"960",,,,,,"4",,,,,"222","N1",,,"r. voorwielscherm by voorzitting","3500","250",,,,,,"0.04","404","Nee","Nee",,"Nee",,,,"2024","Logisch","00","Ja","2025-01-16T00:00:00.000","2019-02-18T00:00:00.000","2019-01-16T00:00:00.000","2019-01-16T00:00:00.000",,"0",,,,,,,,,,,,,,,,,,,,,,,,,,"https://opendata.rdw.nl/resource/3huj-srit.json","https://opendata.rdw.nl/resource/8ys7-d773.json","https://opendata.rdw.nl/resource/vezc-m2t6.json","https://opendata.rdw.nl/resource/jhie-znh9.json","https://opendata.rdw.nl/resource/kmfi-hrps.json"
"V453FV","Bedrijfsauto","FIAT","FIAT DUCATO","20240810","20170413","10981","huifopbouw","3","N.v.t.","N.v.t.","4","2287","2505","3500","2605",,,"20170407","20170407","Geen verstrekking in Open Data","45351","Ja",,"995",,,,,,"4",,,,,"220","N1",,,"r. voorwielscherm by vooras","3500","250",,,,,,"0.04","404","Nee","Nee",,"Nee","6500",,,"2023","Logisch","00","Ja","2024-08-10T00:00:00.000","2017-04-13T00:00:00.000","2017-04-07T00:00:00.000","2017-04-07T00:00:00.000",,"0",,,,,,,,,,,,,,,,,,,,,,,,,,"https://opendata.rdw.nl/resource/3huj-srit.json","https://opendata.rdw.nl/resource/8ys7-d773.json","https://opendata.rdw.nl/resource/vezc-m2t6.json","https://opendata.rdw.nl/resource/jhie-znh9.json","https://opendata.rdw.nl/resource/kmfi-hrps.json"
"V706VS","Bedrijfsauto","FIAT","FIAT DUCATO","20241105","20190205","10678","huifopbouw","3","N.v.t.","N.v.t.","4","2287","1885","3500","1985","750",,"20171017","20190130","Geen verstrekking in Open Data","44074","Ja",,"1615",,"2500","2500",,"2","4","0","0",,"633","210","N1",,,"r. voorwielscherm by voorzitting","3500","250",,"e3*2007/46*0044*22","C7MDC","GY","0","0.05","404","Nee","Nee",,"Nee","6000","0","0.00","2023","Geen oordeel","05","Ja","2024-11-05T00:00:00.000","2019-02-05T00:00:00.000","2017-10-17T00:00:00.000","2019-01-30T00:00:00.000",,"0",,,,,,,,,,,,,,,,,,,,,,,,,,"https://opendata.rdw.nl/resource/3huj-srit.json","https://opendata.rdw.nl/resource/8ys7-d773.json","https://opendata.rdw.nl/resource/vezc-m2t6.json","https://opendata.rdw.nl/resource/jhie-znh9.json","https://opendata.rdw.nl/resource/kmfi-hrps.json"
"VD143N","Bedrijfsauto","FIAT","DUCATO 15 2.3 JTD","20240508","20240508","8634","huifopbouw","6","N.v.t.","N.v.t.","4","2286","2100","3300","2200",,,"20050913","20130510","Geen verstrekking in Open Data",,"Ja",,"1200",,"2000","2000",,,"4",,,,,"208","N1",,,"r. voorwielscherm by voorzitting","3300","DUCATO 15 2.3 JTD",,,,,,"0.04","406","Nee","Nee",,"Nee","5300",,,"2024","Geen oordeel","05","Ja","2024-05-08T00:00:00.000","2024-05-08T00:00:00.000","2005-09-13T00:00:00.000","2013-05-10T00:00:00.000",,"0",,,,,,,,,,,,,,,,,,,,,,,,,,"https://opendata.rdw.nl/resource/3huj-srit.json","https://opendata.rdw.nl/resource/8ys7-d773.json","https://opendata.rdw.nl/resource/vezc-m2t6.json","https://opendata.rdw.nl/resource/jhie-znh9.json","https://opendata.rdw.nl/resource/kmfi-hrps.json"
"VD411J","Bedrijfsauto","FIAT","DUCATO 18 2.8 JTD 4X4","20230114","20220114","12065","huifopbouw","7","N.v.t.","N.v.t.","4","2800","2235","3500","2335","750",,"20051011","20130419","Geen verstrekking in Open Data",,"Nee",,"1265",,"2000","2000",,,"4",,,,,"207","N1",,,"r. balk v. achteras","3500",,,,,,,"0.04","320","Nee","Nee",,"Nee","5500",,,"2022","Geen oordeel","05","Ja","2023-01-14T00:00:00.000","2022-01-14T00:00:00.000","2005-10-11T00:00:00.000","2013-04-19T00:00:00.000",,"0",,,,,,,,,,,,,,,,,,,,,,,,,,"https://opendata.rdw.nl/resource/3huj-srit.json","https://opendata.rdw.nl/resource/8ys7-d773.json","https://opendata.rdw.nl/resource/vezc-m2t6.json","https://opendata.rdw.nl/resource/jhie-znh9.json","https://opendata.rdw.nl/resource/kmfi-hrps.json"
"VD726H","Bedrijfsauto","FIAT","DUCATO","20241103","20201104","12065","huifopbouw","7","N.v.t.","N.v.t.","4","2800","2235","3500","2335","750",,"20051118","20130419","Geen verstrekking in Open Data",,"Ja",,"1265",,"2000","2000",,,"4",,,,,"207","N1",,,"r. voorwielscherm by voorzitting","3500","DUCATO 18 2.8 JTD 4X4",,,,,,"0.04","320","Nee","Nee",,"Nee","5500",,,"2023","Geen oordeel","05","Ja","2024-11-03T00:00:00.000","2020-11-04T00:00:00.000","2005-11-18T00:00:00.000","2013-04-19T00:00:00.000",,"0",,,,,,,,,,,,,,,,,,,,,,,,,,"https://opendata.rdw.nl/resource/3huj-srit.json","https://opendata.rdw.nl/resource/8ys7-d773.json","https://opendata.rdw.nl/resource/vezc-m2t6.json","https://opendata.rdw.nl/resource/jhie-znh9.json","https://opendata.rdw.nl/resource/kmfi-hrps.json"
"VF212N","Bedrijfsauto","FIAT","DUCATO 15 2.0 JTD","20240404","20230308",,"huifopbouw","3","N.v.t.","N.v.t.","4","1997","1840","3300","1940","750",,"20050712","20130829","Geen verstrekking in Open Data",,"Nee",,"1460",,"1600","1600",,,"4",,,,,"207","N1",,,"r. deurdorpel by voorzitting","3300",,,,,,,"0.03","320","Nee","Nee",,"Nee","4900",,,"2023","Geen oordeel","05","Ja","2024-04-04T00:00:00.000","2023-03-08T00:00:00.000","2005-07-12T00:00:00.000","2013-08-29T00:00:00.000",,"0",,,,,,,,,,,,,,,,,,,,,,,,,,"https://opendata.rdw.nl/resource/3huj-srit.json","https://opendata.rdw.nl/resource/8ys7-d773.json","https://opendata.rdw.nl/resource/vezc-m2t6.json","https://opendata.rdw.nl/resource/jhie-znh9.json","https://opendata.rdw.nl/resource/kmfi-hrps.json"
"VF683B","Bedrijfsauto","FIAT","DUCATO 15 2.3 JTD","20240705","20230920","8188","huifopbouw","6","N.v.t.","N.v.t.","4","2286","2100","3300","2200","750",,"20050831","20130704","Geen verstrekking in Open Data",,"Ja",,"1200",,"2000","2000",,,"4",,,,,"206","N1",,,"r. voorwielscherm","3300",,,,,,,"0.04","405","Nee","Nee",,"Nee","5300",,,"2023","Geen oordeel","05","Ja","2024-07-05T00:00:00.000","2023-09-20T00:00:00.000","2005-08-31T00:00:00.000","2013-07-04T00:00:00.000",,"0",,,,,,,,,,,,,,,,,,,,,,,,,,"https://opendata.rdw.nl/resource/3huj-srit.json","https://opendata.rdw.nl/resource/8ys7-d773.json","https://opendata.rdw.nl/resource/vezc-m2t6.json","https://opendata.rdw.nl/resource/jhie-znh9.json","https://opendata.rdw.nl/resource/kmfi-hrps.json"
"VF783K","Bedrijfsauto","FIAT","DUCATO 18 2.8 JTD 4X4","20250119","20230106","11229","huifopbouw","7","N.v.t.","N.v.t.","4","2800","2235","3500","2335",,,"20050921","20130820","Geen verstrekking in Open Data",,"Ja",,"1265",,"2000","2000",,,"4",,,,,"208","N1",,,"r. voorwielscherm","3500","DUCATO 18 2.8 JTD 4X4",,,,,,"0.04","320","Nee","Nee",,"Nee","5500",,,"2024","Geen oordeel","05","Ja","2025-01-19T00:00:00.000","2023-01-06T00:00:00.000","2005-09-21T00:00:00.000","2013-08-20T00:00:00.000",,"0",,,,,,,,,,,,,,,,,,,,,,,,,,"https://opendata.rdw.nl/resource/3huj-srit.json","https://opendata.rdw.nl/resource/8ys7-d773.json","https://opendata.rdw.nl/resource/vezc-m2t6.json","https://opendata.rdw.nl/resource/jhie-znh9.json","https://opendata.rdw.nl/resource/kmfi-hrps.json"
"VF978X","Bedrijfsauto","FIAT","DUCATO 15 2.0 JTD","20241018","20131018","7530","huifopbouw","3","N.v.t.","N.v.t.","4","1997","1840","3300","1940",,,"20060419","20131018","Geen verstrekking in Open Data",,"Ja",,"1460",,,,,,"4",,,,,"210","N1",,,"r. voorwielscherm","3300","DUCATO 15 2.0 JTD",,,,,,"0.03","320","Nee","Nee",,"Nee",,,,"2023","Geen oordeel","05","Ja","2024-10-18T00:00:00.000","2013-10-18T00:00:00.000","2006-04-19T00:00:00.000","2013-10-18T00:00:00.000",,"0",,,,,,,,,,,,,,,,,,,,,,,,,,"https://opendata.rdw.nl/resource/3huj-srit.json","https://opendata.rdw.nl/resource/8ys7-d773.json","https://opendata.rdw.nl/resource/vezc-m2t6.json","https://opendata.rdw.nl/resource/jhie-znh9.json","https://opendata.rdw.nl/resource/kmfi-hrps.json"
"VG135X","Bedrijfsauto","FIAT","DUCATO 15 2.3 JTD","20250403","20140120","7845","huifopbouw","6","N.v.t.","N.v.t.","4","2286","2100","3400","2200","750",,"20060913","20140120","Geen verstrekking in Open Data",,"Ja",,"1300",,"1900","1900",,,"4",,,,,"210","N1",,,"r. voorwielscherm by voorzitting","3400",,,,,,,"0.04","405","Nee","Nee",,"Nee","5300",,,"2024","Geen oordeel","05","Ja","2025-04-03T00:00:00.000","2014-01-20T00:00:00.000","2006-09-13T00:00:00.000","2014-01-20T00:00:00.000",,"0",,,,,,,,,,,,,,,,,,,,,,,,,,"https://opendata.rdw.nl/resource/3huj-srit.json","https://opendata.rdw.nl/resource/8ys7-d773.json","https://opendata.rdw.nl/resource/vezc-m2t6.json","https://opendata.rdw.nl/resource/jhie-znh9.json","https://opendata.rdw.nl/resource/kmfi-hrps.json"
"VG220F","Bedrijfsauto","FIAT","DUCATO 15 2.0 JTD FURGONE","20241116","20231201","6759","huifopbouw","3","N.v.t.","N.v.t.","4","1997","1840","3300","1940",,,"20050706","20131111","Geen verstrekking in Open Data",,"Ja",,"1460",,"1600","1600",,,"4",,,,,"210","N1",,,"r. voorwielscherm by voorzitting","3300",,,,,,,"0.03","319","Nee","Nee",,"Nee","4900",,,"2023","Geen oordeel","05","Ja","2024-11-16T00:00:00.000","2023-12-01T00:00:00.000","2005-07-06T00:00:00.000","2013-11-11T00:00:00.000",,"0",,,,,,,,,,,,,,,,,,,,,,,,,,"https://opendata.rdw.nl/resource/3huj-srit.json","https://opendata.rdw.nl/resource/8ys7-d773.json","https://opendata.rdw.nl/resource/vezc-m2t6.json","https://opendata.rdw.nl/resource/jhie-znh9.json","https://opendata.rdw.nl/resource/kmfi-hrps.json"
"VG820B","Bedrijfsauto","FIAT","FIAT DUCATO","20241107","20240516","11190","huifopbouw","3","N.v.t.","N.v.t.","4","2999","2020","3500","2120","750",,"20131017","20131017","Geen verstrekking in Open Data","46232","Ja",,"1480",,"3500","3500",,,"4",,,,,"217","N1",,,"r. voorwielscherm by vooras","3500","250",,,,,,"0.06","345","Nee","Nee",,"Nee","6500",,,"2024","Logisch","00","Ja","2024-11-07T00:00:00.000","2024-05-16T00:00:00.000","2013-10-17T00:00:00.000","2013-10-17T00:00:00.000",,"0",,,,,,,,,,,,,,,,,,,,,,,,,,"https://opendata.rdw.nl/resource/3huj-srit.json","https://opendata.rdw.nl/resource/8ys7-d773.json","https://opendata.rdw.nl/resource/vezc-m2t6.json","https://opendata.rdw.nl/resource/jhie-znh9.json","https://opendata.rdw.nl/resource/kmfi-hrps.json"
"VH422G","Bedrijfsauto","FIAT","DUCATO 15 2.3 JTD","20250306","20201203","8188","huifopbouw","6","N.v.t.","N.v.t.","4","2286","2100","3300","2200",,,"20051006","20140220","Geen verstrekking in Open Data",,"Ja",,"1200",,"2000","2000",,,"4",,,,,"207","N1",,,"r. voorwielscherm","3400","DUCATO 15 2.3 JTD",,,,,,"0.04","404","Nee","Nee",,"Nee","5300",,,"2024","Onlogisch","04","Ja","2025-03-06T00:00:00.000","2020-12-03T00:00:00.000","2005-10-06T00:00:00.000","2014-02-20T00:00:00.000",,"0",,,,,,,,,,,,,,,,,,,,,,,,,,"https://opendata.rdw.nl/resource/3huj-srit.json","https://opendata.rdw.nl/resource/8ys7-d773.json","https://opendata.rdw.nl/resource/vezc-m2t6.json","https://opendata.rdw.nl/resource/jhie-znh9.json","https://opendata.rdw.nl/resource/kmfi-hrps.json"
"VH434G","Bedrijfsauto","FIAT","DUCATO 18 2.8 JTD 4X4","20250222","20140219","11228","huifopbouw","7","N.v.t.","N.v.t.","4","2800","2235","3500","2335","750",,"20051027","20140219","Geen verstrekking in Open Data",,"Ja",,"1265",,"2000","2000",,,"4",,,,,"210","N1",,,"r. voorwielscherm by voorzitting","3500","DUCATO 18 2.8 JTD 4X4",,,,,,"0.04","320","Nee","Nee",,"Nee","5500",,,"2024","Geen oordeel","05","Ja","2025-02-22T00:00:00.000","2014-02-19T00:00:00.000","2005-10-27T00:00:00.000","2014-02-19T00:00:00.000",,"0",,,,,,,,,,,,,,,,,,,,,,,,,,"https://opendata.rdw.nl/resource/3huj-srit.json","https://opendata.rdw.nl/resource/8ys7-d773.json","https://opendata.rdw.nl/resource/vezc-m2t6.json","https://opendata.rdw.nl/resource/jhie-znh9.json","https://opendata.rdw.nl/resource/kmfi-hrps.json"
"VH447D","Bedrijfsauto","FIAT","DUCATO 15 2.3 JTD","20250205","20230531","8780","huifopbouw","6","N.v.t.","N.v.t.","4","2286","2100","3400","2200","750",,"20051222","20140206","Geen verstrekking in Open Data",,"Ja",,"1300",,"1900","1900",,,"4",,,,,"213","N1",,,"r. voorwielscherm by voorzitting","3400","DUCATO 15 2.3 JTD",,,,,,"0.04","405","Nee","Nee",,"Nee","5300",,,"2024","Geen oordeel","05","Ja","2025-02-05T00:00:00.000","2023-05-31T00:00:00.000","2005-12-22T00:00:00.000","2014-02-06T00:00:00.000",,"0",,,,,,,,,,,,,,,,,,,,,,,,,,"https://opendata.rdw.nl/resource/3huj-srit.json","https://opendata.rdw.nl/resource/8ys7-d773.json","https://opendata.rdw.nl/resource/vezc-m2t6.json","https://opendata.rdw.nl/resource/jhie-znh9.json","https://opendata.rdw.nl/resource/kmfi-hrps.json"
"VH461G","Bedrijfsauto","FIAT","DUCATO 18 2.8 4X4","20250311","20140219","11228","huifopbouw","7","N.v.t.","N.v.t.","4","2800","2235","3500","2335","750",,"20051202","20140219","Geen verstrekking in Open Data",,"Ja",,"1265",,"2000","2000",,,"4",,,,,"210","N1",,,"r. voorwielscherm by voorzitting","3500","DUCATO 18 2.8 JTD 4X4",,,,,,"0.04","320","Nee","Nee",,"Nee","5500",,,"2024","Geen oordeel","05","Ja","2025-03-11T00:00:00.000","2014-02-19T00:00:00.000","2005-12-02T00:00:00.000","2014-02-19T00:00:00.000",,"0",,,,,,,,,,,,,,,,,,,,,,,,,,"https://opendata.rdw.nl/resource/3huj-srit.json","https://opendata.rdw.nl/resource/8ys7-d773.json","https://opendata.rdw.nl/resource/vezc-m2t6.json","https://opendata.rdw.nl/resource/jhie-znh9.json","https://opendata.rdw.nl/resource/kmfi-hrps.json"
"VK936T","Bedrijfsauto","FIAT","DUCATO 15 2.0 JTD","20241112","20141107","7530","huifopbouw","3","N.v.t.","N.v.t.","4","1997","1895","3300","1995",,,"20050726","20141107","Geen verstrekking in Open Data",,"Ja",,"1405",,"1600",,,,"4",,,,,"207","N1",,,"r. deurdorpel by pers.ruimte","3300","DUCATO 15 2.0 JTD",,,,,,"0.03","319","Nee","Nee",,"Nee","4900",,,"2023","Geen oordeel","05","Ja","2024-11-12T00:00:00.000","2014-11-07T00:00:00.000","2005-07-26T00:00:00.000","2014-11-07T00:00:00.000",,"0",,,,,,,,,,,,,,,,,,,,,,,,,,"https://opendata.rdw.nl/resource/3huj-srit.json","https://opendata.rdw.nl/resource/8ys7-d773.json","https://opendata.rdw.nl/resource/vezc-m2t6.json","https://opendata.rdw.nl/resource/jhie-znh9.json","https://opendata.rdw.nl/resource/kmfi-hrps.json"
"VNL22F","Bedrijfsauto","FIAT","DUCATO","20250124","20211215","11714","huifopbouw","3","N.v.t.","N.v.t.","4","2287","2494","3500","2594",,,"20170713","20211215","Geen verstrekking in Open Data","48437","Ja",,"1006",,"3000","3000",,,"4",,,,,"227","N1",,,,"3500","250D8MAUGY",,,,,,"0.04","403","Nee","Nee",,"Nee","6500",,,"2024","Geen oordeel","05","Ja","2025-01-24T00:00:00.000","2021-12-15T00:00:00.000","2017-07-13T00:00:00.000","2021-12-15T00:00:00.000",,,,,,,,,,,,,,,,,,,,,,"20211208","2021-12-08T00:00:00.000",,,,,"https://opendata.rdw.nl/resource/3huj-srit.json","https://opendata.rdw.nl/resource/8ys7-d773.json","https://opendata.rdw.nl/resource/vezc-m2t6.json","https://opendata.rdw.nl/resource/jhie-znh9.json","https://opendata.rdw.nl/resource/kmfi-hrps.json"
"VP859J","Bedrijfsauto","FIAT","FIAT DUCATO","20250331","20200622","12010","huifopbouw","3","N.v.t.","N.v.t.","4","2287","2750","3500","2850","750",,"20150610","20150610","Geen verstrekking in Open Data","49684","Ja",,"750",,"3000","3000",,,"4",,,,,"223","N1",,,"r. voorwielscherm by vooras","3500","250",,,,,,"0.04","404","Nee","Nee",,"Nee","6500",,,"2024","Logisch","00","Ja","2025-03-31T00:00:00.000","2020-06-22T00:00:00.000","2015-06-10T00:00:00.000","2015-06-10T00:00:00.000",,"0",,,,,,,,,,,,,,,,,,,,,,,,,,"https://opendata.rdw.nl/resource/3huj-srit.json","https://opendata.rdw.nl/resource/8ys7-d773.json","https://opendata.rdw.nl/resource/vezc-m2t6.json","https://opendata.rdw.nl/resource/jhie-znh9.json","https://opendata.rdw.nl/resource/kmfi-hrps.json"
"VRN38J","Bedrijfsauto","FIAT","DUCATO 14","20240719","20220720",,"huifopbouw","7","N.v.t.","N.v.t.","4","2500","1705","3200","1805","750",,"19970101","20220720","Geen verstrekking in Open Data",,"Nee",,"1495",,,"1600",,"4","4",,,,,"204","N1",,,,"3200","230 BD MG C",,,,,,"0.04","370","Nee","Nee",,"Nee","4800",,,"2023","Geen oordeel","05","Ja","2024-07-19T00:00:00.000","2022-07-20T00:00:00.000","1997-01-01T00:00:00.000","2022-07-20T00:00:00.000",,,,,,,,,,,,,,,,,,,,,,"20220719","2022-07-19T00:00:00.000",,,,,"https://opendata.rdw.nl/resource/3huj-srit.json","https://opendata.rdw.nl/resource/8ys7-d773.json","https://opendata.rdw.nl/resource/vezc-m2t6.json","https://opendata.rdw.nl/resource/jhie-znh9.json","https://opendata.rdw.nl/resource/kmfi-hrps.json"
"VT291G","Bedrijfsauto","FIAT","FIAT DUCATO","20250214","20160311","13304","huifopbouw","6","N.v.t.","N.v.t.","4","2999","2500","3500","2600","750",,"20160128","20160128","Geen verstrekking in Open Data","47869","Ja",,"1000",,,"3000",,,"4",,,,,"210","N1",,,"r. voorwielscherm by vooras","3500","250",,,,,,"0.05","404","Nee","Nee","20250216","Nee","6500",,,"2024","Logisch","00","Ja","2025-02-14T00:00:00.000","2016-03-11T00:00:00.000","2016-01-28T00:00:00.000","2016-01-28T00:00:00.000","2025-02-16T00:00:00.000","0",,,,,,,,,,,,,,,,,,,,,,,,,,"https://opendata.rdw.nl/resource/3huj-srit.json","https://opendata.rdw.nl/resource/8ys7-d773.json","https://opendata.rdw.nl/resource/vezc-m2t6.json","https://opendata.rdw.nl/resource/jhie-znh9.json","https://opendata.rdw.nl/resource/kmfi-hrps.json"
"VZB84H","Bedrijfsauto","FIAT","FIAT DUCATO","20250513","20231004","7813","huifopbouw","3","N.v.t.","N.v.t.","4","2287","2285","3500","2385","750",,"20190330","20231004","Geen verstrekking in Open Data","32013","Ja","155","1215",,,"3000",,"2","4","0","0",,"658","226","N1",,,"r. voorwielscherm by vooras","3500","250/NP",,"e20*2007/46*0055*01","D7MAU/NI","GY","0","0.04","404","Nee","Nee",,"Nee","6500","0","0.00","2024","Geen oordeel","05","Ja","2025-05-13T00:00:00.000","2023-10-04T00:00:00.000","2019-03-30T00:00:00.000","2023-10-04T00:00:00.000",,,,,,,,,,,"322",,,,,,,,,,,"20230919","2023-09-19T00:00:00.000",,,,,"https://opendata.rdw.nl/resource/3huj-srit.json","https://opendata.rdw.nl/resource/8ys7-d773.json","https://opendata.rdw.nl/resource/vezc-m2t6.json","https://opendata.rdw.nl/resource/jhie-znh9.json","https://opendata.rdw.nl/resource/kmfi-hrps.json"
