"kenteken","voertuigsoort","merk","handelsbenaming","vervaldatum_apk","datum_tenaamstelling","bruto_bpm","inrichting","aantal_zitplaatsen","eerste_kleur","tweede_kleur","aantal_cilinders","cilinderinhoud","massa_ledig_voertuig","toegestane_maximum_massa_voertuig","massa_rijklaar","maximum_massa_trekken_ongeremd","maximum_trekken_massa_geremd","datum_eerste_toelating","datum_eerste_tenaamstelling_in_nederland","wacht_op_keuren","catalogusprijs","wam_verzekerd","maximale_constructiesnelheid","laadvermogen","oplegger_geremd","aanhangwagen_autonoom_geremd","aanhangwagen_middenas_geremd","aantal_staanplaatsen","aantal_deuren","aantal_wielen","afstand_hart_koppeling_tot_achterzijde_voertuig","afstand_voorzijde_voertuig_tot_hart_koppeling","afwijkende_maximum_snelheid","lengte","breedte","europese_voertuigcategorie","europese_voertuigcategorie_toevoeging","europese_uitvoeringcategorie_toevoeging","plaats_chassisnummer","technische_max_massa_voertuig","type","type_gasinstallatie","typegoedkeuringsnummer","variant","uitvoering","volgnummer_wijziging_eu_typegoedkeuring","vermogen_massarijklaar","wielbasis","export_indicator","openstaande_terugroepactie_indicator","vervaldatum_tachograaf","taxi_indicator","maximum_massa_samenstelling","aantal_rolstoelplaatsen","maximum_ondersteunende_snelheid","jaar_laatste_registratie_tellerstand","tellerstandoordeel","code_toelichting_tellerstandoordeel","tenaamstellen_mogelijk","vervaldatum_apk_dt","datum_tenaamstelling_dt","datum_eerste_toelating_dt","datum_eerste_tenaamstelling_in_nederland_dt","vervaldatum_tachograaf_dt","maximum_last_onder_de_vooras_sen_tezamen_koppeling","type_remsysteem_voertuig_code","rupsonderstelconfiguratiecode","wielbasis_voertuig_minimum","wielbasis_voertuig_maximum","lengte_voertuig_minimum","lengte_voertuig_maximum","breedte_voertuig_minimum","breedte_voertuig_maximum","hoogte_voertuig","hoogte_voertuig_minimum","hoogte_voertuig_maximum","massa_bedrijfsklaar_minimaal","massa_bedrijfsklaar_maximaal","technisch_toelaatbaar_massa_koppelpunt","maximum_massa_technisch_maximaal","maximum_massa_technisch_minimaal","subcategorie_nederland","verticale_belasting_koppelpunt_getrokken_voertuig","zuinigheidsclassificatie","registratie_datum_goedkeuring_afschrijvingsmoment_bpm","registratie_datum_goedkeuring_afschrijvingsmoment_bpm_dt","gem_lading_wrde","aerodyn_voorz","massa_alt_aandr","verl_cab_ind","api_gekentekende_voertuigen_assen","api_gekentekende_voertuigen_brandstof","api_gekentekende_voertuigen_carrosserie","api_gekentekende_voertuigen_carrosserie_specifiek","api_gekentekende_voertuigen_voertuigklasse"
"H346KS","Personenauto","FIAT","500E","20241204","20201208",,"hatchback","4","GRIJS","Niet geregistreerd",,,"1284","1701","1384",,,"20161021","20201208","Geen verstrekking in Open Data","33289","Ja","137",,,,,,"2","4",,,,,,"M1",,,"r. deurdorpel","1701","500 E",,,,,,"0.01","230","Nee","Nee",,"Nee",,,,"2022","Geen oordeel","05","Ja","2024-12-04T00:00:00.000","2020-12-08T00:00:00.000","2016-10-21T00:00:00.000","2020-12-08T00:00:00.000",,,,,,,,,,,,,,,,,,,,,,,,,,,,"https://opendata.rdw.nl/resource/3huj-srit.json","https://opendata.rdw.nl/resource/8ys7-d773.json","https://opendata.rdw.nl/resource/vezc-m2t6.json","https://opendata.rdw.nl/resource/jhie-znh9.json","https://opendata.rdw.nl/resource/kmfi-hrps.json"
"H831NB","Personenauto","FIAT","500 E","20250408","20221109",,"hatchback","4","GRIJS","Niet geregistreerd",,,"1350","1701","1450",,,"20161118","20200605","Geen verstrekking in Open Data","33880","Ja",,,,,,,"2","4",,,,"362","163","M1",,,"r. deurdorpel","1701",,,,,,,"0.06","230","Nee","Nee",,"Nee",,,,"2024","Geen oordeel","05","Ja","2025-04-08T00:00:00.000","2022-11-09T00:00:00.000","2016-11-18T00:00:00.000","2020-06-05T00:00:00.000",,,,,,,,,,,"153",,,,,,,,,,,,,,,,,"https://opendata.rdw.nl/resource/3huj-srit.json","https://opendata.rdw.nl/resource/8ys7-d773.json","https://opendata.rdw.nl/resource/vezc-m2t6.json","https://opendata.rdw.nl/resource/jhie-znh9.json","https://opendata.rdw.nl/resource/kmfi-hrps.json"
"H941NJ","Personenauto","FIAT","500 E","20260301","20200829",,"hatchback","4","GRIJS","Niet geregistreerd",,,"1340","1654","1440",,,"20170228","20200310","Geen verstrekking in Open Data","37708","Ja",,,,,,,"3","4",,,,,,"M1",,,"r. deurdorpel by voorzitting","1654",,,,,,,"0.06","230","Nee","Nee",,"Nee",,,,"2024","Geen oordeel","05","Ja","2026-03-01T00:00:00.000","2020-08-29T00:00:00.000","2017-02-28T00:00:00.000","2020-03-10T00:00:00.000",,,,,,,,,,,,,,,,,,,,,,,,,,,,"https://opendata.rdw.nl/resource/3huj-srit.json","https://opendata.rdw.nl/resource/8ys7-d773.json","https://opendata.rdw.nl/resource/vezc-m2t6.json","https://opendata.rdw.nl/resource/jhie-znh9.json","https://opendata.rdw.nl/resource/kmfi-hrps.json"
"JH168N","Personenauto","FIAT","500 E","20240630","20210326",,"hatchback","4","GRIJS","Niet geregistreerd",,,"1243","1701","1343",,,"20140630","20160321","Geen verstrekking in Open Data","15668","Ja",,,,,,,"2","4",,,,,,"M1",,,"r. deurdorpel","1701",,,,,,,"0.06","230","Nee","Ja",,"Nee",,,,"2023","Geen oordeel","05","Ja","2024-06-30T00:00:00.000","2021-03-26T00:00:00.000","2014-06-30T00:00:00.000","2016-03-21T00:00:00.000",,,,,,,,,,,,,,,,,,,,,,,,,,,,"https://opendata.rdw.nl/resource/3huj-srit.json","https://opendata.rdw.nl/resource/8ys7-d773.json","https://opendata.rdw.nl/resource/vezc-m2t6.json","https://opendata.rdw.nl/resource/jhie-znh9.json","https://opendata.rdw.nl/resource/kmfi-hrps.json"
"K058PX","Personenauto","FIAT","500E","20251027","20210130",,"hatchback","4","GRIJS","Niet geregistreerd",,,"1285","1701","1385",,,"20171025","20210130","Geen verstrekking in Open Data","34085","Ja","137",,,,,,"2","4",,,,,,"M1",,,"r. deurdorpel","1701","500 E",,,,,,"0.00","230","Nee","Nee",,"Nee",,,,"2023","Geen oordeel","05","Ja","2025-10-27T00:00:00.000","2021-01-30T00:00:00.000","2017-10-25T00:00:00.000","2021-01-30T00:00:00.000",,,,,,,,,,,,,,,,,,,,,,,,,,,,"https://opendata.rdw.nl/resource/3huj-srit.json","https://opendata.rdw.nl/resource/8ys7-d773.json","https://opendata.rdw.nl/resource/vezc-m2t6.json","https://opendata.rdw.nl/resource/jhie-znh9.json","https://opendata.rdw.nl/resource/kmfi-hrps.json"
"L535KD","Personenauto","FIAT","FIAT 500 E","20250113","20240315",,"hatchback","4","GRIJS","Niet geregistreerd",,,"1285","1701","1385",,,"20140701","20210606","Geen verstrekking in Open Data","22565","Ja","137",,,,,,"2","4",,,,,,"M1",,,,"1701",,,,,,,"0.00","230","Nee","Nee",,"Nee",,,,"2024","Geen oordeel","05","Ja","2025-01-13T00:00:00.000","2024-03-15T00:00:00.000","2014-07-01T00:00:00.000","2021-06-06T00:00:00.000",,,,,,,,,,,,,,,,,,,,,,,,,,,,"https://opendata.rdw.nl/resource/3huj-srit.json","https://opendata.rdw.nl/resource/8ys7-d773.json","https://opendata.rdw.nl/resource/vezc-m2t6.json","https://opendata.rdw.nl/resource/jhie-znh9.json","https://opendata.rdw.nl/resource/kmfi-hrps.json"
"N287HT","Personenauto","FIAT","500 E","20241014","20211018",,"coupe","4","BLAUW","Niet geregistreerd",,,"1345","1701","1445",,,"20150228","20211018","Geen verstrekking in Open Data","31460","Ja",,,,,,,"2","4",,,,,,"M1",,,"r. by deurdorpel","1701",,,,,,,"0.00","228","Nee","Nee",,"Nee",,,,"2023","Geen oordeel","05","Ja","2024-10-14T00:00:00.000","2021-10-18T00:00:00.000","2015-02-28T00:00:00.000","2021-10-18T00:00:00.000",,,,,,,,,,,,,,,,,,,,,,"20211014","2021-10-14T00:00:00.000",,,,,"https://opendata.rdw.nl/resource/3huj-srit.json","https://opendata.rdw.nl/resource/8ys7-d773.json","https://opendata.rdw.nl/resource/vezc-m2t6.json","https://opendata.rdw.nl/resource/jhie-znh9.json","https://opendata.rdw.nl/resource/kmfi-hrps.json"
"N909BL","Personenauto","FIAT","500 E","20240729","20240417",,"hatchback","4","BLAUW","Niet geregistreerd",,,"1316","1701","1416",,,"20150228","20210911","Geen verstrekking in Open Data","24600","Ja","137",,,,,,"2","4",,,,"362","163","M1",,,"r. deurdorpel","1701",,,,,,,"0.00","230","Nee","Nee",,"Nee",,,,"2024","Geen oordeel","05","Ja","2024-07-29T00:00:00.000","2024-04-17T00:00:00.000","2015-02-28T00:00:00.000","2021-09-11T00:00:00.000",,,,,,,,,,,"153",,,,,,,,,,,,,,,,,"https://opendata.rdw.nl/resource/3huj-srit.json","https://opendata.rdw.nl/resource/8ys7-d773.json","https://opendata.rdw.nl/resource/vezc-m2t6.json","https://opendata.rdw.nl/resource/jhie-znh9.json","https://opendata.rdw.nl/resource/kmfi-hrps.json"
"N988RX","Personenauto","FIAT","500 E","20251201","20220102",,"hatchback","4","WIT","Niet geregistreerd",,,"1317","1701","1417",,,"20171129","20220102","Geen verstrekking in Open Data","33880","Ja",,,,,,,"2","4",,,,"357","163","M1",,,"r. deurdorpel by voorzitting","1701",,,,,,,"0.06","230","Nee","Nee",,"Nee",,,,"2023","Geen oordeel","05","Ja","2025-12-01T00:00:00.000","2022-01-02T00:00:00.000","2017-11-29T00:00:00.000","2022-01-02T00:00:00.000",,,,,,,,,,,"149",,,,,,,,,,,"20211201","2021-12-01T00:00:00.000",,,,,"https://opendata.rdw.nl/resource/3huj-srit.json","https://opendata.rdw.nl/resource/8ys7-d773.json","https://opendata.rdw.nl/resource/vezc-m2t6.json","https://opendata.rdw.nl/resource/jhie-znh9.json","https://opendata.rdw.nl/resource/kmfi-hrps.json"
"P025TH","Personenauto","FIAT","500 ELECTRIC","20240616","20220617",,"hatchback","4","ZWART","Niet geregistreerd",,,"1250","1701","1350",,,"20150805","20220617","Geen verstrekking in Open Data","28919","Ja","137",,,,,,"2","4",,,,,,"M1",,,,"1701",,,,,,,"0.00","230","Nee","Nee",,"Nee",,,,"2023","Geen oordeel","05","Ja","2024-06-16T00:00:00.000","2022-06-17T00:00:00.000","2015-08-05T00:00:00.000","2022-06-17T00:00:00.000",,,,,,,,,,,,,,,,,,,,,,"20220530","2022-05-30T00:00:00.000",,,,,"https://opendata.rdw.nl/resource/3huj-srit.json","https://opendata.rdw.nl/resource/8ys7-d773.json","https://opendata.rdw.nl/resource/vezc-m2t6.json","https://opendata.rdw.nl/resource/jhie-znh9.json","https://opendata.rdw.nl/resource/kmfi-hrps.json"
"P117TH","Personenauto","FIAT","500 E","20240617","20220617",,"hatchback","4","GRIJS","Niet geregistreerd",,,"1260","1701","1360",,,"20150227","20220617","Geen verstrekking in Open Data","30250","Ja","137",,,,,,"2","4",,,,"355","163","M1",,,,"1701",,,,,,,"0.02","230","Nee","Nee",,"Nee",,,,"2023","Geen oordeel","05","Ja","2024-06-17T00:00:00.000","2022-06-17T00:00:00.000","2015-02-27T00:00:00.000","2022-06-17T00:00:00.000",,,,,,,,,,,"149",,,,,,,,,,,"20220527","2022-05-27T00:00:00.000",,,,,"https://opendata.rdw.nl/resource/3huj-srit.json","https://opendata.rdw.nl/resource/8ys7-d773.json","https://opendata.rdw.nl/resource/vezc-m2t6.json","https://opendata.rdw.nl/resource/jhie-znh9.json","https://opendata.rdw.nl/resource/kmfi-hrps.json"
"P283RJ","Personenauto","FIAT","FIAT 500 E","20240520","20220519",,"hatchback","4","ZWART","Niet geregistreerd",,,"1340","1701","1440",,,"20160708","20220519","Geen verstrekking in Open Data","27074","Ja","141",,,,,,"2","4",,,,,,"M1",,,,"1701",,,,,,,"0.00","230","Nee","Nee",,"Nee",,,,"2022","Geen oordeel","05","Ja","2024-05-20T00:00:00.000","2022-05-19T00:00:00.000","2016-07-08T00:00:00.000","2022-05-19T00:00:00.000",,,,,,,,,,,,,,,,,,,,,,"20220503","2022-05-03T00:00:00.000",,,,,"https://opendata.rdw.nl/resource/3huj-srit.json","https://opendata.rdw.nl/resource/8ys7-d773.json","https://opendata.rdw.nl/resource/vezc-m2t6.json","https://opendata.rdw.nl/resource/jhie-znh9.json","https://opendata.rdw.nl/resource/kmfi-hrps.json"
"P446PN","Personenauto","FIAT","500 ELECTRIC","20250519","20220519",,"hatchback","4","ZWART","Niet geregistreerd",,,"1250","1701","1350",,,"20141231","20220519","Geen verstrekking in Open Data","30250","Ja","137",,,,,,"2","4",,,,"362","163","M1",,,,"1701",,,,,,,"0.00","230","Nee","Nee",,"Nee",,,,"2024","Geen oordeel","05","Ja","2025-05-19T00:00:00.000","2022-05-19T00:00:00.000","2014-12-31T00:00:00.000","2022-05-19T00:00:00.000",,,,,,,,,,,,,,,,,,,,,,"20220406","2022-04-06T00:00:00.000",,,,,"https://opendata.rdw.nl/resource/3huj-srit.json","https://opendata.rdw.nl/resource/8ys7-d773.json","https://opendata.rdw.nl/resource/vezc-m2t6.json","https://opendata.rdw.nl/resource/jhie-znh9.json","https://opendata.rdw.nl/resource/kmfi-hrps.json"
"P655LL","Personenauto","FIAT","500 ELECTRIC","20250122","20220608",,"hatchback","4","GRIJS","Niet geregistreerd",,,"1325","1701","1425",,,"20150806","20220516","Geen verstrekking in Open Data","33880","Ja","137",,,,,,"3","4",,,,"362","163","M1",,,,"1701",,,,,,,"0.02","230","Nee","Nee",,"Nee",,,,"2024","Geen oordeel","05","Ja","2025-01-22T00:00:00.000","2022-06-08T00:00:00.000","2015-08-06T00:00:00.000","2022-05-16T00:00:00.000",,,,,,,,,,,"149",,,,,,,,,,,"20220411","2022-04-11T00:00:00.000",,,,,"https://opendata.rdw.nl/resource/3huj-srit.json","https://opendata.rdw.nl/resource/8ys7-d773.json","https://opendata.rdw.nl/resource/vezc-m2t6.json","https://opendata.rdw.nl/resource/jhie-znh9.json","https://opendata.rdw.nl/resource/kmfi-hrps.json"
"P681LL","Personenauto","FIAT","500 E","20250502","20220507",,"hatchback","4","BLAUW","Niet geregistreerd",,,"1260","1701","1360",,,"20151215","20220507","Geen verstrekking in Open Data","30250","Ja","137",,,,,,"2","4",,,,"355","163","M1",,,"r. bodemplaat by voorzitting","1701","500",,,,,,"0.02","230","Nee","Nee",,"Nee",,,,"2024","Geen oordeel","05","Ja","2025-05-02T00:00:00.000","2022-05-07T00:00:00.000","2015-12-15T00:00:00.000","2022-05-07T00:00:00.000",,,,,,,,,,,"149",,,,,,,,,,,"20220415","2022-04-15T00:00:00.000",,,,,"https://opendata.rdw.nl/resource/3huj-srit.json","https://opendata.rdw.nl/resource/8ys7-d773.json","https://opendata.rdw.nl/resource/vezc-m2t6.json","https://opendata.rdw.nl/resource/jhie-znh9.json","https://opendata.rdw.nl/resource/kmfi-hrps.json"
"PH143P","Personenauto","FIAT","500 E","20200424","20171006",,"hatchback","4","ZWART","Niet geregistreerd","0",,"1330","1701","1430",,,"20140408","20170627","Geen verstrekking in Open Data","33517","Nee",,,,,,,"2","4",,,,,,"M1",,,"r. deurdorpel","1701","500E",,,,,,"0.06","231","Nee","Nee",,"Nee",,,,"2018","Geen oordeel","05","Ja","2020-04-24T00:00:00.000","2017-10-06T00:00:00.000","2014-04-08T00:00:00.000","2017-06-27T00:00:00.000",,,,,,,,,,,,,,,,,,,,,,,,,,,,"https://opendata.rdw.nl/resource/3huj-srit.json","https://opendata.rdw.nl/resource/8ys7-d773.json","https://opendata.rdw.nl/resource/vezc-m2t6.json","https://opendata.rdw.nl/resource/jhie-znh9.json","https://opendata.rdw.nl/resource/kmfi-hrps.json"
"PH167P","Personenauto","FIAT","500 E","20240613","20191214",,"hatchback","4","ORANJE","Niet geregistreerd",,,"1330","1701","1430",,,"20140410","20170627","Geen verstrekking in Open Data","33517","Ja",,,,,,,"2","4",,,,,,"M1",,,"r. deurdorpel","1701","500E",,,,,,"0.06","231","Nee","Nee",,"Nee",,,,"2023","Geen oordeel","05","Ja","2024-06-13T00:00:00.000","2019-12-14T00:00:00.000","2014-04-10T00:00:00.000","2017-06-27T00:00:00.000",,,,,,,,,,,,,,,,,,,,,,,,,,,,"https://opendata.rdw.nl/resource/3huj-srit.json","https://opendata.rdw.nl/resource/8ys7-d773.json","https://opendata.rdw.nl/resource/vezc-m2t6.json","https://opendata.rdw.nl/resource/jhie-znh9.json","https://opendata.rdw.nl/resource/kmfi-hrps.json"
"PH203P","Personenauto","FIAT","500 E","20240609","20220607",,"hatchback","4","WIT","Niet geregistreerd","0",,"1330","1701","1430",,,"20140522","20170627","Geen verstrekking in Open Data","33517","Ja",,,,,,,"2","4",,,,,,"M1",,,"r. deurdorpel","1701","500E",,,,,,"0.06","231","Nee","Nee",,"Nee",,,,"2023","Geen oordeel","05","Ja","2024-06-09T00:00:00.000","2022-06-07T00:00:00.000","2014-05-22T00:00:00.000","2017-06-27T00:00:00.000",,,,,,,,,,,,,,,,,,,,,,,,,,,,"https://opendata.rdw.nl/resource/3huj-srit.json","https://opendata.rdw.nl/resource/8ys7-d773.json","https://opendata.rdw.nl/resource/vezc-m2t6.json","https://opendata.rdw.nl/resource/jhie-znh9.json","https://opendata.rdw.nl/resource/kmfi-hrps.json"
"PH402P","Personenauto","FIAT","500 E","20250520","20240409",,"hatchback","4","ORANJE","Niet geregistreerd",,,"1330","1701","1430",,,"20140514","20170627","Geen verstrekking in Open Data","33517","Ja",,,,,,,"2","4",,,,,,"M1",,,"r. deurdorpel","1701","500E",,,,,,"0.06","231","Nee","Nee",,"Nee",,,,"2024","Geen oordeel","05","Ja","2025-05-20T00:00:00.000","2024-04-09T00:00:00.000","2014-05-14T00:00:00.000","2017-06-27T00:00:00.000",,,,,,,,,,,,,,,,,,,,,,,,,,,,"https://opendata.rdw.nl/resource/3huj-srit.json","https://opendata.rdw.nl/resource/8ys7-d773.json","https://opendata.rdw.nl/resource/vezc-m2t6.json","https://opendata.rdw.nl/resource/jhie-znh9.json","https://opendata.rdw.nl/resource/kmfi-hrps.json"
"PH473P","Personenauto","FIAT","500 E","20240623","20231005",,"hatchback","4","GRIJS","Niet geregistreerd","0",,"1330","1701","1430",,,"20140623","20170627","Geen verstrekking in Open Data","33517","Ja",,,,,,,"2","4",,,,,,"M1",,,"r. deurdorpel","1701","500E",,,,,,"0.06","231","Nee","Nee",,"Nee",,,,"2023","Onlogisch","04","Ja","2024-06-23T00:00:00.000","2023-10-05T00:00:00.000","2014-06-23T00:00:00.000","2017-06-27T00:00:00.000",,,,,,,,,,,,,,,,,,,,,,,,,,,,"https://opendata.rdw.nl/resource/3huj-srit.json","https://opendata.rdw.nl/resource/8ys7-d773.json","https://opendata.rdw.nl/resource/vezc-m2t6.json","https://opendata.rdw.nl/resource/jhie-znh9.json","https://opendata.rdw.nl/resource/kmfi-hrps.json"
"PR709B","Personenauto","FIAT","500E","20240825","20240109",,"hatchback","4","WIT","Niet geregistreerd",,,"1285","1701","1385",,,"20140521","20170826","Geen verstrekking in Open Data","35589","Ja",,,,,,,"2","4",,,,,,"M1",,,"by r. deurdorpel","1701","500 E",,,,,,"0.06","231","Nee","Nee",,"Nee",,,,"2023","Geen oordeel","05","Ja","2024-08-25T00:00:00.000","2024-01-09T00:00:00.000","2014-05-21T00:00:00.000","2017-08-26T00:00:00.000",,,,,,,,,,,,,,,,,,,,,,,,,,,,"https://opendata.rdw.nl/resource/3huj-srit.json","https://opendata.rdw.nl/resource/8ys7-d773.json","https://opendata.rdw.nl/resource/vezc-m2t6.json","https://opendata.rdw.nl/resource/jhie-znh9.json","https://opendata.rdw.nl/resource/kmfi-hrps.json"
"RX653B","Personenauto","FIAT","500 ELECTRIC","20260301","20180213",,"hatchback","4","ZWART","Niet geregistreerd","0",,"1327","1701","1427",,,"20171114","20180213","Geen verstrekking in Open Data","32049","Ja",,,,,,,"2","4",,,,,,"M1",,,"r. deurdorpel","1701",,,,,,,"0.06","230","Nee","Nee",,"Nee",,,,"2024","Geen oordeel","05","Ja","2026-03-01T00:00:00.000","2018-02-13T00:00:00.000","2017-11-14T00:00:00.000","2018-02-13T00:00:00.000",,,,,,,,,,,,,,,,,,,,,,,,,,,,"https://opendata.rdw.nl/resource/3huj-srit.json","https://opendata.rdw.nl/resource/8ys7-d773.json","https://opendata.rdw.nl/resource/vezc-m2t6.json","https://opendata.rdw.nl/resource/jhie-znh9.json","https://opendata.rdw.nl/resource/kmfi-hrps.json"
"S562GD","Personenauto","FIAT","500E","20250109","20240106",,"hatchback","4","WIT","Niet geregistreerd",,,"1359","1701","1459",,,"20150107","20230103","Geen verstrekking in Open Data","37026","Ja","137",,,,,,"2","4",,,,,,"M1",,,,"1701","500 E",,,,,,"0.06","230","Nee","Nee",,"Nee",,,,"2024","Geen oordeel","05","Ja","2025-01-09T00:00:00.000","2024-01-06T00:00:00.000","2015-01-07T00:00:00.000","2023-01-03T00:00:00.000",,,,,,,,,,,,,,,,,,,,,,"20230103","2023-01-03T00:00:00.000",,,,,"https://opendata.rdw.nl/resource/3huj-srit.json","https://opendata.rdw.nl/resource/8ys7-d773.json","https://opendata.rdw.nl/resource/vezc-m2t6.json","https://opendata.rdw.nl/resource/jhie-znh9.json","https://opendata.rdw.nl/resource/kmfi-hrps.json"
"SB556S","Personenauto","FIAT","500 E","20240820","20180314",,"hatchback","4","ORANJE","Niet geregistreerd","0",,"1284","1701","1384",,,"20140919","20180308","Geen verstrekking in Open Data","26124","Ja",,,,,,,"2","4",,,,,,"M1",,,"r. deurdorpel","1701","500E",,,,,,"0.06","231","Nee","Nee",,"Nee",,,,"2023","Geen oordeel","05","Ja","2024-08-20T00:00:00.000","2018-03-14T00:00:00.000","2014-09-19T00:00:00.000","2018-03-08T00:00:00.000",,,,,,,,,,,,,,,,,,,,,,,,,,,,"https://opendata.rdw.nl/resource/3huj-srit.json","https://opendata.rdw.nl/resource/8ys7-d773.json","https://opendata.rdw.nl/resource/vezc-m2t6.json","https://opendata.rdw.nl/resource/jhie-znh9.json","https://opendata.rdw.nl/resource/kmfi-hrps.json"
"T397LS","Personenauto","FIAT","500 ELECTRIC","20250513","20230714",,"hatchback","4","GRIJS","Niet geregistreerd",,,"1250","1701","1350",,,"20150814","20230714","Geen verstrekking in Open Data","29645","Ja","137",,,,,,"2","4",,,,"362","163","M1",,,,"1701",,,,,,,"0.00","230","Nee","Nee",,"Nee",,,,"2024","Geen oordeel","05","Ja","2025-05-13T00:00:00.000","2023-07-14T00:00:00.000","2015-08-14T00:00:00.000","2023-07-14T00:00:00.000",,,,,,,,,,,"153",,,,,,,,,,,"20230705","2023-07-05T00:00:00.000",,,,,"https://opendata.rdw.nl/resource/3huj-srit.json","https://opendata.rdw.nl/resource/8ys7-d773.json","https://opendata.rdw.nl/resource/vezc-m2t6.json","https://opendata.rdw.nl/resource/jhie-znh9.json","https://opendata.rdw.nl/resource/kmfi-hrps.json"
"T856TL","Personenauto","FIAT","500 E","20240607","20231005",,"hatchback","4","ORANJE","Niet geregistreerd",,,"1325","1701","1425",,,"20150401","20230901","Geen verstrekking in Open Data","17545","Ja","140",,,,,,"2","4",,,,"362","163","M1",,,,"1701",,,,,,,"0.02","230","Nee","Nee",,"Nee",,,,"2023","Geen oordeel","05","Ja","2024-06-07T00:00:00.000","2023-10-05T00:00:00.000","2015-04-01T00:00:00.000","2023-09-01T00:00:00.000",,,,,,,,,,,"153",,,,,,,,,,,"20230803","2023-08-03T00:00:00.000",,,,,"https://opendata.rdw.nl/resource/3huj-srit.json","https://opendata.rdw.nl/resource/8ys7-d773.json","https://opendata.rdw.nl/resource/vezc-m2t6.json","https://opendata.rdw.nl/resource/jhie-znh9.json","https://opendata.rdw.nl/resource/kmfi-hrps.json"
"TK923L","Personenauto","FIAT","500 E","20250424","20230424",,"hatchback","4","ZWART","Niet geregistreerd",,,"1284","1701","1384",,,"20150616","20180821","Geen verstrekking in Open Data","26124","Ja",,,,,,,"2","4",,,,,,"M1",,,"r. deurdorpel","1701","500E",,,,,,"0.06","231","Nee","Nee",,"Nee",,,,"2024","Geen oordeel","05","Ja","2025-04-24T00:00:00.000","2023-04-24T00:00:00.000","2015-06-16T00:00:00.000","2018-08-21T00:00:00.000",,,,,,,,,,,,,,,,,,,,,,,,,,,,"https://opendata.rdw.nl/resource/3huj-srit.json","https://opendata.rdw.nl/resource/8ys7-d773.json","https://opendata.rdw.nl/resource/vezc-m2t6.json","https://opendata.rdw.nl/resource/jhie-znh9.json","https://opendata.rdw.nl/resource/kmfi-hrps.json"
"TP047R","Personenauto","FIAT","500 E","20250331","20180926",,"hatchback","4","ORANJE","Niet geregistreerd","0",,"1284","1701","1384",,,"20150331","20180920","Geen verstrekking in Open Data","26124","Ja",,,,,,,"2","4",,,,,,"M1",,,"r. deurdorpel","1701","500E",,,,,,"0.06","231","Nee","Nee",,"Nee",,,,"2024","Geen oordeel","05","Ja","2025-03-31T00:00:00.000","2018-09-26T00:00:00.000","2015-03-31T00:00:00.000","2018-09-20T00:00:00.000",,,,,,,,,,,,,,,,,,,,,,,,,,,,"https://opendata.rdw.nl/resource/3huj-srit.json","https://opendata.rdw.nl/resource/8ys7-d773.json","https://opendata.rdw.nl/resource/vezc-m2t6.json","https://opendata.rdw.nl/resource/jhie-znh9.json","https://opendata.rdw.nl/resource/kmfi-hrps.json"
"XZ331L","Personenauto","FIAT","500E","20250421","20201207",,"hatchback","4","ZWART","Niet geregistreerd","0",,"1285","1701","1385",,,"20150701","20190410","Geen verstrekking in Open Data","38478","Ja",,,,,,,"2","4",,,,,,"M1",,,"r. deurdorpel by voorzitting","1701","500 E",,,,,,"0.06","230","Nee","Nee",,"Nee",,,,"2024","Geen oordeel","05","Ja","2025-04-21T00:00:00.000","2020-12-07T00:00:00.000","2015-07-01T00:00:00.000","2019-04-10T00:00:00.000",,,,,,,,,,,,,,,,,,,,,,,,,,,,"https://opendata.rdw.nl/resource/3huj-srit.json","https://opendata.rdw.nl/resource/8ys7-d773.json","https://opendata.rdw.nl/resource/vezc-m2t6.json","https://opendata.rdw.nl/resource/jhie-znh9.json","https://opendata.rdw.nl/resource/kmfi-hrps.json"