"kenteken","voertuigsoort","merk","handelsbenaming","vervaldatum_apk","datum_tenaamstelling","bruto_bpm","inrichting","aantal_zitplaatsen","eerste_kleur","tweede_kleur","aantal_cilinders","cilinderinhoud","massa_ledig_voertuig","toegestane_maximum_massa_voertuig","massa_rijklaar","maximum_massa_trekken_ongeremd","maximum_trekken_massa_geremd","datum_eerste_toelating","datum_eerste_tenaamstelling_in_nederland","wacht_op_keuren","catalogusprijs","wam_verzekerd","maximale_constructiesnelheid","laadvermogen","oplegger_geremd","aanhangwagen_autonoom_geremd","aanhangwagen_middenas_geremd","aantal_staanplaatsen","aantal_deuren","aantal_wielen","afstand_hart_koppeling_tot_achterzijde_voertuig","afstand_voorzijde_voertuig_tot_hart_koppeling","afwijkende_maximum_snelheid","lengte","breedte","europese_voertuigcategorie","europese_voertuigcategorie_toevoeging","europese_uitvoeringcategorie_toevoeging","plaats_chassisnummer","technische_max_massa_voertuig","type","type_gasinstallatie","typegoedkeuringsnummer","variant","uitvoering","volgnummer_wijziging_eu_typegoedkeuring","vermogen_massarijklaar","wielbasis","export_indicator","openstaande_terugroepactie_indicator","vervaldatum_tachograaf","taxi_indicator","maximum_massa_samenstelling","aantal_rolstoelplaatsen","maximum_ondersteunende_snelheid","jaar_laatste_registratie_tellerstand","tellerstandoordeel","code_toelichting_tellerstandoordeel","tenaamstellen_mogelijk","vervaldatum_apk_dt","datum_tenaamstelling_dt","datum_eerste_toelating_dt","datum_eerste_tenaamstelling_in_nederland_dt","vervaldatum_tachograaf_dt","maximum_last_onder_de_vooras_sen_tezamen_koppeling","type_remsysteem_voertuig_code","rupsonderstelconfiguratiecode","wielbasis_voertuig_minimum","wielbasis_voertuig_maximum","lengte_voertuig_minimum","lengte_voertuig_maximum","breedte_voertuig_minimum","breedte_voertuig_maximum","hoogte_voertuig","hoogte_voertuig_minimum","hoogte_voertuig_maximum","massa_bedrijfsklaar_minimaal","massa_bedrijfsklaar_maximaal","technisch_toelaatbaar_massa_koppelpunt","maximum_massa_technisch_maximaal","maximum_massa_technisch_minimaal","subcategorie_nederland","verticale_belasting_koppelpunt_getrokken_voertuig","zuinigheidsclassificatie","registratie_datum_goedkeuring_afschrijvingsmoment_bpm","registratie_datum_goedkeuring_afschrijvingsmoment_bpm_dt","gem_lading_wrde","aerodyn_voorz","massa_alt_aandr","verl_cab_ind","api_gekentekende_voertuigen_assen","api_gekentekende_voertuigen_brandstof","api_gekentekende_voertuigen_carrosserie","api_gekentekende_voertuigen_carrosserie_specifiek","api_gekentekende_voertuigen_voertuigklasse"
"24ZSF7","Personenauto","FERRARI","FF","20240908","20200910","81915","coupe","4","GRIJS","Niet geregistreerd","12","6262","1855","2320","1955",,,"20120103","20130116","Geen verstrekking in Open Data","379676","Ja",,,,,,,"2","4","0","0",,"0","0","M1",,,"r. by achterzitting","2320","F151",,"e24*KS07/46*0025*02","AL","E","0","0.25","299","Nee","Ja",,"Nee","0","0",,"2023","Geen oordeel","05","Ja","2024-09-08T00:00:00.000","2020-09-10T00:00:00.000","2012-01-03T00:00:00.000","2013-01-16T00:00:00.000",,"0",,,,,,,,,,,,,,,,,,,"G",,,,,,,"https://opendata.rdw.nl/resource/3huj-srit.json","https://opendata.rdw.nl/resource/8ys7-d773.json","https://opendata.rdw.nl/resource/vezc-m2t6.json","https://opendata.rdw.nl/resource/jhie-znh9.json","https://opendata.rdw.nl/resource/kmfi-hrps.json"
"5TNV41","Personenauto","FERRARI","FF","20241215","20230105","84786","coupe","4","ZWART","Niet geregistreerd","12","6262","1855","2320","1955",,,"20130228","20140402","Geen verstrekking in Open Data","354078","Ja",,,,,,,"2","4","0","0",,"0","0","M1",,,"r. by achterzitting","2320","F151",,"e24*KS07/46*0025*03","AL","E","0","0.25","299","Nee","Ja",,"Nee","0","0",,"2023","Geen oordeel","05","Ja","2024-12-15T00:00:00.000","2023-01-05T00:00:00.000","2013-02-28T00:00:00.000","2014-04-02T00:00:00.000",,"0",,,,,,,,,,,,,,,,,,,"G",,,,,,,"https://opendata.rdw.nl/resource/3huj-srit.json","https://opendata.rdw.nl/resource/8ys7-d773.json","https://opendata.rdw.nl/resource/vezc-m2t6.json","https://opendata.rdw.nl/resource/jhie-znh9.json","https://opendata.rdw.nl/resource/kmfi-hrps.json"
"61ZVF9","Personenauto","FERRARI","FF","20240907","20160722","71848","coupe","4","ZWART","Niet geregistreerd","12","6262","1855","2320","1955",,,"20120612","20130215","Geen verstrekking in Open Data","384581","Ja",,,,,,,"2","4","0","0",,"0","0","M1",,,"r. by achterzitting","2320","F151",,"e24*KS07/46*0025*01","AL","E","0","0.25","299","Nee","Ja",,"Nee","0","0",,"2023","Geen oordeel","05","Ja","2024-09-07T00:00:00.000","2016-07-22T00:00:00.000","2012-06-12T00:00:00.000","2013-02-15T00:00:00.000",,"0",,,,,,,,,,,,,,,,,,,"G",,,,,,,"https://opendata.rdw.nl/resource/3huj-srit.json","https://opendata.rdw.nl/resource/8ys7-d773.json","https://opendata.rdw.nl/resource/vezc-m2t6.json","https://opendata.rdw.nl/resource/jhie-znh9.json","https://opendata.rdw.nl/resource/kmfi-hrps.json"
"66ZDH3","Personenauto","FERRARI","FF","20240517","20211230","86748","coupe","4","ZWART","Niet geregistreerd","12","6262","1855","2320","1955",,,"20120206","20121005","Geen verstrekking in Open Data","412057","Ja",,,,,,,"2","4","0","0",,"0","0","M1",,,"r. by achterzitting","2320","F151",,"e24*KS07/46*0025*02","AL","E","0","0.25","299","Nee","Ja",,"Nee","0","0",,"2023","Geen oordeel","05","Ja","2024-05-17T00:00:00.000","2021-12-30T00:00:00.000","2012-02-06T00:00:00.000","2012-10-05T00:00:00.000",,"0",,,,,,,,,,,,,,,,,,,"G",,,,,,,"https://opendata.rdw.nl/resource/3huj-srit.json","https://opendata.rdw.nl/resource/8ys7-d773.json","https://opendata.rdw.nl/resource/vezc-m2t6.json","https://opendata.rdw.nl/resource/jhie-znh9.json","https://opendata.rdw.nl/resource/kmfi-hrps.json"
"67ZSK2","Personenauto","FERRARI","FERRARI FF","20241206","20170704","61553","coupe","4","BLAUW","Niet geregistreerd","12","6262","1855","2320","1955",,,"20120117","20130128","Geen verstrekking in Open Data","420046","Ja",,,,,,,"2","4",,,,,,"M1",,,"r. by achterzitting","2320",,,,,,,"0.25","299","Nee","Ja",,"Nee",,,,"2023","Geen oordeel","05","Ja","2024-12-06T00:00:00.000","2017-07-04T00:00:00.000","2012-01-17T00:00:00.000","2013-01-28T00:00:00.000",,"0",,,,,,,,,,,,,,,,,,,,,,,,,,"https://opendata.rdw.nl/resource/3huj-srit.json","https://opendata.rdw.nl/resource/8ys7-d773.json","https://opendata.rdw.nl/resource/vezc-m2t6.json","https://opendata.rdw.nl/resource/jhie-znh9.json","https://opendata.rdw.nl/resource/kmfi-hrps.json"
"7SHS42","Personenauto","FERRARI","FF","20241031","20131004","93666","coupe","4","BLAUW","Niet geregistreerd","12","6262","1855","2320","1955",,,"20131004","20131004","Geen verstrekking in Open Data","377960","Ja",,,,,,,"2","4","0","0",,"0","0","M1",,,"r. by achterzitting","2320","F151",,"e24*KS07/46*0025*03","AL","E","0","0.25","299","Nee","Ja",,"Nee","0","0",,"2023","Logisch","00","Ja","2024-10-31T00:00:00.000","2013-10-04T00:00:00.000","2013-10-04T00:00:00.000","2013-10-04T00:00:00.000",,,,,,,,,,,,,,,,,,,,,"G",,,,,,,"https://opendata.rdw.nl/resource/3huj-srit.json","https://opendata.rdw.nl/resource/8ys7-d773.json","https://opendata.rdw.nl/resource/vezc-m2t6.json","https://opendata.rdw.nl/resource/jhie-znh9.json","https://opendata.rdw.nl/resource/kmfi-hrps.json"
"7SLH29","Personenauto","FERRARI","FF","20250215","20220224","79307","coupe","4","GRIJS","Niet geregistreerd","12","6262","1855","2320","1955",,,"20120411","20131108","Geen verstrekking in Open Data","372286","Ja",,,,,,,"2","4","0","0",,"0","0","M1",,,"r. by achterzitting","2320","F151",,"e24*KS07/46*0025*01","AL","E","0","0.25","299","Nee","Ja",,"Nee","0","0",,"2024","Geen oordeel","05","Ja","2025-02-15T00:00:00.000","2022-02-24T00:00:00.000","2012-04-11T00:00:00.000","2013-11-08T00:00:00.000",,"0",,,,,,,,,,,,,,,,,,,"G",,,,,,,"https://opendata.rdw.nl/resource/3huj-srit.json","https://opendata.rdw.nl/resource/8ys7-d773.json","https://opendata.rdw.nl/resource/vezc-m2t6.json","https://opendata.rdw.nl/resource/jhie-znh9.json","https://opendata.rdw.nl/resource/kmfi-hrps.json"
"8THZ77","Personenauto","FERRARI","FF","20240731","20210702","86079","coupe","4","ROOD","Niet geregistreerd","12","6262","1855","2320","1955",,,"20111213","20140219","Geen verstrekking in Open Data","391036","Ja",,,,,,,"2","4","0","0",,"0","0","M1",,,"r. by achterzitting","2320","F151",,"e24*KS07/46*0025*01","AL","E","1","0.25","299","Nee","Ja",,"Nee","0","0",,"2023","Geen oordeel","05","Ja","2024-07-31T00:00:00.000","2021-07-02T00:00:00.000","2011-12-13T00:00:00.000","2014-02-19T00:00:00.000",,"0",,,,,,,,,,,,,,,,,,,"G",,,,,,,"https://opendata.rdw.nl/resource/3huj-srit.json","https://opendata.rdw.nl/resource/8ys7-d773.json","https://opendata.rdw.nl/resource/vezc-m2t6.json","https://opendata.rdw.nl/resource/jhie-znh9.json","https://opendata.rdw.nl/resource/kmfi-hrps.json"
"9ZKX51","Personenauto","FERRARI","FF","20241218","20230311","89903","coupe","4","GRIJS","Niet geregistreerd","12","6262","1855","2320","1955",,,"20110714","20150105","Geen verstrekking in Open Data","452588","Ja",,,,,,,"2","4","0","0",,"0","0","M1",,,"r. by achterzitting","2320","F151",,"e24*KS07/46*0025*02","AL","E","0","0.25","299","Nee","Ja",,"Nee","0","0",,"2023","Geen oordeel","05","Ja","2024-12-18T00:00:00.000","2023-03-11T00:00:00.000","2011-07-14T00:00:00.000","2015-01-05T00:00:00.000",,"0",,,,,,,,,,,,,,,,,,,"G",,,,,,,"https://opendata.rdw.nl/resource/3huj-srit.json","https://opendata.rdw.nl/resource/8ys7-d773.json","https://opendata.rdw.nl/resource/vezc-m2t6.json","https://opendata.rdw.nl/resource/jhie-znh9.json","https://opendata.rdw.nl/resource/kmfi-hrps.json"
"G698GS","Personenauto","FERRARI","FF","20240923","20200519","80060","coupe","4","WIT","Niet geregistreerd","12","6262","1855","2320","1955",,,"20131218","20190923","Geen verstrekking in Open Data","380394","Ja","335",,,,,,"2","4",,,,,"195","M1",,,"r. by achterzitting","2320","F151",,,,,,"0.25","299","Nee","Ja",,"Nee","2320",,,"2023","Geen oordeel","05","Ja","2024-09-23T00:00:00.000","2020-05-19T00:00:00.000","2013-12-18T00:00:00.000","2019-09-23T00:00:00.000",,,,,,,,,,,,,,,,,,,,,,,,,,,,"https://opendata.rdw.nl/resource/3huj-srit.json","https://opendata.rdw.nl/resource/8ys7-d773.json","https://opendata.rdw.nl/resource/vezc-m2t6.json","https://opendata.rdw.nl/resource/jhie-znh9.json","https://opendata.rdw.nl/resource/kmfi-hrps.json"
"GB516R","Personenauto","FERRARI","FF","20240328","20191213","99311","coupe","4","GRIJS","Niet geregistreerd","12","6262","1855","2320","1955",,,"20110922","20150409","Geen verstrekking in Open Data","394536","Ja","335",,,,,,"2","4","0","0",,"0","0","M1",,,"r. by achterzitting","2320","F151",,"e24*KS07/46*0025*02","AL","E","0","0.25","299","Nee","Ja",,"Nee","0","0",,"2023","Geen oordeel","05","Ja","2024-03-28T00:00:00.000","2019-12-13T00:00:00.000","2011-09-22T00:00:00.000","2015-04-09T00:00:00.000",,,,,,,,,,,,,,,,,,,,,"G",,,,,,,"https://opendata.rdw.nl/resource/3huj-srit.json","https://opendata.rdw.nl/resource/8ys7-d773.json","https://opendata.rdw.nl/resource/vezc-m2t6.json","https://opendata.rdw.nl/resource/jhie-znh9.json","https://opendata.rdw.nl/resource/kmfi-hrps.json"
"GH872L","Personenauto","FERRARI","FF","20240528","20211101","90659","coupe","4","GRIJS","Niet geregistreerd","12","6262","1855","2320","1955",,,"20150528","20150528","Geen verstrekking in Open Data","414116","Nee",,,,,,,"2","4","0","0",,"0","0","M1",,,"r. by achterzitting","2320","F151",,"e24*KS07/46*0025*04","AL","E","0","0.25","299","Nee","Ja",,"Nee","0","0",,"2023","Logisch","00","Ja","2024-05-28T00:00:00.000","2021-11-01T00:00:00.000","2015-05-28T00:00:00.000","2015-05-28T00:00:00.000",,,,,,,,,,,,,,,,,,,,,"G",,,,,,,"https://opendata.rdw.nl/resource/3huj-srit.json","https://opendata.rdw.nl/resource/8ys7-d773.json","https://opendata.rdw.nl/resource/vezc-m2t6.json","https://opendata.rdw.nl/resource/jhie-znh9.json","https://opendata.rdw.nl/resource/kmfi-hrps.json"
"GK563R","Personenauto","FERRARI","FF","20250329","20210112","92094","coupe","4","WIT","Niet geregistreerd","12","6262","1855","2320","1955",,,"20140107","20150615","Geen verstrekking in Open Data","413856","Ja",,,,,,,"2","4",,,,,,"M1",,,"r. by achterzitting","2320",,,,,,,"0.25","299","Nee","Ja",,"Nee",,,,"2024","Geen oordeel","05","Ja","2025-03-29T00:00:00.000","2021-01-12T00:00:00.000","2014-01-07T00:00:00.000","2015-06-15T00:00:00.000",,,,,,,,,,,,,,,,,,,,,,,,,,,,"https://opendata.rdw.nl/resource/3huj-srit.json","https://opendata.rdw.nl/resource/8ys7-d773.json","https://opendata.rdw.nl/resource/vezc-m2t6.json","https://opendata.rdw.nl/resource/jhie-znh9.json","https://opendata.rdw.nl/resource/kmfi-hrps.json"
"GS119P","Personenauto","FERRARI","FF","20250219","20171005","99339","coupe","4","BLAUW","Niet geregistreerd","12","6262","1855","2320","1955",,,"20150219","20150803","Geen verstrekking in Open Data","405142","Ja",,,,,,,"2","4","0","0",,"0","0","M1",,,"r. by achterzitting","2320","F151",,"e24*KS07/46*0025*03","AL","E","0","0.25","299","Nee","Ja",,"Nee","0","0",,"2024","Geen oordeel","05","Ja","2025-02-19T00:00:00.000","2017-10-05T00:00:00.000","2015-02-19T00:00:00.000","2015-08-03T00:00:00.000",,,,,,,,,,,,,,,,,,,,,"G",,,,,,,"https://opendata.rdw.nl/resource/3huj-srit.json","https://opendata.rdw.nl/resource/8ys7-d773.json","https://opendata.rdw.nl/resource/vezc-m2t6.json","https://opendata.rdw.nl/resource/jhie-znh9.json","https://opendata.rdw.nl/resource/kmfi-hrps.json"
"H868KL","Personenauto","FERRARI","FF","20241011","20231011","22959","coupe","4","GRIJS","Niet geregistreerd","12","6262","1855","2320","1955",,,"20130114","20200611","Geen verstrekking in Open Data","376818","Ja","335",,,,,,"2","4","0","0",,"0","195","M1",,,"r. by achterzitting","2320","F151",,"e24*KS07/46*0025*02","AL","E","2","0.25","299","Nee","Ja",,"Nee","0","0",,"2024","Geen oordeel","05","Ja","2024-10-11T00:00:00.000","2023-10-11T00:00:00.000","2013-01-14T00:00:00.000","2020-06-11T00:00:00.000",,,,,,,,,,,,,,,,,,,,,"G",,,,,,,"https://opendata.rdw.nl/resource/3huj-srit.json","https://opendata.rdw.nl/resource/8ys7-d773.json","https://opendata.rdw.nl/resource/vezc-m2t6.json","https://opendata.rdw.nl/resource/jhie-znh9.json","https://opendata.rdw.nl/resource/kmfi-hrps.json"
"H902GS","Personenauto","FERRARI","FF","20240821","20230821","99339","coupe","4","GRIJS","Niet geregistreerd","12","6262","1855","2320","1955",,,"20151127","20200131","Geen verstrekking in Open Data","384965","Ja","335",,,,,,"2","4","0","0",,"0","195","M1",,,,"2320","F151",,"e24*KS07/46*0025*04","AL","E","0","0.25","299","Nee","Ja",,"Nee","0","0",,"2023","Geen oordeel","05","Ja","2024-08-21T00:00:00.000","2023-08-21T00:00:00.000","2015-11-27T00:00:00.000","2020-01-31T00:00:00.000",,,,,,,,,,,,,,,,,,,,,"G",,,,,,,"https://opendata.rdw.nl/resource/3huj-srit.json","https://opendata.rdw.nl/resource/8ys7-d773.json","https://opendata.rdw.nl/resource/vezc-m2t6.json","https://opendata.rdw.nl/resource/jhie-znh9.json","https://opendata.rdw.nl/resource/kmfi-hrps.json"
"HK885L","Personenauto","FERRARI","FF","20240704","20231006","91152","coupe","4","ZWART","Niet geregistreerd","12","6262","1855","2320","1955",,,"20131126","20151119","Geen verstrekking in Open Data","374571","Ja",,,,,,,"2","4","0","0",,"0","0","M1",,,"r. by achterzitting","2320","F151",,"e24*KS07/46*0025*03","AL","E","0","0.25","299","Nee","Ja",,"Nee","0","0",,"2023","Geen oordeel","05","Ja","2024-07-04T00:00:00.000","2023-10-06T00:00:00.000","2013-11-26T00:00:00.000","2015-11-19T00:00:00.000",,,,,,,,,,,,,,,,,,,,,"G",,,,,,,"https://opendata.rdw.nl/resource/3huj-srit.json","https://opendata.rdw.nl/resource/8ys7-d773.json","https://opendata.rdw.nl/resource/vezc-m2t6.json","https://opendata.rdw.nl/resource/jhie-znh9.json","https://opendata.rdw.nl/resource/kmfi-hrps.json"
"J541JR","Personenauto","FERRARI","FF","20250208","20230202","90448","coupe","4","GRIJS","Niet geregistreerd","12","6262","1855","2320","1955",,,"20120413","20200814","Geen verstrekking in Open Data","372286","Ja","335",,,,,,"2","4","0","0",,"0","195","M1",,,"r. by achterzitting","2320","F151",,"e24*KS07/46*0025*01","AL","E","0","0.25","299","Nee","Ja",,"Nee","2320","0",,"2024","Geen oordeel","05","Ja","2025-02-08T00:00:00.000","2023-02-02T00:00:00.000","2012-04-13T00:00:00.000","2020-08-14T00:00:00.000",,,,,,,,,,,,,,,,,,,,,"G",,,,,,,"https://opendata.rdw.nl/resource/3huj-srit.json","https://opendata.rdw.nl/resource/8ys7-d773.json","https://opendata.rdw.nl/resource/vezc-m2t6.json","https://opendata.rdw.nl/resource/jhie-znh9.json","https://opendata.rdw.nl/resource/kmfi-hrps.json"
"J595JK","Personenauto","FERRARI","FF","20240819","20231025","99309","coupe","4","ZWART","Niet geregistreerd","12","6262","1855","2320","1955",,,"20120523","20200812","Geen verstrekking in Open Data","385346","Ja","335",,,,,,"2","4","0","0",,"0","195","M1",,,,"2320","F151",,"e24*KS07/46*0025*02","AL","E","2","0.25","299","Nee","Ja",,"Nee","0","0",,"2023","Geen oordeel","05","Ja","2024-08-19T00:00:00.000","2023-10-25T00:00:00.000","2012-05-23T00:00:00.000","2020-08-12T00:00:00.000",,,,,,,,,,,,,,,,,,,,,"G",,,,,,,"https://opendata.rdw.nl/resource/3huj-srit.json","https://opendata.rdw.nl/resource/8ys7-d773.json","https://opendata.rdw.nl/resource/vezc-m2t6.json","https://opendata.rdw.nl/resource/jhie-znh9.json","https://opendata.rdw.nl/resource/kmfi-hrps.json"
"J957LX","Personenauto","FERRARI","FF","20241020","20230807","90448","coupe","4","ZWART","Niet geregistreerd","12","6262","1855","2320","1955",,,"20120412","20200908","Geen verstrekking in Open Data","377685","Ja",,,,,,,"2","4","0","0",,"0","195","M1",,,"r. by achterzitting","2320","F151",,"e24*KS07/46*0025*01","AL","E","0","0.25","299","Nee","Ja",,"Nee","0","0",,"2023","Geen oordeel","05","Ja","2024-10-20T00:00:00.000","2023-08-07T00:00:00.000","2012-04-12T00:00:00.000","2020-09-08T00:00:00.000",,,,,,,,,,,,,,,,,,,,,"G",,,,,,,"https://opendata.rdw.nl/resource/3huj-srit.json","https://opendata.rdw.nl/resource/8ys7-d773.json","https://opendata.rdw.nl/resource/vezc-m2t6.json","https://opendata.rdw.nl/resource/jhie-znh9.json","https://opendata.rdw.nl/resource/kmfi-hrps.json"
"JL147K","Personenauto","FERRARI","FF","20241110","20211111","89060","coupe","4","GRIJS","Niet geregistreerd","12","6262","1855","2320","1955",,,"20130411","20160429","Geen verstrekking in Open Data","400618","Ja",,,,,,,"2","4","0","0",,"0","0","M1",,,"r. by achterzitting","2320","F151",,"e24*KS07/46*0025*03","AL","E","0","0.25","299","Nee","Ja",,"Nee","0","0",,"2023","Geen oordeel","05","Ja","2024-11-10T00:00:00.000","2021-11-11T00:00:00.000","2013-04-11T00:00:00.000","2016-04-29T00:00:00.000",,,,,,,,,,,,,,,,,,,,,"G",,,,,,,"https://opendata.rdw.nl/resource/3huj-srit.json","https://opendata.rdw.nl/resource/8ys7-d773.json","https://opendata.rdw.nl/resource/vezc-m2t6.json","https://opendata.rdw.nl/resource/jhie-znh9.json","https://opendata.rdw.nl/resource/kmfi-hrps.json"
"JN298Z","Personenauto","FERRARI","FF","20250502","20190325","85743","coupe","4","ZWART","Niet geregistreerd","12","6262","1855","2320","1955",,,"20110915","20160509","Geen verstrekking in Open Data","365957","Ja",,,,,,,"2","4","0","0",,"0","0","M1",,,"r. by achterzitting","2320","F151",,"e24*KS07/46*0025*02","AL","E","0","0.25","299","Nee","Ja",,"Nee","0","0",,"2024","Geen oordeel","05","Ja","2025-05-02T00:00:00.000","2019-03-25T00:00:00.000","2011-09-15T00:00:00.000","2016-05-09T00:00:00.000",,,,,,,,,,,,,,,,,,,,,"G",,,,,,,"https://opendata.rdw.nl/resource/3huj-srit.json","https://opendata.rdw.nl/resource/8ys7-d773.json","https://opendata.rdw.nl/resource/vezc-m2t6.json","https://opendata.rdw.nl/resource/jhie-znh9.json","https://opendata.rdw.nl/resource/kmfi-hrps.json"
"K523PT","Personenauto","FERRARI","FF","20240725","20221219","99339","coupe","4","ZWART","Niet geregistreerd","12","6262","1855","2320","1955",,,"20140716","20210212","Geen verstrekking in Open Data","418850","Ja","335",,,,,,"2","4",,,,,"195","M1",,,,"2320","F151",,"e24*KS07/46*0025*03","AL","E","1","0.25","299","Nee","Ja",,"Nee",,,,"2023","Geen oordeel","05","Ja","2024-07-25T00:00:00.000","2022-12-19T00:00:00.000","2014-07-16T00:00:00.000","2021-02-12T00:00:00.000",,,,,,,,,,,,,,,,,,,,,"G",,,,,,,"https://opendata.rdw.nl/resource/3huj-srit.json","https://opendata.rdw.nl/resource/8ys7-d773.json","https://opendata.rdw.nl/resource/vezc-m2t6.json","https://opendata.rdw.nl/resource/jhie-znh9.json","https://opendata.rdw.nl/resource/kmfi-hrps.json"
"K630BP","Personenauto","FERRARI","FF","20241214","20201219","99336","coupe","4","WIT","Niet geregistreerd","12","6262","1855","2320","1955",,,"20131125","20201219","Geen verstrekking in Open Data","380394","Ja","335",,,,,,"2","4",,,,,"195","M1",,,,"2320","F151",,"e24*KS07/46*0025*03","AL","E","1","0.25","299","Nee","Ja",,"Nee",,,,"2023","Geen oordeel","05","Ja","2024-12-14T00:00:00.000","2020-12-19T00:00:00.000","2013-11-25T00:00:00.000","2020-12-19T00:00:00.000",,,,,,,,,,,,,,,,,,,,,"G",,,,,,,"https://opendata.rdw.nl/resource/3huj-srit.json","https://opendata.rdw.nl/resource/8ys7-d773.json","https://opendata.rdw.nl/resource/vezc-m2t6.json","https://opendata.rdw.nl/resource/jhie-znh9.json","https://opendata.rdw.nl/resource/kmfi-hrps.json"
"KB614P","Personenauto","FERRARI","FF","20250423","20201013","85743","coupe","4","ROOD","Niet geregistreerd","12","6262","1855","2320","1955",,,"20111026","20160725","Geen verstrekking in Open Data","392242","Ja",,,,,,,"2","4","0","0",,"0","0","M1",,,"r. by achterzitting","2320","F151",,"e24*KS07/46*0025*01","AL","E","0","0.25","299","Nee","Ja",,"Nee","0","0",,"2024","Geen oordeel","05","Ja","2025-04-23T00:00:00.000","2020-10-13T00:00:00.000","2011-10-26T00:00:00.000","2016-07-25T00:00:00.000",,,,,,,,,,,,,,,,,,,,,"G",,,,,,,"https://opendata.rdw.nl/resource/3huj-srit.json","https://opendata.rdw.nl/resource/8ys7-d773.json","https://opendata.rdw.nl/resource/vezc-m2t6.json","https://opendata.rdw.nl/resource/jhie-znh9.json","https://opendata.rdw.nl/resource/kmfi-hrps.json"
"KN288S","Personenauto","FERRARI","FF","20240831","20220811","99339","coupe","4","ZWART","Niet geregistreerd","12","6262","1855","2320","1955",,,"20120510","20161026","Geen verstrekking in Open Data","345485","Ja",,,,,,,"2","4","0","0",,"0","0","M1",,,"r. by achterzitting","2320","F151",,"e24*KS07/46*0025*02","AL","E","0","0.25","299","Nee","Ja",,"Nee","0","0",,"2023","Geen oordeel","05","Ja","2024-08-31T00:00:00.000","2022-08-11T00:00:00.000","2012-05-10T00:00:00.000","2016-10-26T00:00:00.000",,,,,,,,,,,,,,,,,,,,,"G",,,,,,,"https://opendata.rdw.nl/resource/3huj-srit.json","https://opendata.rdw.nl/resource/8ys7-d773.json","https://opendata.rdw.nl/resource/vezc-m2t6.json","https://opendata.rdw.nl/resource/jhie-znh9.json","https://opendata.rdw.nl/resource/kmfi-hrps.json"
"KP427F","Personenauto","FERRARI","FF","20241018","20231021","55712","coupe","4","GROEN","Niet geregistreerd","12","6262","1855","2320","1955",,,"20151127","20161027","Geen verstrekking in Open Data","395477","Ja","335",,,,,,"2","4","0","0",,"0","0","M1",,,"r. by achterzitting","2320","F151",,"e24*KS07/46*0025*04","AL","E","0","0.25","299","Nee","Ja",,"Nee","0","0",,"2024","Geen oordeel","05","Ja","2024-10-18T00:00:00.000","2023-10-21T00:00:00.000","2015-11-27T00:00:00.000","2016-10-27T00:00:00.000",,,,,,,,,,,,,,,,,,,,,"G",,,,,,,"https://opendata.rdw.nl/resource/3huj-srit.json","https://opendata.rdw.nl/resource/8ys7-d773.json","https://opendata.rdw.nl/resource/vezc-m2t6.json","https://opendata.rdw.nl/resource/jhie-znh9.json","https://opendata.rdw.nl/resource/kmfi-hrps.json"