"kenteken","voertuigsoort","merk","handelsbenaming","vervaldatum_apk","datum_tenaamstelling","bruto_bpm","inrichting","aantal_zitplaatsen","eerste_kleur","tweede_kleur","aantal_cilinders","cilinderinhoud","massa_ledig_voertuig","toegestane_maximum_massa_voertuig","massa_rijklaar","maximum_massa_trekken_ongeremd","maximum_trekken_massa_geremd","datum_eerste_toelating","datum_eerste_tenaamstelling_in_nederland","wacht_op_keuren","catalogusprijs","wam_verzekerd","maximale_constructiesnelheid","laadvermogen","oplegger_geremd","aanhangwagen_autonoom_geremd","aanhangwagen_middenas_geremd","aantal_staanplaatsen","aantal_deuren","aantal_wielen","afstand_hart_koppeling_tot_achterzijde_voertuig","afstand_voorzijde_voertuig_tot_hart_koppeling","afwijkende_maximum_snelheid","lengte","breedte","europese_voertuigcategorie","europese_voertuigcategorie_toevoeging","europese_uitvoeringcategorie_toevoeging","plaats_chassisnummer","technische_max_massa_voertuig","type","type_gasinstallatie","typegoedkeuringsnummer","variant","uitvoering","volgnummer_wijziging_eu_typegoedkeuring","vermogen_massarijklaar","wielbasis","export_indicator","openstaande_terugroepactie_indicator","vervaldatum_tachograaf","taxi_indicator","maximum_massa_samenstelling","aantal_rolstoelplaatsen","maximum_ondersteunende_snelheid","jaar_laatste_registratie_tellerstand","tellerstandoordeel","code_toelichting_tellerstandoordeel","tenaamstellen_mogelijk","vervaldatum_apk_dt","datum_tenaamstelling_dt","datum_eerste_toelating_dt","datum_eerste_tenaamstelling_in_nederland_dt","vervaldatum_tachograaf_dt","maximum_last_onder_de_vooras_sen_tezamen_koppeling","type_remsysteem_voertuig_code","rupsonderstelconfiguratiecode","wielbasis_voertuig_minimum","wielbasis_voertuig_maximum","lengte_voertuig_minimum","lengte_voertuig_maximum","breedte_voertuig_minimum","breedte_voertuig_maximum","hoogte_voertuig","hoogte_voertuig_minimum","hoogte_voertuig_maximum","massa_bedrijfsklaar_minimaal","massa_bedrijfsklaar_maximaal","technisch_toelaatbaar_massa_koppelpunt","maximum_massa_technisch_maximaal","maximum_massa_technisch_minimaal","subcategorie_nederland","verticale_belasting_koppelpunt_getrokken_voertuig","zuinigheidsclassificatie","registratie_datum_goedkeuring_afschrijvingsmoment_bpm","registratie_datum_goedkeuring_afschrijvingsmoment_bpm_dt","gem_lading_wrde","aerodyn_voorz","massa_alt_aandr","verl_cab_ind","api_gekentekende_voertuigen_assen","api_gekentekende_voertuigen_brandstof","api_gekentekende_voertuigen_carrosserie","api_gekentekende_voertuigen_carrosserie_specifiek","api_gekentekende_voertuigen_voertuigklasse"
"H738LB","Personenauto","FERRARI","488 SPIDER","20250405","20211231","50986","cabriolet","2","GRIJS","Niet geregistreerd","8","3902","1540","1835","1640",,,"20190405","20200303","Geen verstrekking in Open Data","361295","Ja","325",,,,,,"2","4","0","0",,"457","0","M1",,,,"1835","F 142",,"e3*2007/46*0040*20","BD","E","0","0.30","265","Nee","Ja",,"Nee","0","0","0.00","2023","Geen oordeel","05","Ja","2025-04-05T00:00:00.000","2021-12-31T00:00:00.000","2019-04-05T00:00:00.000","2020-03-03T00:00:00.000",,,,,,,,,,,,,,,,,,,,,"G",,,,,,,"https://opendata.rdw.nl/resource/3huj-srit.json","https://opendata.rdw.nl/resource/8ys7-d773.json","https://opendata.rdw.nl/resource/vezc-m2t6.json","https://opendata.rdw.nl/resource/jhie-znh9.json","https://opendata.rdw.nl/resource/kmfi-hrps.json"
"H928FL","Personenauto","FERRARI","488 SPIDER","20250406","20210514","47098","cabriolet","2","GROEN","Niet geregistreerd","8","3902","1540","1835","1640",,,"20181227","20200116","Geen verstrekking in Open Data","403772","Ja","325",,,,,,"2","4","0","0",,"457","0","M1",,,"r. dwarsbalk onder voorzitting","1835","F 142",,"e3*2007/46*0040*20","BD","E","0","0.30","265","Nee","Ja",,"Nee","0","0","0.00","2023","Geen oordeel","05","Ja","2025-04-06T00:00:00.000","2021-05-14T00:00:00.000","2018-12-27T00:00:00.000","2020-01-16T00:00:00.000",,,,,,,,,,,,,,,,,,,,,"G",,,,,,,"https://opendata.rdw.nl/resource/3huj-srit.json","https://opendata.rdw.nl/resource/8ys7-d773.json","https://opendata.rdw.nl/resource/vezc-m2t6.json","https://opendata.rdw.nl/resource/jhie-znh9.json","https://opendata.rdw.nl/resource/kmfi-hrps.json"
"JN571K","Personenauto","FERRARI","488 SPIDER","20240731","20190801","34694","cabriolet","2","GEEL","Niet geregistreerd","8","3902","1540","1835","1640",,,"20160504","20160504","Geen verstrekking in Open Data","335510","Ja",,,,,,,"2","4",,,,"457","195","M1",,,"in bodemplaat r.","1835","F 142",,"e3*2007/46*0040*14","BD","E","0","0.30","265","Nee","Ja",,"Nee","1835",,,"2024","Geen oordeel","05","Ja","2024-07-31T00:00:00.000","2019-08-01T00:00:00.000","2016-05-04T00:00:00.000","2016-05-04T00:00:00.000",,,,,,,,,,,"121",,,,,,,,,,"G",,,,,,,"https://opendata.rdw.nl/resource/3huj-srit.json","https://opendata.rdw.nl/resource/8ys7-d773.json","https://opendata.rdw.nl/resource/vezc-m2t6.json","https://opendata.rdw.nl/resource/jhie-znh9.json","https://opendata.rdw.nl/resource/kmfi-hrps.json"
"K709XN","Personenauto","FERRARI","488 SPIDER","20260122","20210422","55977","cabriolet","2","WIT","Niet geregistreerd","8","3902","1540","1835","1640",,,"20180813","20210422","Geen verstrekking in Open Data","469039","Ja","325",,,,,,"2","4",,,,"457",,"M1",,,,"1835","F 142",,"e3*2007/46*0040*18","BD","E","2","0.30","265","Nee","Ja",,"Nee",,,,"2024","Geen oordeel","05","Ja","2026-01-22T00:00:00.000","2021-04-22T00:00:00.000","2018-08-13T00:00:00.000","2021-04-22T00:00:00.000",,,,,,,,,,,,,,,,,,,,,"G",,,,,,,"https://opendata.rdw.nl/resource/3huj-srit.json","https://opendata.rdw.nl/resource/8ys7-d773.json","https://opendata.rdw.nl/resource/vezc-m2t6.json","https://opendata.rdw.nl/resource/jhie-znh9.json","https://opendata.rdw.nl/resource/kmfi-hrps.json"
"L070GH","Personenauto","FERRARI","488 SPIDER","20240913","20210517","53438","cabriolet","2","BLAUW","Niet geregistreerd","8","3902","1540","1835","1640",,,"20190204","20210517","Geen verstrekking in Open Data","318867","Ja","325",,,,,,"2","4",,,,"457",,"M1",,,,"1835","F 142",,"e3*2007/46*0040*18","BD","E","2","0.30","265","Nee","Ja",,"Nee",,,,"2022","Geen oordeel","05","Ja","2024-09-13T00:00:00.000","2021-05-17T00:00:00.000","2019-02-04T00:00:00.000","2021-05-17T00:00:00.000",,,,,,,,,,,,,,,,,,,,,,,,,,,,"https://opendata.rdw.nl/resource/3huj-srit.json","https://opendata.rdw.nl/resource/8ys7-d773.json","https://opendata.rdw.nl/resource/vezc-m2t6.json","https://opendata.rdw.nl/resource/jhie-znh9.json","https://opendata.rdw.nl/resource/kmfi-hrps.json"
"L516DZ","Personenauto","FERRARI","488 SPIDER","20260125","20210430","55977","cabriolet","2","ROOD","Niet geregistreerd","8","3902","1540","1835","1640",,,"20180503","20210430","Geen verstrekking in Open Data","386750","Ja","325",,,,,,"2","4",,,,"457",,"M1",,,,"1835","F 142",,"e3*2007/46*0040*18","BD","E","2","0.30","265","Nee","Ja",,"Nee",,,,"2024","Geen oordeel","05","Ja","2026-01-25T00:00:00.000","2021-04-30T00:00:00.000","2018-05-03T00:00:00.000","2021-04-30T00:00:00.000",,,,,,,,,,,,,,,,,,,,,,,,,,,,"https://opendata.rdw.nl/resource/3huj-srit.json","https://opendata.rdw.nl/resource/8ys7-d773.json","https://opendata.rdw.nl/resource/vezc-m2t6.json","https://opendata.rdw.nl/resource/jhie-znh9.json","https://opendata.rdw.nl/resource/kmfi-hrps.json"
"N856TN","Personenauto","FERRARI","488 SPIDER","20251102","20211229","57521","cabriolet","2","ROOD","Niet geregistreerd","8","3902","1540","1835","1640",,,"20200605","20211229","Geen verstrekking in Open Data","444800","Ja","325",,,,,,"2","4","0","0",,"457","195","M1",,,"r. dwarsbalk onder voorzitting","1835","F 142",,"e3*2007/46*0040*22","BD","E","0","0.30","265","Nee","Ja",,"Nee","0","0","0.00","2023","Geen oordeel","05","Ja","2025-11-02T00:00:00.000","2021-12-29T00:00:00.000","2020-06-05T00:00:00.000","2021-12-29T00:00:00.000",,,,,,,,,,,"121",,,,,,,,,,,"20211119","2021-11-19T00:00:00.000",,,,,"https://opendata.rdw.nl/resource/3huj-srit.json","https://opendata.rdw.nl/resource/8ys7-d773.json","https://opendata.rdw.nl/resource/vezc-m2t6.json","https://opendata.rdw.nl/resource/jhie-znh9.json","https://opendata.rdw.nl/resource/kmfi-hrps.json"
"NN533J","Personenauto","FERRARI","488 SPIDER","20250327","20240109","57165","cabriolet","2","BLAUW","Niet geregistreerd","8","3902","1540","1835","1640",,,"20170327","20170327","Geen verstrekking in Open Data","358184","Ja",,,,,,,"2","4",,,,"457","195","M1",,,"in bodemplaat r.","1835","F142",,"e3*2007/46*0040*14","BD","E","0","0.30","265","Nee","Ja",,"Nee","1835",,,"2023","Logisch","00","Ja","2025-03-27T00:00:00.000","2024-01-09T00:00:00.000","2017-03-27T00:00:00.000","2017-03-27T00:00:00.000",,,,,,,,,,,"121",,,,,,,,,,"G",,,,,,,"https://opendata.rdw.nl/resource/3huj-srit.json","https://opendata.rdw.nl/resource/8ys7-d773.json","https://opendata.rdw.nl/resource/vezc-m2t6.json","https://opendata.rdw.nl/resource/jhie-znh9.json","https://opendata.rdw.nl/resource/kmfi-hrps.json"
"P012FF","Personenauto","FERRARI","488 SPIDER","20240801","20220219","55976","cabriolet","2","WIT","Niet geregistreerd","8","3902","1540","1835","1640",,,"20180801","20220219","Geen verstrekking in Open Data","310208","Ja","325",,,,,,"2","4",,,,"457",,"M1",,,,"1835","F 142",,"e3*2007/46*0040*18","BD","E","2","0.30","265","Nee","Ja",,"Nee",,,,"2022","Geen oordeel","05","Ja","2024-08-01T00:00:00.000","2022-02-19T00:00:00.000","2018-08-01T00:00:00.000","2022-02-19T00:00:00.000",,,,,,,,,,,,,,,,,,,,,,"20220211","2022-02-11T00:00:00.000",,,,,"https://opendata.rdw.nl/resource/3huj-srit.json","https://opendata.rdw.nl/resource/8ys7-d773.json","https://opendata.rdw.nl/resource/vezc-m2t6.json","https://opendata.rdw.nl/resource/jhie-znh9.json","https://opendata.rdw.nl/resource/kmfi-hrps.json"
"P334RR","Personenauto","FERRARI","488 SPIDER","20250523","20220523","54237","cabriolet","2","ZWART","Niet geregistreerd","8","3902","1540","1835","1640",,,"20160729","20220523","Geen verstrekking in Open Data","323033","Ja","325",,,,,,"2","4",,,,"457","196","M1",,,"r. dwarsbalk onder voorzitting","1835","F 142",,,,,,"0.30","265","Nee","Ja",,"Nee",,,,"2024","Geen oordeel","05","Ja","2025-05-23T00:00:00.000","2022-05-23T00:00:00.000","2016-07-29T00:00:00.000","2022-05-23T00:00:00.000",,,,,,,,,,,,,,,,,,,,,,"20220519","2022-05-19T00:00:00.000",,,,,"https://opendata.rdw.nl/resource/3huj-srit.json","https://opendata.rdw.nl/resource/8ys7-d773.json","https://opendata.rdw.nl/resource/vezc-m2t6.json","https://opendata.rdw.nl/resource/jhie-znh9.json","https://opendata.rdw.nl/resource/kmfi-hrps.json"
"PK965Z","Personenauto","FERRARI","488 SPIDER","20250719","20181017","57165","cabriolet","2","ROOD","Niet geregistreerd","8","3902","1540","1835","1640",,,"20170719","20170719","Geen verstrekking in Open Data","326082","Ja",,,,,,,"2","4",,,,"457","195","M1",,,"onder r. voorzitting","1835","F 142",,"e3*2007/46*0040*14","BD","E","0","0.30","265","Nee","Ja",,"Nee","1835",,,"2023","Logisch","00","Ja","2025-07-19T00:00:00.000","2018-10-17T00:00:00.000","2017-07-19T00:00:00.000","2017-07-19T00:00:00.000",,,,,,,,,,,"121",,,,,,,,,,"G",,,,,,,"https://opendata.rdw.nl/resource/3huj-srit.json","https://opendata.rdw.nl/resource/8ys7-d773.json","https://opendata.rdw.nl/resource/vezc-m2t6.json","https://opendata.rdw.nl/resource/jhie-znh9.json","https://opendata.rdw.nl/resource/kmfi-hrps.json"
"PN117L","Personenauto","FERRARI","488 SPIDER","20250316","20210225","57156","cabriolet","2","ROOD","Niet geregistreerd","8","3902","1540","1835","1640",,,"20170804","20170804","Geen verstrekking in Open Data","330188","Ja",,,,,,,"2","4",,,,"457","195","M1",,,"in bodemplaat r.","1835","F 142",,"e3*2007/46*0040*16","BD","E","0","0.30","265","Nee","Ja",,"Nee","1835",,,"2023","Logisch","00","Ja","2025-03-16T00:00:00.000","2021-02-25T00:00:00.000","2017-08-04T00:00:00.000","2017-08-04T00:00:00.000",,,,,,,,,,,"121",,,,,,,,,,"G",,,,,,,"https://opendata.rdw.nl/resource/3huj-srit.json","https://opendata.rdw.nl/resource/8ys7-d773.json","https://opendata.rdw.nl/resource/vezc-m2t6.json","https://opendata.rdw.nl/resource/jhie-znh9.json","https://opendata.rdw.nl/resource/kmfi-hrps.json"
"PN628L","Personenauto","FERRARI","488 SPIDER","20250807","20210113","57156","cabriolet","2","ROOD","Niet geregistreerd","8","3902","1540","1835","1640",,,"20170807","20170807","Geen verstrekking in Open Data","370842","Ja",,,,,,,"2","4",,,,"457","195","M1",,,"in bodemplaat r.","1835","F 142",,"e3*2007/46*0040*16","BD","E","0","0.30","265","Nee","Ja",,"Nee","1835",,,"2023","Logisch","00","Ja","2025-08-07T00:00:00.000","2021-01-13T00:00:00.000","2017-08-07T00:00:00.000","2017-08-07T00:00:00.000",,,,,,,,,,,"121",,,,,,,,,,"G",,,,,,,"https://opendata.rdw.nl/resource/3huj-srit.json","https://opendata.rdw.nl/resource/8ys7-d773.json","https://opendata.rdw.nl/resource/vezc-m2t6.json","https://opendata.rdw.nl/resource/jhie-znh9.json","https://opendata.rdw.nl/resource/kmfi-hrps.json"
"PP696K","Personenauto","FERRARI","488 SPIDER","20250902","20211220","57156","cabriolet","2","ZWART","Niet geregistreerd","8","3902","1540","1835","1640",,,"20170818","20170818","Geen verstrekking in Open Data","349825","Ja",,,,,,,"2","4",,,,"457","195","M1",,,"in bodemplaat r.","1835","F 142",,"e3*2007/46*0040*16","BD","E","0","0.30","265","Nee","Ja",,"Nee","1835",,,"2023","Logisch","00","Ja","2025-09-02T00:00:00.000","2021-12-20T00:00:00.000","2017-08-18T00:00:00.000","2017-08-18T00:00:00.000",,,,,,,,,,,"121",,,,,,,,,,"G",,,,,,,"https://opendata.rdw.nl/resource/3huj-srit.json","https://opendata.rdw.nl/resource/8ys7-d773.json","https://opendata.rdw.nl/resource/vezc-m2t6.json","https://opendata.rdw.nl/resource/jhie-znh9.json","https://opendata.rdw.nl/resource/kmfi-hrps.json"
"PS208V","Personenauto","FERRARI","488 SPIDER","20250914","20170913","57165","cabriolet","2","ROOD","Niet geregistreerd","8","3902","1540","1835","1640",,,"20170909","20170909","Geen verstrekking in Open Data","399165","Ja",,,,,,,"2","4",,,,"457","195","M1",,,"in bodemplaat r.","1835","F142",,"e3*2007/46*0040*16","BD","E","0","0.30","265","Nee","Ja",,"Nee","1835",,,"2023","Logisch","00","Ja","2025-09-14T00:00:00.000","2017-09-13T00:00:00.000","2017-09-09T00:00:00.000","2017-09-09T00:00:00.000",,,,,,,,,,,"121",,,,,,,,,,"G",,,,,,,"https://opendata.rdw.nl/resource/3huj-srit.json","https://opendata.rdw.nl/resource/8ys7-d773.json","https://opendata.rdw.nl/resource/vezc-m2t6.json","https://opendata.rdw.nl/resource/jhie-znh9.json","https://opendata.rdw.nl/resource/kmfi-hrps.json"
"R836GG","Personenauto","FERRARI","488 SPIDER","20240827","20220822","48926","cabriolet","2","ZWART","Niet geregistreerd","8","3902","1540","1835","1640",,,"20180827","20220822","Geen verstrekking in Open Data","329810","Ja","325",,,,,,"2","4",,,,"457",,"M1",,,,"1835","F 142",,"e3*2007/46*0040*18","BD","E","2","0.30","265","Nee","Ja",,"Nee",,,,"2022","Geen oordeel","05","Ja","2024-08-27T00:00:00.000","2022-08-22T00:00:00.000","2018-08-27T00:00:00.000","2022-08-22T00:00:00.000",,,,,,,,,,,,,,,,,,,,,,"20220816","2022-08-16T00:00:00.000",,,,,"https://opendata.rdw.nl/resource/3huj-srit.json","https://opendata.rdw.nl/resource/8ys7-d773.json","https://opendata.rdw.nl/resource/vezc-m2t6.json","https://opendata.rdw.nl/resource/jhie-znh9.json","https://opendata.rdw.nl/resource/kmfi-hrps.json"
"RN285B","Personenauto","FERRARI","488 SPIDER","20260213","20180119","57165","cabriolet","2","GRIJS","Niet geregistreerd","8","3902","1540","1835","1640",,,"20180119","20180119","Geen verstrekking in Open Data","340720","Ja",,,,,,,"2","4",,,,"457","195","M1",,,"in bodemplaat r.","1835","F 142",,"e3*2007/46*0040*18","BD","E","0","0.30","265","Nee","Ja",,"Nee","1835",,,"2024","Logisch","00","Ja","2026-02-13T00:00:00.000","2018-01-19T00:00:00.000","2018-01-19T00:00:00.000","2018-01-19T00:00:00.000",,,,,,,,,,,"121",,,,,,,,,,"G",,,,,,,"https://opendata.rdw.nl/resource/3huj-srit.json","https://opendata.rdw.nl/resource/8ys7-d773.json","https://opendata.rdw.nl/resource/vezc-m2t6.json","https://opendata.rdw.nl/resource/jhie-znh9.json","https://opendata.rdw.nl/resource/kmfi-hrps.json"
"RN442F","Personenauto","FERRARI","488 SPIDER","20260115","20230526","57165","cabriolet","2","GRIJS","Niet geregistreerd","8","3902","1540","1835","1640",,,"20180115","20180115","Geen verstrekking in Open Data","329832","Ja",,,,,,,"2","4",,,,"457","195","M1",,,"in bodemplaat r.","1835","F142",,"e3*2007/46*0040*16","BD","E","0","0.30","265","Nee","Ja",,"Nee","1835",,,"2024","Logisch","00","Ja","2026-01-15T00:00:00.000","2023-05-26T00:00:00.000","2018-01-15T00:00:00.000","2018-01-15T00:00:00.000",,,,,,,,,,,"121",,,,,,,,,,"G",,,,,,,"https://opendata.rdw.nl/resource/3huj-srit.json","https://opendata.rdw.nl/resource/8ys7-d773.json","https://opendata.rdw.nl/resource/vezc-m2t6.json","https://opendata.rdw.nl/resource/jhie-znh9.json","https://opendata.rdw.nl/resource/kmfi-hrps.json"
"RT681K","Personenauto","FERRARI","488 SPIDER","20240513","20180206","57477","cabriolet","2","ROOD","Niet geregistreerd","8","3902","1540","1835","1640",,,"20180205","20180205","Geen verstrekking in Open Data","375461","Ja",,,,,,,"2","4",,,,"457","195","M1",,,"in bodemplaat r.","1835","F 142",,"e3*2007/46*0040*16","BD","E","0","0.30","265","Nee","Ja",,"Nee","1835",,,"2022","Logisch","00","Ja","2024-05-13T00:00:00.000","2018-02-06T00:00:00.000","2018-02-05T00:00:00.000","2018-02-05T00:00:00.000",,,,,,,,,,,"121",,,,,,,,,,"G",,,,,,,"https://opendata.rdw.nl/resource/3huj-srit.json","https://opendata.rdw.nl/resource/8ys7-d773.json","https://opendata.rdw.nl/resource/vezc-m2t6.json","https://opendata.rdw.nl/resource/jhie-znh9.json","https://opendata.rdw.nl/resource/kmfi-hrps.json"
"RT755R","Personenauto","FERRARI","488 SPIDER","20260202","20180202","57477","cabriolet","2","ROOD","Niet geregistreerd","8","3902","1540","1835","1640",,,"20180202","20180202","Geen verstrekking in Open Data","428759","Ja",,,,,,,"2","4",,,,"457","195","M1",,,"in bodemplaat r.","1835","F 142",,"e3*2007/46*0040*18","BD","E","0","0.30","265","Nee","Ja",,"Nee","1835",,,"2024","Logisch","00","Ja","2026-02-02T00:00:00.000","2018-02-02T00:00:00.000","2018-02-02T00:00:00.000","2018-02-02T00:00:00.000",,,,,,,,,,,"121",,,,,,,,,,"G",,,,,,,"https://opendata.rdw.nl/resource/3huj-srit.json","https://opendata.rdw.nl/resource/8ys7-d773.json","https://opendata.rdw.nl/resource/vezc-m2t6.json","https://opendata.rdw.nl/resource/jhie-znh9.json","https://opendata.rdw.nl/resource/kmfi-hrps.json"
"RT979F","Personenauto","FERRARI","488 SPIDER","20260215","20180203","57477","cabriolet","2","GRIJS","Niet geregistreerd","8","3902","1540","1835","1640",,,"20180203","20180203","Geen verstrekking in Open Data","347987","Ja",,,,,,,"2","4",,,,"457","195","M1",,,"in bodemplaat r.","1835","F142",,"e3*2007/46*0040*18","BD","E","0","0.30","265","Nee","Ja",,"Nee","1835",,,"2024","Logisch","00","Ja","2026-02-15T00:00:00.000","2018-02-03T00:00:00.000","2018-02-03T00:00:00.000","2018-02-03T00:00:00.000",,,,,,,,,,,"121",,,,,,,,,,"G",,,,,,,"https://opendata.rdw.nl/resource/3huj-srit.json","https://opendata.rdw.nl/resource/8ys7-d773.json","https://opendata.rdw.nl/resource/vezc-m2t6.json","https://opendata.rdw.nl/resource/jhie-znh9.json","https://opendata.rdw.nl/resource/kmfi-hrps.json"
"RX127D","Personenauto","FERRARI","488 SPIDER","20240217","20220726","57477","cabriolet","2","ROOD","Niet geregistreerd","8","3902","1540","1835","1640",,,"20180217","20180217","Geen verstrekking in Open Data","369168","Nee",,,,,,,"2","4",,,,"457","195","M1",,,"onder r. voorzitting by r. deurstyl","1835","F 142",,"e3*2007/46*0040*16","BD","E","0","0.30","265","Nee","Ja",,"Nee","1835",,,"2022","Logisch","00","Ja","2024-02-17T00:00:00.000","2022-07-26T00:00:00.000","2018-02-17T00:00:00.000","2018-02-17T00:00:00.000",,,,,,,,,,,"121",,,,,,,,,,"G",,,,,,,"https://opendata.rdw.nl/resource/3huj-srit.json","https://opendata.rdw.nl/resource/8ys7-d773.json","https://opendata.rdw.nl/resource/vezc-m2t6.json","https://opendata.rdw.nl/resource/jhie-znh9.json","https://opendata.rdw.nl/resource/kmfi-hrps.json"
"S942VH","Personenauto","FERRARI","488 SPIDER","20250404","20230412","55977","cabriolet","2","BLAUW","Niet geregistreerd","8","3902","1540","1835","1640",,,"20190226","20230412","Geen verstrekking in Open Data","423002","Ja","325",,,,,,"2","4",,,,"457",,"M1",,,"r. dwarsbalk onder voorzitting","1835","F 142",,,,,,"0.30","265","Nee","Ja",,"Nee",,,,"2023","Geen oordeel","05","Ja","2025-04-04T00:00:00.000","2023-04-12T00:00:00.000","2019-02-26T00:00:00.000","2023-04-12T00:00:00.000",,,,,,,,,,,,,,,,,,,,,,"20230404","2023-04-04T00:00:00.000",,,,,"https://opendata.rdw.nl/resource/3huj-srit.json","https://opendata.rdw.nl/resource/8ys7-d773.json","https://opendata.rdw.nl/resource/vezc-m2t6.json","https://opendata.rdw.nl/resource/jhie-znh9.json","https://opendata.rdw.nl/resource/kmfi-hrps.json"
"ST868V","Personenauto","FERRARI","488 SPIDER","20260329","20220402","57477","cabriolet","2","WIT","Niet geregistreerd","8","3902","1540","1835","1640",,,"20180601","20180601","Geen verstrekking in Open Data","389370","Ja",,,,,,,"2","4",,,,"457","195","M1",,,,"1835","F 142",,"e3*2007/46*0040*18","BD","E","0","0.30","265","Nee","Ja",,"Nee","1835",,,"2024","Logisch","00","Ja","2026-03-29T00:00:00.000","2022-04-02T00:00:00.000","2018-06-01T00:00:00.000","2018-06-01T00:00:00.000",,,,,,,,,,,"121",,,,,,,,,,"G",,,,,,,"https://opendata.rdw.nl/resource/3huj-srit.json","https://opendata.rdw.nl/resource/8ys7-d773.json","https://opendata.rdw.nl/resource/vezc-m2t6.json","https://opendata.rdw.nl/resource/jhie-znh9.json","https://opendata.rdw.nl/resource/kmfi-hrps.json"
"SX068R","Personenauto","FERRARI","488 SPIDER","20240616","20180616","57477","cabriolet","2","GEEL","Niet geregistreerd","8","3902","1540","1835","1640",,,"20180616","20180616","Geen verstrekking in Open Data","342510","Ja",,,,,,,"2","4",,,,"457","195","M1",,,,"1835","F 142",,"e3*2007/46*0040*18","BD","E","0","0.30","265","Nee","Ja",,"Nee","1835",,,"2022","Logisch","00","Ja","2024-06-16T00:00:00.000","2018-06-16T00:00:00.000","2018-06-16T00:00:00.000","2018-06-16T00:00:00.000",,,,,,,,,,,"121",,,,,,,,,,"G",,,,,,,"https://opendata.rdw.nl/resource/3huj-srit.json","https://opendata.rdw.nl/resource/8ys7-d773.json","https://opendata.rdw.nl/resource/vezc-m2t6.json","https://opendata.rdw.nl/resource/jhie-znh9.json","https://opendata.rdw.nl/resource/kmfi-hrps.json"
"TP504F","Personenauto","FERRARI","488 SPIDER","20240920","20230913","57477","cabriolet","2","ROOD","Niet geregistreerd","8","3902","1540","1835","1640",,,"20180920","20180920","Geen verstrekking in Open Data","356815","Ja",,,,,,,"2","4","0","0",,"457","195","M1",,,,"1835","F142",,"e3*2007/46*0040*20","BD","E","0","0.30","265","Nee","Ja",,"Nee","1835","0","0.00","2023","Logisch","00","Ja","2024-09-20T00:00:00.000","2023-09-13T00:00:00.000","2018-09-20T00:00:00.000","2018-09-20T00:00:00.000",,,,,,,,,,,"121",,,,,,,,,,"G",,,,,,,"https://opendata.rdw.nl/resource/3huj-srit.json","https://opendata.rdw.nl/resource/8ys7-d773.json","https://opendata.rdw.nl/resource/vezc-m2t6.json","https://opendata.rdw.nl/resource/jhie-znh9.json","https://opendata.rdw.nl/resource/kmfi-hrps.json"
"X285PX","Personenauto","FERRARI","488 SPIDER","20241130","20231228","55977","cabriolet","2","ZWART","Niet geregistreerd","8","3902","1540","1835","1640",,,"20170720","20231228","Geen verstrekking in Open Data","369345","Ja","325",,,,,,"2","4",,,,"457","195","M1",,,,"1835","F 142",,"e3*2007/46*0040*18","BD","E","1","0.30","265","Nee","Ja",,"Nee",,,,"2023","Geen oordeel","05","Ja","2024-11-30T00:00:00.000","2023-12-28T00:00:00.000","2017-07-20T00:00:00.000","2023-12-28T00:00:00.000",,,,,,,,,,,"121",,,,,,,,,,,"20231222","2023-12-22T00:00:00.000",,,,,"https://opendata.rdw.nl/resource/3huj-srit.json","https://opendata.rdw.nl/resource/8ys7-d773.json","https://opendata.rdw.nl/resource/vezc-m2t6.json","https://opendata.rdw.nl/resource/jhie-znh9.json","https://opendata.rdw.nl/resource/kmfi-hrps.json"