"kenteken","voertuigsoort","merk","handelsbenaming","vervaldatum_apk","datum_tenaamstelling","bruto_bpm","inrichting","aantal_zitplaatsen","eerste_kleur","tweede_kleur","aantal_cilinders","cilinderinhoud","massa_ledig_voertuig","toegestane_maximum_massa_voertuig","massa_rijklaar","maximum_massa_trekken_ongeremd","maximum_trekken_massa_geremd","datum_eerste_toelating","datum_eerste_tenaamstelling_in_nederland","wacht_op_keuren","catalogusprijs","wam_verzekerd","maximale_constructiesnelheid","laadvermogen","oplegger_geremd","aanhangwagen_autonoom_geremd","aanhangwagen_middenas_geremd","aantal_staanplaatsen","aantal_deuren","aantal_wielen","afstand_hart_koppeling_tot_achterzijde_voertuig","afstand_voorzijde_voertuig_tot_hart_koppeling","afwijkende_maximum_snelheid","lengte","breedte","europese_voertuigcategorie","europese_voertuigcategorie_toevoeging","europese_uitvoeringcategorie_toevoeging","plaats_chassisnummer","technische_max_massa_voertuig","type","type_gasinstallatie","typegoedkeuringsnummer","variant","uitvoering","volgnummer_wijziging_eu_typegoedkeuring","vermogen_massarijklaar","wielbasis","export_indicator","openstaande_terugroepactie_indicator","vervaldatum_tachograaf","taxi_indicator","maximum_massa_samenstelling","aantal_rolstoelplaatsen","maximum_ondersteunende_snelheid","jaar_laatste_registratie_tellerstand","tellerstandoordeel","code_toelichting_tellerstandoordeel","tenaamstellen_mogelijk","vervaldatum_apk_dt","datum_tenaamstelling_dt","datum_eerste_toelating_dt","datum_eerste_tenaamstelling_in_nederland_dt","vervaldatum_tachograaf_dt","maximum_last_onder_de_vooras_sen_tezamen_koppeling","type_remsysteem_voertuig_code","rupsonderstelconfiguratiecode","wielbasis_voertuig_minimum","wielbasis_voertuig_maximum","lengte_voertuig_minimum","lengte_voertuig_maximum","breedte_voertuig_minimum","breedte_voertuig_maximum","hoogte_voertuig","hoogte_voertuig_minimum","hoogte_voertuig_maximum","massa_bedrijfsklaar_minimaal","massa_bedrijfsklaar_maximaal","technisch_toelaatbaar_massa_koppelpunt","maximum_massa_technisch_maximaal","maximum_massa_technisch_minimaal","subcategorie_nederland","verticale_belasting_koppelpunt_getrokken_voertuig","zuinigheidsclassificatie","registratie_datum_goedkeuring_afschrijvingsmoment_bpm","registratie_datum_goedkeuring_afschrijvingsmoment_bpm_dt","gem_lading_wrde","aerodyn_voorz","massa_alt_aandr","verl_cab_ind","api_gekentekende_voertuigen_assen","api_gekentekende_voertuigen_brandstof","api_gekentekende_voertuigen_carrosserie","api_gekentekende_voertuigen_carrosserie_specifiek","api_gekentekende_voertuigen_voertuigklasse"
"18VVL6","Bedrijfsauto","DODGE","DODGE RAM 1500 SLT","20241204","20230208","7220","open wagen","6","N.v.t.","N.v.t.","8","4700","2494","3040","2594","750",,"20080115","20081229","Geen verstrekking in Open Data",,"Ja",,"546",,"3500","3500",,,"4",,,,,"200","N1",,,"r. balk a. vooras","3040",,"G3 gasinstallatie",,,,,"0.06","358","Nee","Ja",,"Nee",,,,"2023","Geen oordeel","05","Ja","2024-12-04T00:00:00.000","2023-02-08T00:00:00.000","2008-01-15T00:00:00.000","2008-12-29T00:00:00.000",,"0",,,,,,,,,,,,,,,,,,,,,,,,,,"https://opendata.rdw.nl/resource/3huj-srit.json","https://opendata.rdw.nl/resource/8ys7-d773.json","https://opendata.rdw.nl/resource/vezc-m2t6.json","https://opendata.rdw.nl/resource/jhie-znh9.json","https://opendata.rdw.nl/resource/kmfi-hrps.json"
"25VLF1","Bedrijfsauto","DODGE","DODGE RAM 1500 SLT","20241221","20240420","9308","open wagen","6","N.v.t.","N.v.t.","8","4700","2391","3040","2491","750",,"20070518","20080401","Geen verstrekking in Open Data",,"Ja",,"649",,"3500","3500",,,"4",,,,,"202","N1",,,"tegen r. balk 090 cm a. vooras","3040",,"G3 gasinstallatie",,,,,"0.07","358","Nee","Ja",,"Nee","5540",,,"2024","Geen oordeel","05","Ja","2024-12-21T00:00:00.000","2024-04-20T00:00:00.000","2007-05-18T00:00:00.000","2008-04-01T00:00:00.000",,"0",,,,,,,,,,,,,,,,,,,,,,,,,,"https://opendata.rdw.nl/resource/3huj-srit.json","https://opendata.rdw.nl/resource/8ys7-d773.json","https://opendata.rdw.nl/resource/vezc-m2t6.json","https://opendata.rdw.nl/resource/jhie-znh9.json","https://opendata.rdw.nl/resource/kmfi-hrps.json"
"2VXV74","Bedrijfsauto","DODGE","DODGE RAM 1500 SLT","20240906","20200716","5424","pick-up truck","5","N.v.t.","N.v.t.","8","5654","2416","3039","2516","750",,"20120820","20120820","Geen verstrekking in Open Data","26599","Ja",,"623",,"3500","3500",,,"4",,,,,"202","N1",,,"r. balk a. vooras","3039",,"G3 gasinstallatie",,,,,"0.12","357","Nee","Ja",,"Nee","6500",,,"2023","Logisch","00","Ja","2024-09-06T00:00:00.000","2020-07-16T00:00:00.000","2012-08-20T00:00:00.000","2012-08-20T00:00:00.000",,,,,,,,,,,,,,,,,,,,,,"20220826","2022-08-26T00:00:00.000",,,,,"https://opendata.rdw.nl/resource/3huj-srit.json","https://opendata.rdw.nl/resource/8ys7-d773.json","https://opendata.rdw.nl/resource/vezc-m2t6.json","https://opendata.rdw.nl/resource/jhie-znh9.json","https://opendata.rdw.nl/resource/kmfi-hrps.json"
"2VZD92","Bedrijfsauto","DODGE","DODGE RAM 1500 SLT","20241103","20231103",,"pick-up truck","6","N.v.t.","N.v.t.","8","4701","2200","3017","2300","750",,"20050701","20231031","Geen verstrekking in Open Data",,"Ja","180","817",,"3000","3000",,,"4",,,,,"208","N1",,,,"3017",,,,,,,"0.08","357","Nee","Ja",,"Nee","6000",,,"2023","Geen oordeel","05","Ja","2024-11-03T00:00:00.000","2023-11-03T00:00:00.000","2005-07-01T00:00:00.000","2023-10-31T00:00:00.000",,,,,,,,,,,,,,,,,,,,,,"20231018","2023-10-18T00:00:00.000",,,,,"https://opendata.rdw.nl/resource/3huj-srit.json","https://opendata.rdw.nl/resource/8ys7-d773.json","https://opendata.rdw.nl/resource/vezc-m2t6.json","https://opendata.rdw.nl/resource/jhie-znh9.json","https://opendata.rdw.nl/resource/kmfi-hrps.json"
"58VLD8","Bedrijfsauto","DODGE","DODGE RAM 1500 SLT","20250215","20240119","9308","open wagen","6","N.v.t.","N.v.t.","8","4700","2494","3040","2594","750",,"20070518","20071205","Geen verstrekking in Open Data",,"Ja",,"546",,"3500","3500",,,"4",,,,,"200","N1",,,"r. tegen balk a. vooras","3040",,"G3 gasinstallatie",,,,,"0.06","358","Nee","Ja",,"Nee",,,,"2024","Geen oordeel","05","Ja","2025-02-15T00:00:00.000","2024-01-19T00:00:00.000","2007-05-18T00:00:00.000","2007-12-05T00:00:00.000",,"0",,,,,,,,,,,,,,,,,,,,,,,,,,"https://opendata.rdw.nl/resource/3huj-srit.json","https://opendata.rdw.nl/resource/8ys7-d773.json","https://opendata.rdw.nl/resource/vezc-m2t6.json","https://opendata.rdw.nl/resource/jhie-znh9.json","https://opendata.rdw.nl/resource/kmfi-hrps.json"
"5VXJ16","Bedrijfsauto","DODGE","DODGE RAM 1500 SLT","20240508","20190720","5424","open laadvloer","5","N.v.t.","N.v.t.","8","5654","2416","3084","2516","750",,"20120704","20120704","Geen verstrekking in Open Data","26598","Ja",,"668",,"3500","3500",,,"4",,,,,"202","N1",,,"r. tegen balk 150 cm v. achteras","3084",,,,,,,"0.12","358","Nee","Ja",,"Nee","6500",,,"2023","Logisch","00","Ja","2024-05-08T00:00:00.000","2019-07-20T00:00:00.000","2012-07-04T00:00:00.000","2012-07-04T00:00:00.000",,,,,,,,,,,,,,,,,,,,,,,,,,,,"https://opendata.rdw.nl/resource/3huj-srit.json","https://opendata.rdw.nl/resource/8ys7-d773.json","https://opendata.rdw.nl/resource/vezc-m2t6.json","https://opendata.rdw.nl/resource/jhie-znh9.json","https://opendata.rdw.nl/resource/kmfi-hrps.json"
"64VPV2","Bedrijfsauto","DODGE","DODGE RAM 1500 SLT","20250425","20160503","6544","open wagen","6","N.v.t.","N.v.t.","8","4700","2494","3040","2594","750",,"20070115","20080619","Geen verstrekking in Open Data",,"Ja",,"546",,"3500","3500",,,"4",,,,,"197","N1",,,"r. balk a. vooras","3040",,"G2 gasinstallatie",,,,,"0.06","358","Nee","Ja",,"Nee",,,,"2024","Geen oordeel","05","Ja","2025-04-25T00:00:00.000","2016-05-03T00:00:00.000","2007-01-15T00:00:00.000","2008-06-19T00:00:00.000",,"0",,,,,,,,,,,,,,,,,,,,,,,,,,"https://opendata.rdw.nl/resource/3huj-srit.json","https://opendata.rdw.nl/resource/8ys7-d773.json","https://opendata.rdw.nl/resource/vezc-m2t6.json","https://opendata.rdw.nl/resource/jhie-znh9.json","https://opendata.rdw.nl/resource/kmfi-hrps.json"
"6VBH39","Bedrijfsauto","DODGE","DODGE RAM 1500 SLT","20250430","20200814","8444","open wagen","2","N.v.t.","N.v.t.","8","4701","2103","2773","2203","650",,"20060701","20090327","Geen verstrekking in Open Data",,"Ja",,"670",,"2000","2000",,,"4",,,,,"197","N1",,,"r. balk a. vooras","2773",,"G3 gasinstallatie",,,,,"0.08","306","Nee","Ja",,"Nee",,,,"2024","Onlogisch","04","Ja","2025-04-30T00:00:00.000","2020-08-14T00:00:00.000","2006-07-01T00:00:00.000","2009-03-27T00:00:00.000",,"0",,,,,,,,,,,,,,,,,,,,,,,,,,"https://opendata.rdw.nl/resource/3huj-srit.json","https://opendata.rdw.nl/resource/8ys7-d773.json","https://opendata.rdw.nl/resource/vezc-m2t6.json","https://opendata.rdw.nl/resource/jhie-znh9.json","https://opendata.rdw.nl/resource/kmfi-hrps.json"
"6VXK82","Bedrijfsauto","DODGE","DODGE RAM 1500 SLT","20250105","20240309","5424","open wagen","5","N.v.t.","N.v.t.","8","5654","2416","3039","2516","750",,"20130426","20130426","Geen verstrekking in Open Data","26599","Ja",,"623",,"3500","3500",,,"4",,,,,"202","N1",,,"r. balk","3039",,,,,,,"0.12","358","Nee","Nee",,"Nee","6500",,,"2024","Logisch","00","Ja","2025-01-05T00:00:00.000","2024-03-09T00:00:00.000","2013-04-26T00:00:00.000","2013-04-26T00:00:00.000",,"0",,,,,,,,,,,,,,,,,,,,,,,,,,"https://opendata.rdw.nl/resource/3huj-srit.json","https://opendata.rdw.nl/resource/8ys7-d773.json","https://opendata.rdw.nl/resource/vezc-m2t6.json","https://opendata.rdw.nl/resource/jhie-znh9.json","https://opendata.rdw.nl/resource/kmfi-hrps.json"
"6VXL94","Bedrijfsauto","DODGE","DODGE RAM 1500 SLT","20240810","20231118","5424","open wagen","5","N.v.t.","N.v.t.","8","5654","2416","3039","2516","750",,"20120719","20120719","Geen verstrekking in Open Data","17793","Ja",,"623",,"3500","3500",,,"4",,,,,"202","N1",,,"r. balk","3039",,"G3 gasinstallatie",,,,,"0.12","358","Nee","Ja",,"Nee","6500",,,"2023","Logisch","00","Ja","2024-08-10T00:00:00.000","2023-11-18T00:00:00.000","2012-07-19T00:00:00.000","2012-07-19T00:00:00.000",,"0",,,,,,,,,,,,,,,,,,,,,,,,,,"https://opendata.rdw.nl/resource/3huj-srit.json","https://opendata.rdw.nl/resource/8ys7-d773.json","https://opendata.rdw.nl/resource/vezc-m2t6.json","https://opendata.rdw.nl/resource/jhie-znh9.json","https://opendata.rdw.nl/resource/kmfi-hrps.json"
"7VHG56","Bedrijfsauto","DODGE","DODGE RAM 1500 SLT","20240921","20231120","8674","open wagen","6","N.v.t.","N.v.t.","8","4700","2429","3040","2529","750",,"20060110","20110810","Geen verstrekking in Open Data",,"Ja",,"611",,"3500","3500",,,"4",,,,,"202","N1",,,"tegen r. balk 090 cm a. vooras","3040",,"G3 gasinstallatie",,,,,"0.06","357","Nee","Ja",,"Nee","5540",,,"2023","Onlogisch","04","Ja","2024-09-21T00:00:00.000","2023-11-20T00:00:00.000","2006-01-10T00:00:00.000","2011-08-10T00:00:00.000",,"0",,,,,,,,,,,,,,,,,,,,,,,,,,"https://opendata.rdw.nl/resource/3huj-srit.json","https://opendata.rdw.nl/resource/8ys7-d773.json","https://opendata.rdw.nl/resource/vezc-m2t6.json","https://opendata.rdw.nl/resource/jhie-znh9.json","https://opendata.rdw.nl/resource/kmfi-hrps.json"
"86VXB7","Bedrijfsauto","DODGE","DODGE RAM 1500 SLT","20240608","20231209",,"open wagen","5","N.v.t.","N.v.t.","8","5654","2491","3017","2591","750",,"20040701","20100407","Geen verstrekking in Open Data",,"Ja",,"526",,"3000","3000",,,"4",,,,,"200","N1",,,"r. balk v. vooras","3017",,"G3 gasinstallatie",,,,,"0.10","358","Nee","Nee",,"Nee",,,,"2023","Onlogisch","04","Ja","2024-06-08T00:00:00.000","2023-12-09T00:00:00.000","2004-07-01T00:00:00.000","2010-04-07T00:00:00.000",,"0",,,,,,,,,,,,,,,,,,,,,,,,,,"https://opendata.rdw.nl/resource/3huj-srit.json","https://opendata.rdw.nl/resource/8ys7-d773.json","https://opendata.rdw.nl/resource/vezc-m2t6.json","https://opendata.rdw.nl/resource/jhie-znh9.json","https://opendata.rdw.nl/resource/kmfi-hrps.json"
"8VXV90","Bedrijfsauto","DODGE","DODGE RAM 1500 SLT","20240828","20141229","5424","open wagen","5","N.v.t.","N.v.t.","8","5654","2416","3084","2516","750",,"20120828","20120828","Geen verstrekking in Open Data","26599","Ja",,"668",,"3500","3500",,,"4",,,,,"202","N1",,,"onderop r. balk 130 cm a. vooras","3084",,,,,,,"0.12","357","Nee","Nee",,"Nee","6500",,,"2023","Logisch","00","Ja","2024-08-28T00:00:00.000","2014-12-29T00:00:00.000","2012-08-28T00:00:00.000","2012-08-28T00:00:00.000",,"0",,,,,,,,,,,,,,,,,,,,,,,,,,"https://opendata.rdw.nl/resource/3huj-srit.json","https://opendata.rdw.nl/resource/8ys7-d773.json","https://opendata.rdw.nl/resource/vezc-m2t6.json","https://opendata.rdw.nl/resource/jhie-znh9.json","https://opendata.rdw.nl/resource/kmfi-hrps.json"
"9VXV09","Bedrijfsauto","DODGE","DODGE RAM 1500 SLT","20241025","20160519","5424","open wagen","5","N.v.t.","N.v.t.","8","5654","2416","3084","2516","750",,"20121025","20121025","Geen verstrekking in Open Data","26599","Ja",,"668",,"3500","3500",,,"4",,,,,"202","N1",,,"onderop r. balk 130 cm a. vooras","3084",,,,,,,"0.12","357","Nee","Ja",,"Nee","6500",,,"2024","Logisch","00","Ja","2024-10-25T00:00:00.000","2016-05-19T00:00:00.000","2012-10-25T00:00:00.000","2012-10-25T00:00:00.000",,"0",,,,,,,,,,,,,,,,,,,,,,,,,,"https://opendata.rdw.nl/resource/3huj-srit.json","https://opendata.rdw.nl/resource/8ys7-d773.json","https://opendata.rdw.nl/resource/vezc-m2t6.json","https://opendata.rdw.nl/resource/jhie-znh9.json","https://opendata.rdw.nl/resource/kmfi-hrps.json"
"V124BH","Bedrijfsauto","DODGE","DODGE RAM 1500 SLT","20250101","20170101","6121","pick-up truck","5","N.v.t.","N.v.t.","6","3605","2373","3085","2473","750",,"20170101","20170101","Geen verstrekking in Open Data","23765","Ja",,"712",,"3200","3200",,,"4",,,,,"202","N1",,,"r. balk a. vooras","3085",,"115R gasinstallatie",,,,,"0.09","357","Nee","Nee",,"Nee","6285",,,"2024","Logisch","00","Ja","2025-01-01T00:00:00.000","2017-01-01T00:00:00.000","2017-01-01T00:00:00.000","2017-01-01T00:00:00.000",,"0",,,,,,,,,,,,,,,,,,,,,,,,,,"https://opendata.rdw.nl/resource/3huj-srit.json","https://opendata.rdw.nl/resource/8ys7-d773.json","https://opendata.rdw.nl/resource/vezc-m2t6.json","https://opendata.rdw.nl/resource/jhie-znh9.json","https://opendata.rdw.nl/resource/kmfi-hrps.json"
"V323ND","Bedrijfsauto","DODGE","DODGE RAM 1500 SLT","20250118","20230422","10970","pick-up truck","5","N.v.t.","N.v.t.","8","5654","2370","3040","2470","450",,"20080407","20180402","Geen verstrekking in Open Data",,"Ja",,"670",,"1700","1700",,,"4",,,,,"200","N1",,,"r. balk a. vooras","3040",,,,,,,"0.10","357","Nee","Ja",,"Nee",,,,"2024","Geen oordeel","05","Ja","2025-01-18T00:00:00.000","2023-04-22T00:00:00.000","2008-04-07T00:00:00.000","2018-04-02T00:00:00.000",,"0",,,,,,,,,,,,,,,,,,,,,,,,,,"https://opendata.rdw.nl/resource/3huj-srit.json","https://opendata.rdw.nl/resource/8ys7-d773.json","https://opendata.rdw.nl/resource/vezc-m2t6.json","https://opendata.rdw.nl/resource/jhie-znh9.json","https://opendata.rdw.nl/resource/kmfi-hrps.json"
"V743VP","Bedrijfsauto","DODGE","DODGE RAM 1500 SLT","20250408","20190328",,"pick-up truck","5","N.v.t.","N.v.t.","8","5654","2327","3017","2427","450",,"20040106","20190125","Geen verstrekking in Open Data",,"Ja",,"690",,"2500","2500",,,"4",,,,,"203","N1",,,"r. balk a. vooras","3017","RAM 1500","G3 gasinstallatie",,,,,"0.11","356","Nee","Ja",,"Nee","5517",,,"2024","Onlogisch","04","Ja","2025-04-08T00:00:00.000","2019-03-28T00:00:00.000","2004-01-06T00:00:00.000","2019-01-25T00:00:00.000",,"0",,,,,,,,,,,,,,,,,,,,,,,,,,"https://opendata.rdw.nl/resource/3huj-srit.json","https://opendata.rdw.nl/resource/8ys7-d773.json","https://opendata.rdw.nl/resource/vezc-m2t6.json","https://opendata.rdw.nl/resource/jhie-znh9.json","https://opendata.rdw.nl/resource/kmfi-hrps.json"
"VBV15T","Bedrijfsauto","DODGE","DODGE RAM 1500 SLT","20250303","20220305","9753","pick-up truck","5","N.v.t.","N.v.t.","8","4701","2365","3040","2465","750",,"20090701","20190920","Geen verstrekking in Open Data",,"Ja",,"675","4600","3000","3000",,,"4",,,,,"202","N1",,,"r. balk a. vooras","3040",,,,,,,"0.09","356","Nee","Ja",,"Nee","7600",,,"2024","Onlogisch","04","Ja","2025-03-03T00:00:00.000","2022-03-05T00:00:00.000","2009-07-01T00:00:00.000","2019-09-20T00:00:00.000",,"0",,,,,,,,,,,,,,,,,,,,,,,,,,"https://opendata.rdw.nl/resource/3huj-srit.json","https://opendata.rdw.nl/resource/8ys7-d773.json","https://opendata.rdw.nl/resource/vezc-m2t6.json","https://opendata.rdw.nl/resource/jhie-znh9.json","https://opendata.rdw.nl/resource/kmfi-hrps.json"
"VG098L","Bedrijfsauto","DODGE","DODGE RAM 1500 SLT","20250510","20210604","6099","pick-up truck","5","N.v.t.","N.v.t.","6","3605","2371","3500","2471","750",,"20131228","20131228","Geen verstrekking in Open Data","30122","Ja",,"1129",,"3500","3500",,,"4",,,,,"202","N1",,,"r. balk","3500",,"G3 gasinstallatie",,,,,"0.09","357","Nee","Nee",,"Nee","7000",,,"2024","Logisch","00","Ja","2025-05-10T00:00:00.000","2021-06-04T00:00:00.000","2013-12-28T00:00:00.000","2013-12-28T00:00:00.000",,"0",,,,,,,,,,,,,,,,,,,,,,,,,,"https://opendata.rdw.nl/resource/3huj-srit.json","https://opendata.rdw.nl/resource/8ys7-d773.json","https://opendata.rdw.nl/resource/vezc-m2t6.json","https://opendata.rdw.nl/resource/jhie-znh9.json","https://opendata.rdw.nl/resource/kmfi-hrps.json"
"VG102L","Bedrijfsauto","DODGE","DODGE RAM 1500 SLT","20250205","20231227","6099","pick-up truck","5","N.v.t.","N.v.t.","6","3605","2371","3500","2471","750",,"20131211","20131211","Geen verstrekking in Open Data","30122","Ja",,"1129",,"3500","3500",,,"4",,,,,"202","N1",,,"r. balk","3500",,"G3 gasinstallatie",,,,,"0.09","357","Nee","Nee",,"Nee","7000",,,"2023","Logisch","00","Ja","2025-02-05T00:00:00.000","2023-12-27T00:00:00.000","2013-12-11T00:00:00.000","2013-12-11T00:00:00.000",,"0",,,,,,,,,,,,,,,,,,,,,,,,,,"https://opendata.rdw.nl/resource/3huj-srit.json","https://opendata.rdw.nl/resource/8ys7-d773.json","https://opendata.rdw.nl/resource/vezc-m2t6.json","https://opendata.rdw.nl/resource/jhie-znh9.json","https://opendata.rdw.nl/resource/kmfi-hrps.json"
"VG112L","Bedrijfsauto","DODGE","DODGE RAM 1500 SLT","20240911","20231209","6372","pick-up truck","5","N.v.t.","N.v.t.","6","3605","2371","3500","2471","750",,"20140214","20140214","Geen verstrekking in Open Data","30942","Ja",,"1129",,"3500","3500",,,"4",,,,,"202","N1",,,"r. balk","3500",,"G3 gasinstallatie",,,,,"0.09","357","Nee","Ja",,"Nee","7000",,,"2023","Logisch","00","Ja","2024-09-11T00:00:00.000","2023-12-09T00:00:00.000","2014-02-14T00:00:00.000","2014-02-14T00:00:00.000",,"0",,,,,,,,,,,,,,,,,,,,,,,,,,"https://opendata.rdw.nl/resource/3huj-srit.json","https://opendata.rdw.nl/resource/8ys7-d773.json","https://opendata.rdw.nl/resource/vezc-m2t6.json","https://opendata.rdw.nl/resource/jhie-znh9.json","https://opendata.rdw.nl/resource/kmfi-hrps.json"
"VG121L","Bedrijfsauto","DODGE","DODGE RAM 1500 SLT","20250418","20240224","6099","pick-up truck","5","N.v.t.","N.v.t.","6","3605","2371","3500","2471","750",,"20131211","20131211","Geen verstrekking in Open Data","30122","Ja",,"1129",,"3500","3500",,,"4",,,,,"202","N1",,,"r. balk","3500",,"G3 gasinstallatie",,,,,"0.09","357","Nee","Ja",,"Nee","7000",,,"2024","Logisch","00","Ja","2025-04-18T00:00:00.000","2024-02-24T00:00:00.000","2013-12-11T00:00:00.000","2013-12-11T00:00:00.000",,"0",,,,,,,,,,,,,,,,,,,,,,,,,,"https://opendata.rdw.nl/resource/3huj-srit.json","https://opendata.rdw.nl/resource/8ys7-d773.json","https://opendata.rdw.nl/resource/vezc-m2t6.json","https://opendata.rdw.nl/resource/jhie-znh9.json","https://opendata.rdw.nl/resource/kmfi-hrps.json"
"VG162H","Bedrijfsauto","DODGE","DODGE RAM 1500 SLT","20241216","20231105","6099","pick-up truck","5","N.v.t.","N.v.t.","6","3605","2371","3500","2471","750",,"20131125","20131125","Geen verstrekking in Open Data","30888","Ja",,"1129",,"3500","3500",,,"4",,,,,"202","N1",,,"r. balk","3500",,"G3 gasinstallatie",,,,,"0.09","357","Nee","Ja",,"Nee","7000",,,"2023","Logisch","00","Ja","2024-12-16T00:00:00.000","2023-11-05T00:00:00.000","2013-11-25T00:00:00.000","2013-11-25T00:00:00.000",,"0",,,,,,,,,,,,,,,,,,,,,,,,,,"https://opendata.rdw.nl/resource/3huj-srit.json","https://opendata.rdw.nl/resource/8ys7-d773.json","https://opendata.rdw.nl/resource/vezc-m2t6.json","https://opendata.rdw.nl/resource/jhie-znh9.json","https://opendata.rdw.nl/resource/kmfi-hrps.json"
"VG164H","Bedrijfsauto","DODGE","DODGE RAM 1500 SLT","20250305","20200305","6099","pick-up truck","5","N.v.t.","N.v.t.","6","3605","2371","3500","2471","750",,"20140214","20140214","Geen verstrekking in Open Data","30888","Ja",,"1129",,"3500","3500",,,"4",,,,,"202","N1",,,"r. balk","3500",,"G3 gasinstallatie",,,,,"0.09","357","Nee","Ja",,"Nee","7000",,,"2024","Logisch","00","Ja","2025-03-05T00:00:00.000","2020-03-05T00:00:00.000","2014-02-14T00:00:00.000","2014-02-14T00:00:00.000",,"0",,,,,,,,,,,,,,,,,,,,,,,,,,"https://opendata.rdw.nl/resource/3huj-srit.json","https://opendata.rdw.nl/resource/8ys7-d773.json","https://opendata.rdw.nl/resource/vezc-m2t6.json","https://opendata.rdw.nl/resource/jhie-znh9.json","https://opendata.rdw.nl/resource/kmfi-hrps.json"
"VG279K","Bedrijfsauto","DODGE","DODGE RAM 1500 SLT","20240615","20230613","6372","pick-up truck","5","N.v.t.","N.v.t.","6","3605","2371","3500","2471","750",,"20140226","20140226","Geen verstrekking in Open Data","32075","Ja",,"1129",,"3500","3500",,,"4",,,,,"202","N1",,,"r. balk","3500",,"G3 gasinstallatie",,,,,"0.09","357","Nee","Nee",,"Nee","7000",,,"2023","Logisch","00","Ja","2024-06-15T00:00:00.000","2023-06-13T00:00:00.000","2014-02-26T00:00:00.000","2014-02-26T00:00:00.000",,"0",,,,,,,,,,,,,,,,,,,,,,,,,,"https://opendata.rdw.nl/resource/3huj-srit.json","https://opendata.rdw.nl/resource/8ys7-d773.json","https://opendata.rdw.nl/resource/vezc-m2t6.json","https://opendata.rdw.nl/resource/jhie-znh9.json","https://opendata.rdw.nl/resource/kmfi-hrps.json"
"VG293K","Bedrijfsauto","DODGE","DODGE RAM 1500 SLT","20250108","20240110","6099","pick-up truck","5","N.v.t.","N.v.t.","6","3605","2371","3500","2471","750",,"20140108","20140108","Geen verstrekking in Open Data","30888","Ja",,"1129",,"3500","3500",,,"4",,,,,"202","N1",,,"r. balk","3500",,,,,,,"0.09","357","Nee","Ja",,"Nee","7000",,,"2024","Logisch","00","Ja","2025-01-08T00:00:00.000","2024-01-10T00:00:00.000","2014-01-08T00:00:00.000","2014-01-08T00:00:00.000",,"0",,,,,,,,,,,,,,,,,,,,,,,,,,"https://opendata.rdw.nl/resource/3huj-srit.json","https://opendata.rdw.nl/resource/8ys7-d773.json","https://opendata.rdw.nl/resource/vezc-m2t6.json","https://opendata.rdw.nl/resource/jhie-znh9.json","https://opendata.rdw.nl/resource/kmfi-hrps.json"
"VG299K","Bedrijfsauto","DODGE","DODGE RAM 1500 SLT","20241223","20131223","6099","pick-up truck","5","N.v.t.","N.v.t.","6","3605","2371","3500","2471","750",,"20131223","20131223","Geen verstrekking in Open Data","30888","Ja",,"1129",,"3500","3500",,,"4",,,,,"202","N1",,,"r. balk","3500",,"G3 gasinstallatie",,,,,"0.09","357","Nee","Ja",,"Nee","7000",,,"2023","Logisch","00","Ja","2024-12-23T00:00:00.000","2013-12-23T00:00:00.000","2013-12-23T00:00:00.000","2013-12-23T00:00:00.000",,"0",,,,,,,,,,,,,,,,,,,,,,,,,,"https://opendata.rdw.nl/resource/3huj-srit.json","https://opendata.rdw.nl/resource/8ys7-d773.json","https://opendata.rdw.nl/resource/vezc-m2t6.json","https://opendata.rdw.nl/resource/jhie-znh9.json","https://opendata.rdw.nl/resource/kmfi-hrps.json"