"kenteken","voertuigsoort","merk","handelsbenaming","vervaldatum_apk","datum_tenaamstelling","bruto_bpm","inrichting","aantal_zitplaatsen","eerste_kleur","tweede_kleur","aantal_cilinders","cilinderinhoud","massa_ledig_voertuig","toegestane_maximum_massa_voertuig","massa_rijklaar","maximum_massa_trekken_ongeremd","maximum_trekken_massa_geremd","datum_eerste_toelating","datum_eerste_tenaamstelling_in_nederland","wacht_op_keuren","catalogusprijs","wam_verzekerd","maximale_constructiesnelheid","laadvermogen","oplegger_geremd","aanhangwagen_autonoom_geremd","aanhangwagen_middenas_geremd","aantal_staanplaatsen","aantal_deuren","aantal_wielen","afstand_hart_koppeling_tot_achterzijde_voertuig","afstand_voorzijde_voertuig_tot_hart_koppeling","afwijkende_maximum_snelheid","lengte","breedte","europese_voertuigcategorie","europese_voertuigcategorie_toevoeging","europese_uitvoeringcategorie_toevoeging","plaats_chassisnummer","technische_max_massa_voertuig","type","type_gasinstallatie","typegoedkeuringsnummer","variant","uitvoering","volgnummer_wijziging_eu_typegoedkeuring","vermogen_massarijklaar","wielbasis","export_indicator","openstaande_terugroepactie_indicator","vervaldatum_tachograaf","taxi_indicator","maximum_massa_samenstelling","aantal_rolstoelplaatsen","maximum_ondersteunende_snelheid","jaar_laatste_registratie_tellerstand","tellerstandoordeel","code_toelichting_tellerstandoordeel","tenaamstellen_mogelijk","vervaldatum_apk_dt","datum_tenaamstelling_dt","datum_eerste_toelating_dt","datum_eerste_tenaamstelling_in_nederland_dt","vervaldatum_tachograaf_dt","maximum_last_onder_de_vooras_sen_tezamen_koppeling","type_remsysteem_voertuig_code","rupsonderstelconfiguratiecode","wielbasis_voertuig_minimum","wielbasis_voertuig_maximum","lengte_voertuig_minimum","lengte_voertuig_maximum","breedte_voertuig_minimum","breedte_voertuig_maximum","hoogte_voertuig","hoogte_voertuig_minimum","hoogte_voertuig_maximum","massa_bedrijfsklaar_minimaal","massa_bedrijfsklaar_maximaal","technisch_toelaatbaar_massa_koppelpunt","maximum_massa_technisch_maximaal","maximum_massa_technisch_minimaal","subcategorie_nederland","verticale_belasting_koppelpunt_getrokken_voertuig","zuinigheidsclassificatie","registratie_datum_goedkeuring_afschrijvingsmoment_bpm","registratie_datum_goedkeuring_afschrijvingsmoment_bpm_dt","gem_lading_wrde","aerodyn_voorz","massa_alt_aandr","verl_cab_ind","api_gekentekende_voertuigen_assen","api_gekentekende_voertuigen_brandstof","api_gekentekende_voertuigen_carrosserie","api_gekentekende_voertuigen_carrosserie_specifiek","api_gekentekende_voertuigen_voertuigklasse"
"V611HR","Bedrijfsauto","DFSK","K01H","20250329","20170814","3372","kipper","2","N.v.t.","N.v.t.","4","1200","1220","1855","1320","350",,"20170321","20170814","Geen verstrekking in Open Data","18316","Ja",,"635",,"750","750",,,"4",,,,,"155","N1",,,"onder voorzitting r.","1855","CLV",,,,,,"0.04","277","Nee","Nee",,"Nee",,,,"2023","Geen oordeel","05","Ja","2025-03-29T00:00:00.000","2017-08-14T00:00:00.000","2017-03-21T00:00:00.000","2017-08-14T00:00:00.000",,"0",,,,,,,,,,,,,,,,,,,,,,,,,,"https://opendata.rdw.nl/resource/3huj-srit.json","https://opendata.rdw.nl/resource/8ys7-d773.json","https://opendata.rdw.nl/resource/vezc-m2t6.json","https://opendata.rdw.nl/resource/jhie-znh9.json","https://opendata.rdw.nl/resource/kmfi-hrps.json"
"V614RS","Bedrijfsauto","DFSK","K01H","20240924","20180924","4100","kipper","2","N.v.t.","N.v.t.","4","1240","1210","1865","1310",,,"20180924","20180924","Geen verstrekking in Open Data","22234","Ja",,"655",,,,,"2","4","0","0",,"428","156","N1",,,,"1865","CLH",,"e4*2007/46*1171*00","CLH","CLH","0","0.05","276","Nee","Nee",,"Nee","0","0","0.00","2023","Logisch","00","Ja","2024-09-24T00:00:00.000","2018-09-24T00:00:00.000","2018-09-24T00:00:00.000","2018-09-24T00:00:00.000",,,,,,,,,,,"185",,,,,,,,,,,,,,,,,"https://opendata.rdw.nl/resource/3huj-srit.json","https://opendata.rdw.nl/resource/8ys7-d773.json","https://opendata.rdw.nl/resource/vezc-m2t6.json","https://opendata.rdw.nl/resource/jhie-znh9.json","https://opendata.rdw.nl/resource/kmfi-hrps.json"
"V659RS","Bedrijfsauto","DFSK","K01H","20240924","20200324","4100","kipper","2","N.v.t.","N.v.t.","4","1240","1300","1865","1400",,,"20180924","20180924","Geen verstrekking in Open Data","22234","Ja",,"565",,,,,"2","4","0","0",,"428","156","N1",,,,"1865","CLH",,"e4*2007/46*1171*00","CLH","CLH","0","0.04","276","Nee","Nee",,"Nee","0","0","0.00","2023","Logisch","00","Ja","2024-09-24T00:00:00.000","2020-03-24T00:00:00.000","2018-09-24T00:00:00.000","2018-09-24T00:00:00.000",,,,,,,,,,,"185",,,,,,,,,,,,,,,,,"https://opendata.rdw.nl/resource/3huj-srit.json","https://opendata.rdw.nl/resource/8ys7-d773.json","https://opendata.rdw.nl/resource/vezc-m2t6.json","https://opendata.rdw.nl/resource/jhie-znh9.json","https://opendata.rdw.nl/resource/kmfi-hrps.json"
"V660RS","Bedrijfsauto","DFSK","K01H","20240926","20200324","4100","kipper","2","N.v.t.","N.v.t.","4","1240","1290","1865","1390",,,"20180924","20180924","Geen verstrekking in Open Data","22234","Ja",,"575",,,,,"2","4","0","0",,"428","156","N1",,,,"1865","CLH",,"e4*2007/46*1171*00","CLH","CLH","0","0.04","276","Nee","Nee",,"Nee","0","0","0.00","2023","Logisch","00","Ja","2024-09-26T00:00:00.000","2020-03-24T00:00:00.000","2018-09-24T00:00:00.000","2018-09-24T00:00:00.000",,,,,,,,,,,"185",,,,,,,,,,,,,,,,,"https://opendata.rdw.nl/resource/3huj-srit.json","https://opendata.rdw.nl/resource/8ys7-d773.json","https://opendata.rdw.nl/resource/vezc-m2t6.json","https://opendata.rdw.nl/resource/jhie-znh9.json","https://opendata.rdw.nl/resource/kmfi-hrps.json"
"V830HR","Bedrijfsauto","DFSK","K01H","20230320","20230306","3372","kipper","2","N.v.t.","N.v.t.","4","1200","1300","1855","1400","350",,"20170320","20170814","Geen verstrekking in Open Data","18317","Ja",,"555",,"750","750",,,"4",,,,,"155","N1",,,"onder voorzitting r.","1855","CLV",,,,,,"0.04","277","Nee","Nee",,"Nee",,,,"2023","Geen oordeel","05","Ja","2023-03-20T00:00:00.000","2023-03-06T00:00:00.000","2017-03-20T00:00:00.000","2017-08-14T00:00:00.000",,"0",,,,,,,,,,,,,,,,,,,,,,,,,,"https://opendata.rdw.nl/resource/3huj-srit.json","https://opendata.rdw.nl/resource/8ys7-d773.json","https://opendata.rdw.nl/resource/vezc-m2t6.json","https://opendata.rdw.nl/resource/jhie-znh9.json","https://opendata.rdw.nl/resource/kmfi-hrps.json"
"V837BF","Bedrijfsauto","DFSK","K01H","20240919","20161203","3654","kipper","2","N.v.t.","N.v.t.","4","1200","1220","1855","1320","350",,"20160919","20161203","Geen verstrekking in Open Data","15847","Ja",,"635",,"750","750",,,"4",,,,,"156","N1",,,"r. bodemplaat by voorzitting","1855",,,,,,,"0.04","276","Nee","Nee",,"Nee",,,,"2024","Geen oordeel","05","Ja","2024-09-19T00:00:00.000","2016-12-03T00:00:00.000","2016-09-19T00:00:00.000","2016-12-03T00:00:00.000",,"0",,,,,,,,,,,,,,,,,,,,,,,,,,"https://opendata.rdw.nl/resource/3huj-srit.json","https://opendata.rdw.nl/resource/8ys7-d773.json","https://opendata.rdw.nl/resource/vezc-m2t6.json","https://opendata.rdw.nl/resource/jhie-znh9.json","https://opendata.rdw.nl/resource/kmfi-hrps.json"
"V841HR","Bedrijfsauto","DFSK","K01H","20250516","20170814","3372","kipper","2","N.v.t.","N.v.t.","4","1200","1220","1855","1320","350",,"20170516","20170814","Geen verstrekking in Open Data","18316","Ja",,"635",,"750","750",,,"4",,,,,"155","N1",,,"onder voorzitting r.","1855","CLV",,,,,,"0.04","277","Nee","Nee",,"Nee",,,,"2023","Geen oordeel","05","Ja","2025-05-16T00:00:00.000","2017-08-14T00:00:00.000","2017-05-16T00:00:00.000","2017-08-14T00:00:00.000",,"0",,,,,,,,,,,,,,,,,,,,,,,,,,"https://opendata.rdw.nl/resource/3huj-srit.json","https://opendata.rdw.nl/resource/8ys7-d773.json","https://opendata.rdw.nl/resource/vezc-m2t6.json","https://opendata.rdw.nl/resource/jhie-znh9.json","https://opendata.rdw.nl/resource/kmfi-hrps.json"
"V853HR","Bedrijfsauto","DFSK","K01H","20250329","20170814","3372","kipper","2","N.v.t.","N.v.t.","4","1200","1300","1855","1400","350",,"20170321","20170814","Geen verstrekking in Open Data","18316","Ja",,"555",,"750","750",,,"4",,,,,"155","N1",,,"onder voorzitting r.","1855","CLV",,,,,,"0.04","277","Nee","Nee",,"Nee",,,,"2023","Geen oordeel","05","Ja","2025-03-29T00:00:00.000","2017-08-14T00:00:00.000","2017-03-21T00:00:00.000","2017-08-14T00:00:00.000",,"0",,,,,,,,,,,,,,,,,,,,,,,,,,"https://opendata.rdw.nl/resource/3huj-srit.json","https://opendata.rdw.nl/resource/8ys7-d773.json","https://opendata.rdw.nl/resource/vezc-m2t6.json","https://opendata.rdw.nl/resource/jhie-znh9.json","https://opendata.rdw.nl/resource/kmfi-hrps.json"
"V953XR","Bedrijfsauto","DFSK","K01H","20250218","20190329","3806","kipper","2","N.v.t.","N.v.t.","4","1200","880","1855","980","350",,"20190218","20190329","Geen verstrekking in Open Data","20141","Ja",,"975",,"750","750",,,"4",,,,,"157","N1",,,,"1855","CLV",,,,,,"0.05","277","Nee","Nee",,"Nee",,,,"2023","Geen oordeel","05","Ja","2025-02-18T00:00:00.000","2019-03-29T00:00:00.000","2019-02-18T00:00:00.000","2019-03-29T00:00:00.000",,"0",,,,,,,,,,,,,,,,,,,,,,,,,,"https://opendata.rdw.nl/resource/3huj-srit.json","https://opendata.rdw.nl/resource/8ys7-d773.json","https://opendata.rdw.nl/resource/vezc-m2t6.json","https://opendata.rdw.nl/resource/jhie-znh9.json","https://opendata.rdw.nl/resource/kmfi-hrps.json"
"VJP67H","Bedrijfsauto","DFSK","K01H","20250315","20210315","3807","kipper","2","N.v.t.","N.v.t.","4","1240","1170","1865","1270",,,"20210315","20210315","Geen verstrekking in Open Data","20142","Ja","120","695",,,,,"2","4",,,,"428","156","N1",,,,"1865","CLH1",,,,,,"0.05","276","Nee","Nee",,"Nee",,,,"2024","Logisch","00","Ja","2025-03-15T00:00:00.000","2021-03-15T00:00:00.000","2021-03-15T00:00:00.000","2021-03-15T00:00:00.000",,,,,,,,,,,"185",,,,,,,,,,,,,,,,,"https://opendata.rdw.nl/resource/3huj-srit.json","https://opendata.rdw.nl/resource/8ys7-d773.json","https://opendata.rdw.nl/resource/vezc-m2t6.json","https://opendata.rdw.nl/resource/jhie-znh9.json","https://opendata.rdw.nl/resource/kmfi-hrps.json"
"VJP68H","Bedrijfsauto","DFSK","K01H","20250315","20210315","3807","kipper","2","N.v.t.","N.v.t.","4","1240","1170","1865","1270",,,"20210315","20210315","Geen verstrekking in Open Data","20142","Ja","120","695",,,,,"2","4",,,,"428","156","N1",,,,"1865","CLH1",,,,,,"0.05","276","Nee","Nee",,"Nee",,,,"2024","Logisch","00","Ja","2025-03-15T00:00:00.000","2021-03-15T00:00:00.000","2021-03-15T00:00:00.000","2021-03-15T00:00:00.000",,,,,,,,,,,"185",,,,,,,,,,,,,,,,,"https://opendata.rdw.nl/resource/3huj-srit.json","https://opendata.rdw.nl/resource/8ys7-d773.json","https://opendata.rdw.nl/resource/vezc-m2t6.json","https://opendata.rdw.nl/resource/jhie-znh9.json","https://opendata.rdw.nl/resource/kmfi-hrps.json"
"VK176V","Bedrijfsauto","DFSK","K01H","20240713","20230715","4677","kipper","2","N.v.t.","N.v.t.","4","1310","1120","1865","1220",,,"20141115","20141115","Geen verstrekking in Open Data","15810","Ja",,"745",,,,,"2","4","0","0",,"0","156","N1",,,"r. bodemplaat by voorzitting","1865","CLV",,"e4*2007/46*0464*05","CLH","B","0","0.05","276","Nee","Nee",,"Nee","0","0","0.00","2023","Niet geregistreerd","NG","Ja","2024-07-13T00:00:00.000","2023-07-15T00:00:00.000","2014-11-15T00:00:00.000","2014-11-15T00:00:00.000",,"0",,,,,,,,,,,,,,,,,,,,,,,,,,"https://opendata.rdw.nl/resource/3huj-srit.json","https://opendata.rdw.nl/resource/8ys7-d773.json","https://opendata.rdw.nl/resource/vezc-m2t6.json","https://opendata.rdw.nl/resource/jhie-znh9.json","https://opendata.rdw.nl/resource/kmfi-hrps.json"
"VK437S","Bedrijfsauto","DFSK","K01H","20250228","20220316","4573","kipper","2","N.v.t.","N.v.t.","4","1310","1120","1865","1220",,,"20141208","20141208","Geen verstrekking in Open Data","15535","Ja",,"745",,,,,"2","4","0","0",,"0","156","N1",,,"r. bodemplaat by voorzitting","1865","CLV",,"e4*2007/46*0464*05","CLH","B","0","0.05","276","Nee","Nee",,"Nee","0","0","0.00","2024","Logisch","00","Ja","2025-02-28T00:00:00.000","2022-03-16T00:00:00.000","2014-12-08T00:00:00.000","2014-12-08T00:00:00.000",,"0",,,,,,,,,,,,,,,,,,,,,,,,,,"https://opendata.rdw.nl/resource/3huj-srit.json","https://opendata.rdw.nl/resource/8ys7-d773.json","https://opendata.rdw.nl/resource/vezc-m2t6.json","https://opendata.rdw.nl/resource/jhie-znh9.json","https://opendata.rdw.nl/resource/kmfi-hrps.json"
"VK438S","Bedrijfsauto","DFSK","K01H","20241120","20231122","3629","kipper","2","N.v.t.","N.v.t.","4","1310","1220","1865","1320",,,"20141113","20141113","Geen verstrekking in Open Data","13030","Ja",,"645",,,,,"2","4","0","0",,"0","151","N1",,,"r. bodemplaat by voorzitting","1865","CLV",,"e4*2007/46*0464*05","CLH","B","0","0.04","276","Nee","Nee",,"Nee","0","0","0.00","2023","Logisch","00","Ja","2024-11-20T00:00:00.000","2023-11-22T00:00:00.000","2014-11-13T00:00:00.000","2014-11-13T00:00:00.000",,"0",,,,,,,,,,,,,,,,,,,,,,,,,,"https://opendata.rdw.nl/resource/3huj-srit.json","https://opendata.rdw.nl/resource/8ys7-d773.json","https://opendata.rdw.nl/resource/vezc-m2t6.json","https://opendata.rdw.nl/resource/jhie-znh9.json","https://opendata.rdw.nl/resource/kmfi-hrps.json"
"VL610Z","Bedrijfsauto","DFSK","K01H","20250304","20150304","4573","kipper","2","N.v.t.","N.v.t.","4","1310","1120","1865","1220",,,"20150304","20150304","Geen verstrekking in Open Data","15535","Ja",,"745",,,,,"2","4","0","0",,"0","156","N1",,,"r. bodemplaat by voorzitting","1865","CLV",,"e4*2007/46*0464*05","CLH","B","0","0.05","276","Nee","Nee",,"Nee","0","0","0.00","2024","Logisch","00","Ja","2025-03-04T00:00:00.000","2015-03-04T00:00:00.000","2015-03-04T00:00:00.000","2015-03-04T00:00:00.000",,"0",,,,,,,,,,,,,,,,,,,,,,,,,,"https://opendata.rdw.nl/resource/3huj-srit.json","https://opendata.rdw.nl/resource/8ys7-d773.json","https://opendata.rdw.nl/resource/vezc-m2t6.json","https://opendata.rdw.nl/resource/jhie-znh9.json","https://opendata.rdw.nl/resource/kmfi-hrps.json"
"VLZ22J","Bedrijfsauto","DFSK","K01H","20241202","20211202","4278","kipper","2","N.v.t.","N.v.t.","4","1240","858","1865","958",,,"20211202","20211202","Geen verstrekking in Open Data","22126","Ja","120","1007",,,,,"2","4",,,,"428","156","N1",,,,"1865","CLH1",,,,,,"0.07","276","Nee","Nee",,"Nee",,,,"2021","Logisch","00","Ja","2024-12-02T00:00:00.000","2021-12-02T00:00:00.000","2021-12-02T00:00:00.000","2021-12-02T00:00:00.000",,,,,,,,,,,"185",,,,,,,,,,,"20211213","2021-12-13T00:00:00.000",,,,,"https://opendata.rdw.nl/resource/3huj-srit.json","https://opendata.rdw.nl/resource/8ys7-d773.json","https://opendata.rdw.nl/resource/vezc-m2t6.json","https://opendata.rdw.nl/resource/jhie-znh9.json","https://opendata.rdw.nl/resource/kmfi-hrps.json"
"VN582P","Bedrijfsauto","DFSK","K01H","20250509","20210915","4743","kipper","2","N.v.t.","N.v.t.","4","1310","1120","1865","1220",,,"20150507","20150507","Geen verstrekking in Open Data","24085","Ja",,"745",,,,,,"4",,,,,"156","N1",,,"r. bodemplaat by voorzitting","1865","CLV",,,,,,"0.05","276","Nee","Nee",,"Nee",,,,"2024","Onlogisch","04","Ja","2025-05-09T00:00:00.000","2021-09-15T00:00:00.000","2015-05-07T00:00:00.000","2015-05-07T00:00:00.000",,"0",,,,,,,,,,,,,,,,,,,,,,,,,,"https://opendata.rdw.nl/resource/3huj-srit.json","https://opendata.rdw.nl/resource/8ys7-d773.json","https://opendata.rdw.nl/resource/vezc-m2t6.json","https://opendata.rdw.nl/resource/jhie-znh9.json","https://opendata.rdw.nl/resource/kmfi-hrps.json"
"VP430H","Bedrijfsauto","DFSK","K01H","20190917","20231129","5120","kipper","2","N.v.t.","N.v.t.","4","1310","1100","1865","1200",,,"20150617","20150617","Geen verstrekking in Open Data","25672","Ja",,"765",,,,,,"4",,,,,"158","N1",,,"r. bodemplaat by voorzitting","1865","CLV",,,,,,"0.05","276","Nee","Nee",,"Nee",,,,"2023","Logisch","00","Ja","2019-09-17T00:00:00.000","2023-11-29T00:00:00.000","2015-06-17T00:00:00.000","2015-06-17T00:00:00.000",,"0",,,,,,,,,,,,,,,,,,,,,,,,,,"https://opendata.rdw.nl/resource/3huj-srit.json","https://opendata.rdw.nl/resource/8ys7-d773.json","https://opendata.rdw.nl/resource/vezc-m2t6.json","https://opendata.rdw.nl/resource/jhie-znh9.json","https://opendata.rdw.nl/resource/kmfi-hrps.json"
"VP748Z","Bedrijfsauto","DFSK","K01H","20250418","20200817","4950","kipper","2","N.v.t.","N.v.t.","4","1310","1101","1865","1201",,,"20170719","20170719","Geen verstrekking in Open Data","25881","Ja",,"764",,,,,,"4",,,,,"157","N1",,,"r. bodemplaat by voorzitting","1865","CLV",,,,,,"0.05","276","Nee","Nee",,"Nee",,,,"2023","Logisch","00","Ja","2025-04-18T00:00:00.000","2020-08-17T00:00:00.000","2017-07-19T00:00:00.000","2017-07-19T00:00:00.000",,,,,,,,,,,,,,,,,,,,,,,,,,,,"https://opendata.rdw.nl/resource/3huj-srit.json","https://opendata.rdw.nl/resource/8ys7-d773.json","https://opendata.rdw.nl/resource/vezc-m2t6.json","https://opendata.rdw.nl/resource/jhie-znh9.json","https://opendata.rdw.nl/resource/kmfi-hrps.json"
"VP790K","Bedrijfsauto","DFSK","K01H","20250611",,"3386","kipper","2","N.v.t.","N.v.t.","4","1012","1100","1855","1200",,,"20150611","20150611","Geen verstrekking in Open Data","18372","Ja",,"755",,,,,"2","4","0","0",,"0","158","N1",,,"r. bodemplaat by voorzitting","1855","CLV",,"e4*2007/46*0464*05","CLH","A","0","0.03","276","Nee","Nee",,"Nee","0","0","0.00","2024","Logisch","00","Ja","2025-06-11T00:00:00.000",,"2015-06-11T00:00:00.000","2015-06-11T00:00:00.000",,"0",,,,,,,,,,,,,,,,,,,,,,,,,,"https://opendata.rdw.nl/resource/3huj-srit.json","https://opendata.rdw.nl/resource/8ys7-d773.json","https://opendata.rdw.nl/resource/vezc-m2t6.json","https://opendata.rdw.nl/resource/jhie-znh9.json","https://opendata.rdw.nl/resource/kmfi-hrps.json"
"VR058K","Bedrijfsauto","DFSK","K01H","20250131","20190110","6506","kipper","2","N.v.t.","N.v.t.","4","1310","1100","1865","1200",,,"20150917","20150917","Geen verstrekking in Open Data","24958","Ja",,"765",,,,,,"4",,,,,"156","N1",,,"r. bodemplaat by voorzitting","1865","CLV",,,,,,"0.05","276","Nee","Nee",,"Nee",,,,"2023","Onlogisch","04","Ja","2025-01-31T00:00:00.000","2019-01-10T00:00:00.000","2015-09-17T00:00:00.000","2015-09-17T00:00:00.000",,"0",,,,,,,,,,,,,,,,,,,,,,,,,,"https://opendata.rdw.nl/resource/3huj-srit.json","https://opendata.rdw.nl/resource/8ys7-d773.json","https://opendata.rdw.nl/resource/vezc-m2t6.json","https://opendata.rdw.nl/resource/jhie-znh9.json","https://opendata.rdw.nl/resource/kmfi-hrps.json"
"VR081K","Bedrijfsauto","DFSK","K01H","20250214","20230304","6676","kipper","2","N.v.t.","N.v.t.","4","1310","1100","1865","1200",,,"20151209","20151209","Geen verstrekking in Open Data","25672","Ja",,"765",,,,,,"4",,,,,"156","N1",,,"r. bodemplaat by voorzitting","1865","CLV",,,,,,"0.05","276","Nee","Nee",,"Nee",,,,"2024","Logisch","00","Ja","2025-02-14T00:00:00.000","2023-03-04T00:00:00.000","2015-12-09T00:00:00.000","2015-12-09T00:00:00.000",,"0",,,,,,,,,,,,,,,,,,,,,,,,,,"https://opendata.rdw.nl/resource/3huj-srit.json","https://opendata.rdw.nl/resource/8ys7-d773.json","https://opendata.rdw.nl/resource/vezc-m2t6.json","https://opendata.rdw.nl/resource/jhie-znh9.json","https://opendata.rdw.nl/resource/kmfi-hrps.json"
"VR121B","Bedrijfsauto","DFSK","K01H","20250418","20190426","4950","kipper","2","N.v.t.","N.v.t.","4","1310","1100","1865","1200",,,"20150917","20150917","Geen verstrekking in Open Data","25881","Ja",,"765",,,,,,"4",,,,,"157","N1",,,"r. bodemplaat by voorzitting","1865","CLV","G2 gasinstallatie",,,,,"0.05","276","Nee","Nee",,"Nee",,,,"2024","Logisch","00","Ja","2025-04-18T00:00:00.000","2019-04-26T00:00:00.000","2015-09-17T00:00:00.000","2015-09-17T00:00:00.000",,"0",,,,,,,,,,,,,,,,,,,,,,,,,,"https://opendata.rdw.nl/resource/3huj-srit.json","https://opendata.rdw.nl/resource/8ys7-d773.json","https://opendata.rdw.nl/resource/vezc-m2t6.json","https://opendata.rdw.nl/resource/jhie-znh9.json","https://opendata.rdw.nl/resource/kmfi-hrps.json"
"VS220D","Bedrijfsauto","DFSK","K01H","20241203","20181015","5120","kipper","2","N.v.t.","N.v.t.","4","1310","1100","1865","1200",,,"20151203","20151203","Geen verstrekking in Open Data","25672","Ja",,"765",,,,,,"4",,,,,"156","N1",,,"r. bodemplaat by voorzitting","1865","CLV","G2 gasinstallatie",,,,,"0.05","276","Nee","Nee",,"Nee",,,,"2023","Logisch","00","Ja","2024-12-03T00:00:00.000","2018-10-15T00:00:00.000","2015-12-03T00:00:00.000","2015-12-03T00:00:00.000",,"0",,,,,,,,,,,,,,,,,,,,,,,,,,"https://opendata.rdw.nl/resource/3huj-srit.json","https://opendata.rdw.nl/resource/8ys7-d773.json","https://opendata.rdw.nl/resource/vezc-m2t6.json","https://opendata.rdw.nl/resource/jhie-znh9.json","https://opendata.rdw.nl/resource/kmfi-hrps.json"
"VS629D","Bedrijfsauto","DFSK","K01H","20241008","20151214","4950","kipper","2","N.v.t.","N.v.t.","4","1310","1100","1865","1200",,,"20151214","20151214","Geen verstrekking in Open Data","24958","Ja",,"765",,,,,,"4",,,,,"156","N1",,,"r. bodemplaat by voorzitting","1865","CLV","G2 gasinstallatie",,,,,"0.05","276","Nee","Nee",,"Nee",,,,"2023","Logisch","00","Ja","2024-10-08T00:00:00.000","2015-12-14T00:00:00.000","2015-12-14T00:00:00.000","2015-12-14T00:00:00.000",,"0",,,,,,,,,,,,,,,,,,,,,,,,,,"https://opendata.rdw.nl/resource/3huj-srit.json","https://opendata.rdw.nl/resource/8ys7-d773.json","https://opendata.rdw.nl/resource/vezc-m2t6.json","https://opendata.rdw.nl/resource/jhie-znh9.json","https://opendata.rdw.nl/resource/kmfi-hrps.json"
"VS632H","Bedrijfsauto","DFSK","K01H","20250417","20170210","3706","kipper","2","N.v.t.","N.v.t.","4","1310","858","1865","958",,,"20150404","20170210","Geen verstrekking in Open Data","19720","Ja",,"1007",,,,,"2","4","0","0",,"0","156","N1",,,"r. bodemplaat by voorzitting","1865","CLV",,"e4*2007/46*0464*05","CLH","B","0","0.06","276","Nee","Nee",,"Nee","0","0","0.00","2024","Geen oordeel","05","Ja","2025-04-17T00:00:00.000","2017-02-10T00:00:00.000","2015-04-04T00:00:00.000","2017-02-10T00:00:00.000",,"0",,,,,,,,,,,,,,,,,,,,,,,,,,"https://opendata.rdw.nl/resource/3huj-srit.json","https://opendata.rdw.nl/resource/8ys7-d773.json","https://opendata.rdw.nl/resource/vezc-m2t6.json","https://opendata.rdw.nl/resource/jhie-znh9.json","https://opendata.rdw.nl/resource/kmfi-hrps.json"
"VT837V","Bedrijfsauto","DFSK","K01H","20220409","20211029","5147","kipper","2","N.v.t.","N.v.t.","4","1310","1160","1865","1260",,,"20160403","20160403","Geen verstrekking in Open Data","25784","Nee",,"705",,,,,"2","4","0","0",,"428","156","N1",,,"in motorruimte r.","1865","CLV",,"e4*2007/46*0464*05","CLH","B","0","0.05","276","Nee","Nee",,"Nee","0","0","0.00","2021","Logisch","00","Ja","2022-04-09T00:00:00.000","2021-10-29T00:00:00.000","2016-04-03T00:00:00.000","2016-04-03T00:00:00.000",,,,,,,,,,,"183",,,,,,,,,,,,,,,,,"https://opendata.rdw.nl/resource/3huj-srit.json","https://opendata.rdw.nl/resource/8ys7-d773.json","https://opendata.rdw.nl/resource/vezc-m2t6.json","https://opendata.rdw.nl/resource/jhie-znh9.json","https://opendata.rdw.nl/resource/kmfi-hrps.json"
"VV025V","Bedrijfsauto","DFSK","K01H","20240714","20170626","5120","kipper","2","N.v.t.","N.v.t.","4","1310","1000","1865","1100",,,"20160916","20160916","Geen verstrekking in Open Data","25672","Ja",,"865",,,,,,"4",,,,,"156","N1",,,"r. bodemplaat by voorzitting","1865","CLV",,,,,,"0.05","276","Nee","Nee",,"Nee",,,,"2023","Logisch","00","Ja","2024-07-14T00:00:00.000","2017-06-26T00:00:00.000","2016-09-16T00:00:00.000","2016-09-16T00:00:00.000",,"0",,,,,,,,,,,,,,,,,,,,,,,,,,"https://opendata.rdw.nl/resource/3huj-srit.json","https://opendata.rdw.nl/resource/8ys7-d773.json","https://opendata.rdw.nl/resource/vezc-m2t6.json","https://opendata.rdw.nl/resource/jhie-znh9.json","https://opendata.rdw.nl/resource/kmfi-hrps.json"