"kenteken","voertuigsoort","merk","handelsbenaming","vervaldatum_apk","datum_tenaamstelling","bruto_bpm","inrichting","aantal_zitplaatsen","eerste_kleur","tweede_kleur","aantal_cilinders","cilinderinhoud","massa_ledig_voertuig","toegestane_maximum_massa_voertuig","massa_rijklaar","maximum_massa_trekken_ongeremd","maximum_trekken_massa_geremd","datum_eerste_toelating","datum_eerste_tenaamstelling_in_nederland","wacht_op_keuren","catalogusprijs","wam_verzekerd","maximale_constructiesnelheid","laadvermogen","oplegger_geremd","aanhangwagen_autonoom_geremd","aanhangwagen_middenas_geremd","aantal_staanplaatsen","aantal_deuren","aantal_wielen","afstand_hart_koppeling_tot_achterzijde_voertuig","afstand_voorzijde_voertuig_tot_hart_koppeling","afwijkende_maximum_snelheid","lengte","breedte","europese_voertuigcategorie","europese_voertuigcategorie_toevoeging","europese_uitvoeringcategorie_toevoeging","plaats_chassisnummer","technische_max_massa_voertuig","type","type_gasinstallatie","typegoedkeuringsnummer","variant","uitvoering","volgnummer_wijziging_eu_typegoedkeuring","vermogen_massarijklaar","wielbasis","export_indicator","openstaande_terugroepactie_indicator","vervaldatum_tachograaf","taxi_indicator","maximum_massa_samenstelling","aantal_rolstoelplaatsen","maximum_ondersteunende_snelheid","jaar_laatste_registratie_tellerstand","tellerstandoordeel","code_toelichting_tellerstandoordeel","tenaamstellen_mogelijk","vervaldatum_apk_dt","datum_tenaamstelling_dt","datum_eerste_toelating_dt","datum_eerste_tenaamstelling_in_nederland_dt","vervaldatum_tachograaf_dt","maximum_last_onder_de_vooras_sen_tezamen_koppeling","type_remsysteem_voertuig_code","rupsonderstelconfiguratiecode","wielbasis_voertuig_minimum","wielbasis_voertuig_maximum","lengte_voertuig_minimum","lengte_voertuig_maximum","breedte_voertuig_minimum","breedte_voertuig_maximum","hoogte_voertuig","hoogte_voertuig_minimum","hoogte_voertuig_maximum","massa_bedrijfsklaar_minimaal","massa_bedrijfsklaar_maximaal","technisch_toelaatbaar_massa_koppelpunt","maximum_massa_technisch_maximaal","maximum_massa_technisch_minimaal","subcategorie_nederland","verticale_belasting_koppelpunt_getrokken_voertuig","zuinigheidsclassificatie","registratie_datum_goedkeuring_afschrijvingsmoment_bpm","registratie_datum_goedkeuring_afschrijvingsmoment_bpm_dt","gem_lading_wrde","aerodyn_voorz","massa_alt_aandr","verl_cab_ind","api_gekentekende_voertuigen_assen","api_gekentekende_voertuigen_brandstof","api_gekentekende_voertuigen_carrosserie","api_gekentekende_voertuigen_carrosserie_specifiek","api_gekentekende_voertuigen_voertuigklasse"
"V307FV","Bedrijfsauto","DFSK","V22","20250417","20231122","4468","open laadvloer","5","N.v.t.","N.v.t.","4","1310","1064","1960","1164",,,"20170412","20170412","Geen verstrekking in Open Data","22621","Ja",,"896",,,,,,"4",,,,,"164","N1",,,"r. balk by vooras","1960","CV21",,,,,,"0.05","282","Nee","Nee",,"Nee",,,,"2023","Logisch","00","Ja","2025-04-17T00:00:00.000","2023-11-22T00:00:00.000","2017-04-12T00:00:00.000","2017-04-12T00:00:00.000",,"0",,,,,,,,,,,,,,,,,,,,,,,,,,"https://opendata.rdw.nl/resource/3huj-srit.json","https://opendata.rdw.nl/resource/8ys7-d773.json","https://opendata.rdw.nl/resource/vezc-m2t6.json","https://opendata.rdw.nl/resource/jhie-znh9.json","https://opendata.rdw.nl/resource/kmfi-hrps.json"
"VK190K","Bedrijfsauto","DFSK","V22","20221130","20240220","4930","kipper","5","N.v.t.","N.v.t.","4","1310","1120","1960","1220",,,"20140922","20140922","Geen verstrekking in Open Data","16480","Ja",,"840",,,,,"4","4","0","0",,"464","164","N1",,,"r. balk by vooras","1960","CV21",,"e4*2007/46*0437*03","CV22","B","0","0.05","282","Nee","Nee",,"Nee","0","0","0.00","2024","Logisch","00","Ja","2022-11-30T00:00:00.000","2024-02-20T00:00:00.000","2014-09-22T00:00:00.000","2014-09-22T00:00:00.000",,"0",,,,,,,,,,,,,,,,,,,,,,,,,,"https://opendata.rdw.nl/resource/3huj-srit.json","https://opendata.rdw.nl/resource/8ys7-d773.json","https://opendata.rdw.nl/resource/vezc-m2t6.json","https://opendata.rdw.nl/resource/jhie-znh9.json","https://opendata.rdw.nl/resource/kmfi-hrps.json"
"VK191K","Bedrijfsauto","DFSK","V22","20231220","20230524","4930","kipper","5","N.v.t.","N.v.t.","4","1310","1120","1960","1220",,,"20140922","20140922","Geen verstrekking in Open Data","16480","Ja",,"840",,,,,"4","4","0","0",,"464","164","N1",,,"r. balk by vooras","1960","CV21",,"e4*2007/46*0437*03","CV22","B","0","0.05","282","Nee","Nee",,"Nee","0","0","0.00","2022","Logisch","00","Ja","2023-12-20T00:00:00.000","2023-05-24T00:00:00.000","2014-09-22T00:00:00.000","2014-09-22T00:00:00.000",,"0",,,,,,,,,,,,,,,,,,,,,,,,,,"https://opendata.rdw.nl/resource/3huj-srit.json","https://opendata.rdw.nl/resource/8ys7-d773.json","https://opendata.rdw.nl/resource/vezc-m2t6.json","https://opendata.rdw.nl/resource/jhie-znh9.json","https://opendata.rdw.nl/resource/kmfi-hrps.json"
"VK494S","Bedrijfsauto","DFSK","V22","20241230","20200107","5309","kipper","5","N.v.t.","N.v.t.","4","1310","1120","1960","1220",,,"20141220","20141220","Geen verstrekking in Open Data","17485","Ja",,"840",,,,,"0","4","0","0",,"464","164","N1",,,"r. balk by vooras","1960","CV21",,"e4*2007/46*0437*01","CV22","B","0","0.05","282","Nee","Nee",,"Nee","0","0",,"2023","Logisch","00","Ja","2024-12-30T00:00:00.000","2020-01-07T00:00:00.000","2014-12-20T00:00:00.000","2014-12-20T00:00:00.000",,"0",,,,,,,,,,,,,,,,,,,,,,,,,,"https://opendata.rdw.nl/resource/3huj-srit.json","https://opendata.rdw.nl/resource/8ys7-d773.json","https://opendata.rdw.nl/resource/vezc-m2t6.json","https://opendata.rdw.nl/resource/jhie-znh9.json","https://opendata.rdw.nl/resource/kmfi-hrps.json"
"VN932X","Bedrijfsauto","DFSK","V22","20201011","20200207","5243","kipper","5","N.v.t.","N.v.t.","4","1310","1320","1960","1420",,,"20150518","20150518","Geen verstrekking in Open Data","17310","Ja",,"640",,,,,"4","4","0","0",,"464","164","N1",,,"r. balk by vooras","1960","CV21",,"e4*2007/46*0437*03","CV22","B","0","0.04","282","Nee","Nee",,"Nee","0","0","0.00","2020","Logisch","00","Ja","2020-10-11T00:00:00.000","2020-02-07T00:00:00.000","2015-05-18T00:00:00.000","2015-05-18T00:00:00.000",,"0",,,,,,,,,,,,,,,,,,,,,,,,,,"https://opendata.rdw.nl/resource/3huj-srit.json","https://opendata.rdw.nl/resource/8ys7-d773.json","https://opendata.rdw.nl/resource/vezc-m2t6.json","https://opendata.rdw.nl/resource/jhie-znh9.json","https://opendata.rdw.nl/resource/kmfi-hrps.json"
"VP746Z","Bedrijfsauto","DFSK","V22","20241121","20160602","5516","kipper","5","N.v.t.","N.v.t.","4","1310","1280","1960","1380",,,"20150917","20150917","Geen verstrekking in Open Data","28345","Ja",,"680",,,,,,"4",,,,,"164","N1",,,"r. balk by vooras","1960","CV21","G2 gasinstallatie",,,,,"0.04","282","Nee","Nee",,"Nee",,,,"2023","Logisch","00","Ja","2024-11-21T00:00:00.000","2016-06-02T00:00:00.000","2015-09-17T00:00:00.000","2015-09-17T00:00:00.000",,"0",,,,,,,,,,,,,,,,,,,,,,,,,,"https://opendata.rdw.nl/resource/3huj-srit.json","https://opendata.rdw.nl/resource/8ys7-d773.json","https://opendata.rdw.nl/resource/vezc-m2t6.json","https://opendata.rdw.nl/resource/jhie-znh9.json","https://opendata.rdw.nl/resource/kmfi-hrps.json"
"VP749Z","Bedrijfsauto","DFSK","V22","20240824","20190802","5516","kipper","5","N.v.t.","N.v.t.","4","1310","1280","1960","1380",,,"20161221","20161221","Geen verstrekking in Open Data","28345","Ja",,"680",,,,,,"4",,,,,"164","N1",,,"r. balk by vooras","1960","CV21",,,,,,"0.04","282","Nee","Nee",,"Nee",,,,"2023","Logisch","00","Ja","2024-08-24T00:00:00.000","2019-08-02T00:00:00.000","2016-12-21T00:00:00.000","2016-12-21T00:00:00.000",,"0",,,,,,,,,,,,,,,,,,,,,,,,,,"https://opendata.rdw.nl/resource/3huj-srit.json","https://opendata.rdw.nl/resource/8ys7-d773.json","https://opendata.rdw.nl/resource/vezc-m2t6.json","https://opendata.rdw.nl/resource/jhie-znh9.json","https://opendata.rdw.nl/resource/kmfi-hrps.json"
"VR043K","Bedrijfsauto","DFSK","V22","20241221","20170711","5516","kipper","5","N.v.t.","N.v.t.","4","1310","1280","1960","1380",,,"20151209","20151209","Geen verstrekking in Open Data","27338","Ja",,"680",,,,,,"4",,,,,"162","N1",,,"r. balk by vooras","1960","CV21",,,,,,"0.04","282","Nee","Nee",,"Nee",,,,"2024","Logisch","00","Ja","2024-12-21T00:00:00.000","2017-07-11T00:00:00.000","2015-12-09T00:00:00.000","2015-12-09T00:00:00.000",,"0",,,,,,,,,,,,,,,,,,,,,,,,,,"https://opendata.rdw.nl/resource/3huj-srit.json","https://opendata.rdw.nl/resource/8ys7-d773.json","https://opendata.rdw.nl/resource/vezc-m2t6.json","https://opendata.rdw.nl/resource/jhie-znh9.json","https://opendata.rdw.nl/resource/kmfi-hrps.json"
"VR105B","Bedrijfsauto","DFSK","V22","20241119","20181218","5516","kipper","5","N.v.t.","N.v.t.","4","1310","1280","1960","1380",,,"20160926","20160926","Geen verstrekking in Open Data","27338","Ja",,"680",,,,,,"4",,,,,"164","N1",,,"r. balk by vooras","1960","CV21","G2 gasinstallatie",,,,,"0.04","282","Nee","Nee",,"Nee",,,,"2023","Onlogisch","04","Ja","2024-11-19T00:00:00.000","2018-12-18T00:00:00.000","2016-09-26T00:00:00.000","2016-09-26T00:00:00.000",,"0",,,,,,,,,,,,,,,,,,,,,,,,,,"https://opendata.rdw.nl/resource/3huj-srit.json","https://opendata.rdw.nl/resource/8ys7-d773.json","https://opendata.rdw.nl/resource/vezc-m2t6.json","https://opendata.rdw.nl/resource/jhie-znh9.json","https://opendata.rdw.nl/resource/kmfi-hrps.json"
"VR106B","Bedrijfsauto","DFSK","V22","20240601","20171024","5516","kipper","5","N.v.t.","N.v.t.","4","1310","1280","1960","1380",,,"20151203","20151203","Geen verstrekking in Open Data","28345","Ja",,"680",,,,,,"4",,,,,"164","N1",,,"r. balk by vooras","1960","CV21","G2 gasinstallatie",,,,,"0.04","282","Nee","Nee",,"Nee",,,,"2023","Logisch","00","Ja","2024-06-01T00:00:00.000","2017-10-24T00:00:00.000","2015-12-03T00:00:00.000","2015-12-03T00:00:00.000",,"0",,,,,,,,,,,,,,,,,,,,,,,,,,"https://opendata.rdw.nl/resource/3huj-srit.json","https://opendata.rdw.nl/resource/8ys7-d773.json","https://opendata.rdw.nl/resource/vezc-m2t6.json","https://opendata.rdw.nl/resource/jhie-znh9.json","https://opendata.rdw.nl/resource/kmfi-hrps.json"
"VR108B","Bedrijfsauto","DFSK","V22","20240802","20201117","5516","kipper","5","N.v.t.","N.v.t.","4","1310","1280","1960","1380",,,"20170719","20170719","Geen verstrekking in Open Data","28345","Ja",,"680",,,,,,"4",,,,,"164","N1",,,"r. balk by vooras","1960","CV21","G2 gasinstallatie",,,,,"0.04","282","Nee","Nee",,"Nee",,,,"2023","Logisch","00","Ja","2024-08-02T00:00:00.000","2020-11-17T00:00:00.000","2017-07-19T00:00:00.000","2017-07-19T00:00:00.000",,"0",,,,,,,,,,,,,,,,,,,,,,,,,,"https://opendata.rdw.nl/resource/3huj-srit.json","https://opendata.rdw.nl/resource/8ys7-d773.json","https://opendata.rdw.nl/resource/vezc-m2t6.json","https://opendata.rdw.nl/resource/jhie-znh9.json","https://opendata.rdw.nl/resource/kmfi-hrps.json"
"VS223D","Bedrijfsauto","DFSK","V22","20250223","20230408","5516","kipper","5","N.v.t.","N.v.t.","4","1310","1280","1960","1380",,,"20161125","20161125","Geen verstrekking in Open Data","27338","Ja",,"680",,,,,,"4",,,,,"164","N1",,,"r. balk by vooras","1960","CV21","G2 gasinstallatie",,,,,"0.04","282","Nee","Nee",,"Nee",,,,"2024","Logisch","00","Ja","2025-02-23T00:00:00.000","2023-04-08T00:00:00.000","2016-11-25T00:00:00.000","2016-11-25T00:00:00.000",,"0",,,,,,,,,,,,,,,,,,,,,,,,,,"https://opendata.rdw.nl/resource/3huj-srit.json","https://opendata.rdw.nl/resource/8ys7-d773.json","https://opendata.rdw.nl/resource/vezc-m2t6.json","https://opendata.rdw.nl/resource/jhie-znh9.json","https://opendata.rdw.nl/resource/kmfi-hrps.json"
"VS225D","Bedrijfsauto","DFSK","V22","20241123","20240322","5516","kipper","5","N.v.t.","N.v.t.","4","1310","1280","1960","1380",,,"20181123","20181123","Geen verstrekking in Open Data","27338","Ja",,"680",,,,,,"4",,,,,"164","N1",,,"r. balk by vooras","1960","CV21","G2 gasinstallatie",,,,,"0.04","282","Nee","Nee",,"Nee",,,,"2024","Logisch","00","Ja","2024-11-23T00:00:00.000","2024-03-22T00:00:00.000","2018-11-23T00:00:00.000","2018-11-23T00:00:00.000",,"0",,,,,,,,,,,,,,,,,,,,,,,,,,"https://opendata.rdw.nl/resource/3huj-srit.json","https://opendata.rdw.nl/resource/8ys7-d773.json","https://opendata.rdw.nl/resource/vezc-m2t6.json","https://opendata.rdw.nl/resource/jhie-znh9.json","https://opendata.rdw.nl/resource/kmfi-hrps.json"
"VS228D","Bedrijfsauto","DFSK","V22","20241009","20231026","5516","kipper","5","N.v.t.","N.v.t.","4","1310","1280","1960","1380",,,"20161107","20161107","Geen verstrekking in Open Data","27338","Ja",,"680",,,,,,"4",,,,,"164","N1",,,"r. balk by vooras","1960","CV21",,,,,,"0.04","282","Nee","Nee",,"Nee",,,,"2023","Logisch","00","Ja","2024-10-09T00:00:00.000","2023-10-26T00:00:00.000","2016-11-07T00:00:00.000","2016-11-07T00:00:00.000",,"0",,,,,,,,,,,,,,,,,,,,,,,,,,"https://opendata.rdw.nl/resource/3huj-srit.json","https://opendata.rdw.nl/resource/8ys7-d773.json","https://opendata.rdw.nl/resource/vezc-m2t6.json","https://opendata.rdw.nl/resource/jhie-znh9.json","https://opendata.rdw.nl/resource/kmfi-hrps.json"
"VS274D","Bedrijfsauto","DFSK","V22","20231125","20230713","5516","kipper","5","N.v.t.","N.v.t.","4","1310","1280","1960","1380",,,"20161125","20161125","Geen verstrekking in Open Data","27338","Ja",,"680",,,,,,"4",,,,,"164","N1",,,"r. balk by vooras","1960","CV21","G2 gasinstallatie",,,,,"0.04","282","Nee","Nee",,"Nee",,,,"2023","Logisch","00","Ja","2023-11-25T00:00:00.000","2023-07-13T00:00:00.000","2016-11-25T00:00:00.000","2016-11-25T00:00:00.000",,"0",,,,,,,,,,,,,,,,,,,,,,,,,,"https://opendata.rdw.nl/resource/3huj-srit.json","https://opendata.rdw.nl/resource/8ys7-d773.json","https://opendata.rdw.nl/resource/vezc-m2t6.json","https://opendata.rdw.nl/resource/jhie-znh9.json","https://opendata.rdw.nl/resource/kmfi-hrps.json"
"VS627D","Bedrijfsauto","DFSK","V22","20241125","20240222","5516","kipper","5","N.v.t.","N.v.t.","4","1310","1280","1960","1380",,,"20161125","20161125","Geen verstrekking in Open Data","27338","Ja",,"680",,,,,,"4",,,,,"164","N1",,,"r. balk by vooras","1960","CV21","G2 gasinstallatie",,,,,"0.04","282","Nee","Nee",,"Nee",,,,"2024","Logisch","00","Ja","2024-11-25T00:00:00.000","2024-02-22T00:00:00.000","2016-11-25T00:00:00.000","2016-11-25T00:00:00.000",,"0",,,,,,,,,,,,,,,,,,,,,,,,,,"https://opendata.rdw.nl/resource/3huj-srit.json","https://opendata.rdw.nl/resource/8ys7-d773.json","https://opendata.rdw.nl/resource/vezc-m2t6.json","https://opendata.rdw.nl/resource/jhie-znh9.json","https://opendata.rdw.nl/resource/kmfi-hrps.json"
"VV812D","Bedrijfsauto","DFSK","V22","20241012","20240203","3976","open laadvloer","5","N.v.t.","N.v.t.","4","1310","1064","1960","1164",,,"20160331","20160331","Geen verstrekking in Open Data","22101","Ja",,"896",,,,,"4","4","0","0",,"464","164","N1",,,,"1960","CV21",,"e4*2007/46*0437*03","CV22","B","0","0.05","282","Nee","Nee",,"Nee","0","0","0.00","2024","Logisch","00","Ja","2024-10-12T00:00:00.000","2024-02-03T00:00:00.000","2016-03-31T00:00:00.000","2016-03-31T00:00:00.000",,,,,,,,,,,"192",,,,,,,,,,,,,,,,,"https://opendata.rdw.nl/resource/3huj-srit.json","https://opendata.rdw.nl/resource/8ys7-d773.json","https://opendata.rdw.nl/resource/vezc-m2t6.json","https://opendata.rdw.nl/resource/jhie-znh9.json","https://opendata.rdw.nl/resource/kmfi-hrps.json"
"VZ150B","Bedrijfsauto","DFSK","V22","20241028","20170125","5516","kipper","5","N.v.t.","N.v.t.","4","1310","1280","1960","1380",,,"20160920","20160920","Geen verstrekking in Open Data","27338","Ja",,"680",,,,,,"4",,,,,"164","N1",,,"r. balk by vooras","1960","CV21",,,,,,"0.04","282","Nee","Nee",,"Nee",,,,"2024","Logisch","00","Ja","2024-10-28T00:00:00.000","2017-01-25T00:00:00.000","2016-09-20T00:00:00.000","2016-09-20T00:00:00.000",,"0",,,,,,,,,,,,,,,,,,,,,,,,,,"https://opendata.rdw.nl/resource/3huj-srit.json","https://opendata.rdw.nl/resource/8ys7-d773.json","https://opendata.rdw.nl/resource/vezc-m2t6.json","https://opendata.rdw.nl/resource/jhie-znh9.json","https://opendata.rdw.nl/resource/kmfi-hrps.json"
"VZ207B","Bedrijfsauto","DFSK","V22","20240831","20170125","5516","kipper","5","N.v.t.","N.v.t.","4","1310","1320","1960","1420",,,"20160920","20160920","Geen verstrekking in Open Data","27338","Ja",,"640",,,,,,"4",,,,,"164","N1",,,"r. balk by vooras","1960","CV21",,,,,,"0.04","282","Nee","Nee",,"Nee",,,,"2023","Logisch","00","Ja","2024-08-31T00:00:00.000","2017-01-25T00:00:00.000","2016-09-20T00:00:00.000","2016-09-20T00:00:00.000",,"0",,,,,,,,,,,,,,,,,,,,,,,,,,"https://opendata.rdw.nl/resource/3huj-srit.json","https://opendata.rdw.nl/resource/8ys7-d773.json","https://opendata.rdw.nl/resource/vezc-m2t6.json","https://opendata.rdw.nl/resource/jhie-znh9.json","https://opendata.rdw.nl/resource/kmfi-hrps.json"
"VZ277J","Bedrijfsauto","DFSK","V22","20240913","20160913","4272","kipper","2","N.v.t.","N.v.t.","4","1310","1320","1960","1420",,,"20160913","20160913","Geen verstrekking in Open Data","22101","Ja",,"640",,,,,,"4",,,,,"164","N1",,,"r. balk by vooras","1960","CV21",,,,,,"0.04","282","Nee","Nee",,"Nee",,,,"2023","Logisch","00","Ja","2024-09-13T00:00:00.000","2016-09-13T00:00:00.000","2016-09-13T00:00:00.000","2016-09-13T00:00:00.000",,"0",,,,,,,,,,,,,,,,,,,,,,,,,,"https://opendata.rdw.nl/resource/3huj-srit.json","https://opendata.rdw.nl/resource/8ys7-d773.json","https://opendata.rdw.nl/resource/vezc-m2t6.json","https://opendata.rdw.nl/resource/jhie-znh9.json","https://opendata.rdw.nl/resource/kmfi-hrps.json"
"VZ279J","Bedrijfsauto","DFSK","V22","20240918","20170420","4272","kipper","2","N.v.t.","N.v.t.","4","1310","1320","1960","1420",,,"20160916","20160916","Geen verstrekking in Open Data","22101","Ja",,"640",,,,,,"4",,,,,"164","N1",,,"r. balk by vooras","1960","CV21",,,,,,"0.04","282","Nee","Nee",,"Nee",,,,"2023","Logisch","00","Ja","2024-09-18T00:00:00.000","2017-04-20T00:00:00.000","2016-09-16T00:00:00.000","2016-09-16T00:00:00.000",,"0",,,,,,,,,,,,,,,,,,,,,,,,,,"https://opendata.rdw.nl/resource/3huj-srit.json","https://opendata.rdw.nl/resource/8ys7-d773.json","https://opendata.rdw.nl/resource/vezc-m2t6.json","https://opendata.rdw.nl/resource/jhie-znh9.json","https://opendata.rdw.nl/resource/kmfi-hrps.json"
"VZ281J","Bedrijfsauto","DFSK","V22","20250108","20160913","4272","kipper","2","N.v.t.","N.v.t.","4","1310","1320","1960","1420",,,"20160913","20160913","Geen verstrekking in Open Data","22101","Ja",,"640",,,,,,"4",,,,,"164","N1",,,"r. balk by vooras","1960","CV21",,,,,,"0.04","282","Nee","Nee",,"Nee",,,,"2024","Logisch","00","Ja","2025-01-08T00:00:00.000","2016-09-13T00:00:00.000","2016-09-13T00:00:00.000","2016-09-13T00:00:00.000",,"0",,,,,,,,,,,,,,,,,,,,,,,,,,"https://opendata.rdw.nl/resource/3huj-srit.json","https://opendata.rdw.nl/resource/8ys7-d773.json","https://opendata.rdw.nl/resource/vezc-m2t6.json","https://opendata.rdw.nl/resource/jhie-znh9.json","https://opendata.rdw.nl/resource/kmfi-hrps.json"
"VZ294H","Bedrijfsauto","DFSK","V22","20240901","20160823","5516","kipper","5","N.v.t.","N.v.t.","4","1310","1320","1960","1420",,,"20160823","20160823","Geen verstrekking in Open Data","27338","Ja",,"640",,,,,,"4",,,,,"164","N1",,,"r. balk by vooras","1960","CV21","G2 gasinstallatie",,,,,"0.04","282","Nee","Nee",,"Nee",,,,"2023","Logisch","00","Ja","2024-09-01T00:00:00.000","2016-08-23T00:00:00.000","2016-08-23T00:00:00.000","2016-08-23T00:00:00.000",,"0",,,,,,,,,,,,,,,,,,,,,,,,,,"https://opendata.rdw.nl/resource/3huj-srit.json","https://opendata.rdw.nl/resource/8ys7-d773.json","https://opendata.rdw.nl/resource/vezc-m2t6.json","https://opendata.rdw.nl/resource/jhie-znh9.json","https://opendata.rdw.nl/resource/kmfi-hrps.json"
"VZ442G","Bedrijfsauto","DFSK","V22","20200916","20220128","4468","open laadvloer","5","N.v.t.","N.v.t.","4","1310","1064","1960","1164",,,"20160916","20160916","Geen verstrekking in Open Data","22927","Ja",,"896",,,,,,"4",,,,,"164","N1",,,"r. balk by vooras","1960","CV21",,,,,,"0.05","282","Nee","Nee",,"Nee",,,,"2022","Logisch","00","Ja","2020-09-16T00:00:00.000","2022-01-28T00:00:00.000","2016-09-16T00:00:00.000","2016-09-16T00:00:00.000",,"0",,,,,,,,,,,,,,,,,,,,,,,,,,"https://opendata.rdw.nl/resource/3huj-srit.json","https://opendata.rdw.nl/resource/8ys7-d773.json","https://opendata.rdw.nl/resource/vezc-m2t6.json","https://opendata.rdw.nl/resource/jhie-znh9.json","https://opendata.rdw.nl/resource/kmfi-hrps.json"
"VZ445G","Bedrijfsauto","DFSK","V22","20250310","20200310","4468","open laadvloer","5","N.v.t.","N.v.t.","4","1310","1064","1960","1164",,,"20160916","20160916","Geen verstrekking in Open Data","22927","Ja",,"896",,,,,,"4",,,,,"164","N1",,,"r. balk by vooras","1960","CV21",,,,,,"0.05","282","Nee","Nee",,"Nee",,,,"2024","Logisch","00","Ja","2025-03-10T00:00:00.000","2020-03-10T00:00:00.000","2016-09-16T00:00:00.000","2016-09-16T00:00:00.000",,"0",,,,,,,,,,,,,,,,,,,,,,,,,,"https://opendata.rdw.nl/resource/3huj-srit.json","https://opendata.rdw.nl/resource/8ys7-d773.json","https://opendata.rdw.nl/resource/vezc-m2t6.json","https://opendata.rdw.nl/resource/jhie-znh9.json","https://opendata.rdw.nl/resource/kmfi-hrps.json"
"VZ473G","Bedrijfsauto","DFSK","V22","20250710","20200611","4468","open laadvloer","5","N.v.t.","N.v.t.","4","1310","1064","1960","1164",,,"20160916","20160916","Geen verstrekking in Open Data","22927","Ja",,"896",,,,,,"4",,,,,"164","N1",,,"r. balk by vooras","1960","CV21",,,,,,"0.05","282","Nee","Nee",,"Nee",,,,"2023","Onlogisch","04","Ja","2025-07-10T00:00:00.000","2020-06-11T00:00:00.000","2016-09-16T00:00:00.000","2016-09-16T00:00:00.000",,"0",,,,,,,,,,,,,,,,,,,,,,,,,,"https://opendata.rdw.nl/resource/3huj-srit.json","https://opendata.rdw.nl/resource/8ys7-d773.json","https://opendata.rdw.nl/resource/vezc-m2t6.json","https://opendata.rdw.nl/resource/jhie-znh9.json","https://opendata.rdw.nl/resource/kmfi-hrps.json"
"VZ745H","Bedrijfsauto","DFSK","V22","20240827","20160825","5516","kipper","5","N.v.t.","N.v.t.","4","1310","1320","1960","1420",,,"20160825","20160825","Geen verstrekking in Open Data","27338","Ja",,"640",,,,,,"4",,,,,"164","N1",,,"r. balk by vooras","1960","CV21","G2 gasinstallatie",,,,,"0.04","282","Nee","Nee",,"Nee",,,,"2023","Logisch","00","Ja","2024-08-27T00:00:00.000","2016-08-25T00:00:00.000","2016-08-25T00:00:00.000","2016-08-25T00:00:00.000",,"0",,,,,,,,,,,,,,,,,,,,,,,,,,"https://opendata.rdw.nl/resource/3huj-srit.json","https://opendata.rdw.nl/resource/8ys7-d773.json","https://opendata.rdw.nl/resource/vezc-m2t6.json","https://opendata.rdw.nl/resource/jhie-znh9.json","https://opendata.rdw.nl/resource/kmfi-hrps.json"
