"kenteken","voertuigsoort","merk","handelsbenaming","vervaldatum_apk","datum_tenaamstelling","bruto_bpm","inrichting","aantal_zitplaatsen","eerste_kleur","tweede_kleur","aantal_cilinders","cilinderinhoud","massa_ledig_voertuig","toegestane_maximum_massa_voertuig","massa_rijklaar","maximum_massa_trekken_ongeremd","maximum_trekken_massa_geremd","datum_eerste_toelating","datum_eerste_tenaamstelling_in_nederland","wacht_op_keuren","catalogusprijs","wam_verzekerd","maximale_constructiesnelheid","laadvermogen","oplegger_geremd","aanhangwagen_autonoom_geremd","aanhangwagen_middenas_geremd","aantal_staanplaatsen","aantal_deuren","aantal_wielen","afstand_hart_koppeling_tot_achterzijde_voertuig","afstand_voorzijde_voertuig_tot_hart_koppeling","afwijkende_maximum_snelheid","lengte","breedte","europese_voertuigcategorie","europese_voertuigcategorie_toevoeging","europese_uitvoeringcategorie_toevoeging","plaats_chassisnummer","technische_max_massa_voertuig","type","type_gasinstallatie","typegoedkeuringsnummer","variant","uitvoering","volgnummer_wijziging_eu_typegoedkeuring","vermogen_massarijklaar","wielbasis","export_indicator","openstaande_terugroepactie_indicator","vervaldatum_tachograaf","taxi_indicator","maximum_massa_samenstelling","aantal_rolstoelplaatsen","maximum_ondersteunende_snelheid","jaar_laatste_registratie_tellerstand","tellerstandoordeel","code_toelichting_tellerstandoordeel","tenaamstellen_mogelijk","vervaldatum_apk_dt","datum_tenaamstelling_dt","datum_eerste_toelating_dt","datum_eerste_tenaamstelling_in_nederland_dt","vervaldatum_tachograaf_dt","maximum_last_onder_de_vooras_sen_tezamen_koppeling","type_remsysteem_voertuig_code","rupsonderstelconfiguratiecode","wielbasis_voertuig_minimum","wielbasis_voertuig_maximum","lengte_voertuig_minimum","lengte_voertuig_maximum","breedte_voertuig_minimum","breedte_voertuig_maximum","hoogte_voertuig","hoogte_voertuig_minimum","hoogte_voertuig_maximum","massa_bedrijfsklaar_minimaal","massa_bedrijfsklaar_maximaal","technisch_toelaatbaar_massa_koppelpunt","maximum_massa_technisch_maximaal","maximum_massa_technisch_minimaal","subcategorie_nederland","verticale_belasting_koppelpunt_getrokken_voertuig","zuinigheidsclassificatie","registratie_datum_goedkeuring_afschrijvingsmoment_bpm","registratie_datum_goedkeuring_afschrijvingsmoment_bpm_dt","gem_lading_wrde","aerodyn_voorz","massa_alt_aandr","verl_cab_ind","api_gekentekende_voertuigen_assen","api_gekentekende_voertuigen_brandstof","api_gekentekende_voertuigen_carrosserie","api_gekentekende_voertuigen_carrosserie_specifiek","api_gekentekende_voertuigen_voertuigklasse"
"1VGR50","Bedrijfsauto","CITROEN","BERLINGO","20250318","20201118","5138","kipper","2","N.v.t.","N.v.t.","4","1560","1635","2227","1735",,,"20100217","20100217","Geen verstrekking in Open Data","20496","Ja",,"592",,,,,,"4",,,,,"192","N1",,,"tegen r. schroefveerkoker onder motorkap","2227",,,,,,,"0.04","273","Nee","Nee",,"Nee",,,,"2024","Logisch","00","Ja","2025-03-18T00:00:00.000","2020-11-18T00:00:00.000","2010-02-17T00:00:00.000","2010-02-17T00:00:00.000",,"0",,,,,,,,,,,,,,,,,,,,,,,,,,"https://opendata.rdw.nl/resource/3huj-srit.json","https://opendata.rdw.nl/resource/8ys7-d773.json","https://opendata.rdw.nl/resource/vezc-m2t6.json","https://opendata.rdw.nl/resource/jhie-znh9.json","https://opendata.rdw.nl/resource/kmfi-hrps.json"
"25BBKV","Bedrijfsauto","CITROEN","BERLINGO","20250320","20240226",,"kipper",,"N.v.t.","N.v.t.","4",,"1390","1830","1490",,,"20020201","20020201","Geen verstrekking in Open Data",,"Ja",,"440",,,,,,"4",,,,,"180","N1",,,"r. op randprofiel onder motorkap","1830",,,,,,,"0.03","269","Nee","Nee",,"Nee","2930",,,"2024","Onlogisch","04","Ja","2025-03-20T00:00:00.000","2024-02-26T00:00:00.000","2002-02-01T00:00:00.000","2002-02-01T00:00:00.000",,"0",,,,,,,,,,,,,,,,,,,,,,,,,,"https://opendata.rdw.nl/resource/3huj-srit.json","https://opendata.rdw.nl/resource/8ys7-d773.json","https://opendata.rdw.nl/resource/vezc-m2t6.json","https://opendata.rdw.nl/resource/jhie-znh9.json","https://opendata.rdw.nl/resource/kmfi-hrps.json"
"37BKVB","Bedrijfsauto","CITROEN","BERLINGO","20240927","20151130",,"kipper",,"N.v.t.","N.v.t.","4",,"1290","1864","1390",,,"20031125","20031125","Geen verstrekking in Open Data",,"Ja",,"574",,,,,,"4",,,,,"170","N1",,,"r. op randprofiel onder motorkap","1864",,,,,,,"0.04","269","Nee","Nee",,"Nee","2960",,,"2023","Logisch","00","Ja","2024-09-27T00:00:00.000","2015-11-30T00:00:00.000","2003-11-25T00:00:00.000","2003-11-25T00:00:00.000",,"0",,,,,,,,,,,,,,,,,,,,,,,,,,"https://opendata.rdw.nl/resource/3huj-srit.json","https://opendata.rdw.nl/resource/8ys7-d773.json","https://opendata.rdw.nl/resource/vezc-m2t6.json","https://opendata.rdw.nl/resource/jhie-znh9.json","https://opendata.rdw.nl/resource/kmfi-hrps.json"
"98BSFZ","Bedrijfsauto","CITROEN","BERLINGO","20240524","20180601",,"kipper",,"N.v.t.","N.v.t.","4","1868","1320","1955","1420",,,"20050117","20050117","Geen verstrekking in Open Data",,"Ja",,"635",,"1100","1100",,,"4",,,,,"173","N1",,,"r. in watergoot onder motorkap","1955",,,,,,,"0.04","269","Nee","Nee",,"Nee","3055",,,"2023","Logisch","00","Ja","2024-05-24T00:00:00.000","2018-06-01T00:00:00.000","2005-01-17T00:00:00.000","2005-01-17T00:00:00.000",,"0",,,,,,,,,,,,,,,,,,,,,,,,,,"https://opendata.rdw.nl/resource/3huj-srit.json","https://opendata.rdw.nl/resource/8ys7-d773.json","https://opendata.rdw.nl/resource/vezc-m2t6.json","https://opendata.rdw.nl/resource/jhie-znh9.json","https://opendata.rdw.nl/resource/kmfi-hrps.json"
"V289HK","Bedrijfsauto","CITROEN","BERLINGO","20240719","20170726","6504","kipper","2","N.v.t.","N.v.t.","4","1560","1565","2205","1665","640",,"20170718","20170718","Geen verstrekking in Open Data","26505","Ja",,"640",,,"1200",,,"4",,,,,"186","N1",,,"r. schroefveerkoker","2205","7",,,,,,"0.04","273","Nee","Nee",,"Nee","3100",,,"2024","Logisch","00","Ja","2024-07-19T00:00:00.000","2017-07-26T00:00:00.000","2017-07-18T00:00:00.000","2017-07-18T00:00:00.000",,"0",,,,,,,,,,,,,,,,,,,,,,,,,,"https://opendata.rdw.nl/resource/3huj-srit.json","https://opendata.rdw.nl/resource/8ys7-d773.json","https://opendata.rdw.nl/resource/vezc-m2t6.json","https://opendata.rdw.nl/resource/jhie-znh9.json","https://opendata.rdw.nl/resource/kmfi-hrps.json"
"V489HK","Bedrijfsauto","CITROEN","BERLINGO","20240719","20170725","6504","kipper","2","N.v.t.","N.v.t.","4","1560","1570","2205","1670","640",,"20170719","20170719","Geen verstrekking in Open Data","26505","Ja",,"635",,,"1200",,,"4",,,,,"187","N1",,,"r. schroefveerkoker","2205","7",,,,,,"0.04","273","Nee","Nee",,"Nee","3100",,,"2023","Logisch","00","Ja","2024-07-19T00:00:00.000","2017-07-25T00:00:00.000","2017-07-19T00:00:00.000","2017-07-19T00:00:00.000",,"0",,,,,,,,,,,,,,,,,,,,,,,,,,"https://opendata.rdw.nl/resource/3huj-srit.json","https://opendata.rdw.nl/resource/8ys7-d773.json","https://opendata.rdw.nl/resource/vezc-m2t6.json","https://opendata.rdw.nl/resource/jhie-znh9.json","https://opendata.rdw.nl/resource/kmfi-hrps.json"
"VF074G","Bedrijfsauto","CITROEN","BERLINGO","20240623","20180618","5560","kipper","2","N.v.t.","N.v.t.","4","1560","1630","2240","1730","655",,"20130715","20130715","Geen verstrekking in Open Data","22530","Ja",,"610",,,"900",,,"4",,,,,"186","N1",,,"r. schroefveerkoker","2240","7",,,,,,"0.04","273","Nee","Nee",,"Nee","3140",,,"2023","Logisch","00","Ja","2024-06-23T00:00:00.000","2018-06-18T00:00:00.000","2013-07-15T00:00:00.000","2013-07-15T00:00:00.000",,"0",,,,,,,,,,,,,,,,,,,,,,,,,,"https://opendata.rdw.nl/resource/3huj-srit.json","https://opendata.rdw.nl/resource/8ys7-d773.json","https://opendata.rdw.nl/resource/vezc-m2t6.json","https://opendata.rdw.nl/resource/jhie-znh9.json","https://opendata.rdw.nl/resource/kmfi-hrps.json"
"VF263T","Bedrijfsauto","CITROEN","BERLINGO","20240924","20210223","4886","kipper","2","N.v.t.","N.v.t.","4","1560","1570","2240","1670","655",,"20130924","20130924","Geen verstrekking in Open Data","19693","Ja",,"670",,"900","900",,,"4",,,,,"185","N1",,,"r. schroefveerkoker","2240","7",,,,,,"0.04","273","Nee","Nee",,"Nee","3140",,,"2024","Logisch","00","Ja","2024-09-24T00:00:00.000","2021-02-23T00:00:00.000","2013-09-24T00:00:00.000","2013-09-24T00:00:00.000",,"0",,,,,,,,,,,,,,,,,,,,,,,,,,"https://opendata.rdw.nl/resource/3huj-srit.json","https://opendata.rdw.nl/resource/8ys7-d773.json","https://opendata.rdw.nl/resource/vezc-m2t6.json","https://opendata.rdw.nl/resource/jhie-znh9.json","https://opendata.rdw.nl/resource/kmfi-hrps.json"
"VF269N","Bedrijfsauto","CITROEN","BERLINGO","20240912","20200424","5701","kipper","2","N.v.t.","N.v.t.","4","1560","1520","2240","1620","655",,"20130826","20130826","Geen verstrekking in Open Data","23125","Ja",,"720",,,"900",,,"4",,,,,"187","N1",,,"r. schroefveerkoker","2240","7",,,,,,"0.04","273","Nee","Nee",,"Nee","3140",,,"2023","Logisch","00","Ja","2024-09-12T00:00:00.000","2020-04-24T00:00:00.000","2013-08-26T00:00:00.000","2013-08-26T00:00:00.000",,"0",,,,,,,,,,,,,,,,,,,,,,,,,,"https://opendata.rdw.nl/resource/3huj-srit.json","https://opendata.rdw.nl/resource/8ys7-d773.json","https://opendata.rdw.nl/resource/vezc-m2t6.json","https://opendata.rdw.nl/resource/jhie-znh9.json","https://opendata.rdw.nl/resource/kmfi-hrps.json"
"VF294N","Bedrijfsauto","CITROEN","BERLINGO","20240526","20210420","5701","kipper","2","N.v.t.","N.v.t.","4","1560","1520","2240","1620","655",,"20130826","20130826","Geen verstrekking in Open Data","23125","Ja",,"720",,,"900",,,"4",,,,,"187","N1",,,"r. schroefveerkoker","2240","7",,,,,,"0.04","273","Nee","Nee",,"Nee","3140",,,"2023","Logisch","00","Ja","2024-05-26T00:00:00.000","2021-04-20T00:00:00.000","2013-08-26T00:00:00.000","2013-08-26T00:00:00.000",,"0",,,,,,,,,,,,,,,,,,,,,,,,,,"https://opendata.rdw.nl/resource/3huj-srit.json","https://opendata.rdw.nl/resource/8ys7-d773.json","https://opendata.rdw.nl/resource/vezc-m2t6.json","https://opendata.rdw.nl/resource/jhie-znh9.json","https://opendata.rdw.nl/resource/kmfi-hrps.json"
"VF467N","Bedrijfsauto","CITROEN","BERLINGO","20250121","20200929","5701","kipper","2","N.v.t.","N.v.t.","4","1560","1520","2240","1620","655",,"20130827","20130827","Geen verstrekking in Open Data","23125","Ja",,"720",,,"900",,,"4",,,,,"187","N1",,,"r. schroefveerkoker","2240","7",,,,,,"0.04","273","Nee","Nee",,"Nee","3140",,,"2024","Logisch","00","Ja","2025-01-21T00:00:00.000","2020-09-29T00:00:00.000","2013-08-27T00:00:00.000","2013-08-27T00:00:00.000",,"0",,,,,,,,,,,,,,,,,,,,,,,,,,"https://opendata.rdw.nl/resource/3huj-srit.json","https://opendata.rdw.nl/resource/8ys7-d773.json","https://opendata.rdw.nl/resource/vezc-m2t6.json","https://opendata.rdw.nl/resource/jhie-znh9.json","https://opendata.rdw.nl/resource/kmfi-hrps.json"
"VF530T","Bedrijfsauto","CITROEN","BERLINGO","20240925","20210223",,"kipper","2","N.v.t.","N.v.t.","4","1560","1570","2240","1670","655",,"20130925","20130925","Geen verstrekking in Open Data",,"Ja",,"670",,"900","900",,,"4",,,,,"185","N1",,,"r. schroefveerkoker","2240","7",,,,,,"0.04","273","Nee","Nee",,"Nee","3140",,,"2024","Logisch","00","Ja","2024-09-25T00:00:00.000","2021-02-23T00:00:00.000","2013-09-25T00:00:00.000","2013-09-25T00:00:00.000",,"0",,,,,,,,,,,,,,,,,,,,,,,,,,"https://opendata.rdw.nl/resource/3huj-srit.json","https://opendata.rdw.nl/resource/8ys7-d773.json","https://opendata.rdw.nl/resource/vezc-m2t6.json","https://opendata.rdw.nl/resource/jhie-znh9.json","https://opendata.rdw.nl/resource/kmfi-hrps.json"
"VF531F","Bedrijfsauto","CITROEN","BERLINGO","20241128","20181016","5560","kipper","2","N.v.t.","N.v.t.","4","1560","1630","2240","1730","655",,"20130710","20130710","Geen verstrekking in Open Data","14025","Ja",,"610",,,"900",,,"4",,,,,"183","N1",,,"r. schroefveerkoker","2240","7",,,,,,"0.04","273","Nee","Nee",,"Nee","3140",,,"2023","Logisch","00","Ja","2024-11-28T00:00:00.000","2018-10-16T00:00:00.000","2013-07-10T00:00:00.000","2013-07-10T00:00:00.000",,"0",,,,,,,,,,,,,,,,,,,,,,,,,,"https://opendata.rdw.nl/resource/3huj-srit.json","https://opendata.rdw.nl/resource/8ys7-d773.json","https://opendata.rdw.nl/resource/vezc-m2t6.json","https://opendata.rdw.nl/resource/jhie-znh9.json","https://opendata.rdw.nl/resource/kmfi-hrps.json"
"VF664K","Bedrijfsauto","CITROEN","BERLINGO","20241130","20171130","5560","kipper","2","N.v.t.","N.v.t.","4","1560","1620","2240","1720","655",,"20130813","20130813","Geen verstrekking in Open Data","16970","Ja",,"620",,,"900",,,"4",,,,,"187","N1",,,"r. schroefveerkoker","2240","7",,,,,,"0.04","273","Nee","Nee",,"Nee","3140",,,"2023","Logisch","00","Ja","2024-11-30T00:00:00.000","2017-11-30T00:00:00.000","2013-08-13T00:00:00.000","2013-08-13T00:00:00.000",,"0",,,,,,,,,,,,,,,,,,,,,,,,,,"https://opendata.rdw.nl/resource/3huj-srit.json","https://opendata.rdw.nl/resource/8ys7-d773.json","https://opendata.rdw.nl/resource/vezc-m2t6.json","https://opendata.rdw.nl/resource/jhie-znh9.json","https://opendata.rdw.nl/resource/kmfi-hrps.json"
"VF852F","Bedrijfsauto","CITROEN","BERLINGO","20250412","20180413","5560","kipper","2","N.v.t.","N.v.t.","4","1560","1725","2240","1825","655",,"20130712","20130712","Geen verstrekking in Open Data","22530","Ja",,"515",,,"900",,,"4",,,,,"186","N1",,,"r. schroefveerkoker","2240","7",,,,,,"0.04","273","Nee","Nee",,"Nee","3140",,,"2024","Logisch","00","Ja","2025-04-12T00:00:00.000","2018-04-13T00:00:00.000","2013-07-12T00:00:00.000","2013-07-12T00:00:00.000",,"0",,,,,,,,,,,,,,,,,,,,,,,,,,"https://opendata.rdw.nl/resource/3huj-srit.json","https://opendata.rdw.nl/resource/8ys7-d773.json","https://opendata.rdw.nl/resource/vezc-m2t6.json","https://opendata.rdw.nl/resource/jhie-znh9.json","https://opendata.rdw.nl/resource/kmfi-hrps.json"
"VF855N","Bedrijfsauto","CITROEN","BERLINGO","20241214","20201210","5701","kipper","2","N.v.t.","N.v.t.","4","1560","1520","2240","1620","655",,"20130829","20130829","Geen verstrekking in Open Data","23125","Ja",,"720",,,"900",,,"4",,,,,"187","N1",,,"r. schroefveerkoker","2240","7",,,,,,"0.04","273","Nee","Nee",,"Nee","3140",,,"2024","Logisch","00","Ja","2024-12-14T00:00:00.000","2020-12-10T00:00:00.000","2013-08-29T00:00:00.000","2013-08-29T00:00:00.000",,"0",,,,,,,,,,,,,,,,,,,,,,,,,,"https://opendata.rdw.nl/resource/3huj-srit.json","https://opendata.rdw.nl/resource/8ys7-d773.json","https://opendata.rdw.nl/resource/vezc-m2t6.json","https://opendata.rdw.nl/resource/jhie-znh9.json","https://opendata.rdw.nl/resource/kmfi-hrps.json"
"VK682X","Bedrijfsauto","CITROEN","BERLINGO","20241111","20151228","5583","kipper","2","N.v.t.","N.v.t.","4","1560","1215","2240","1315","655",,"20141111","20141111","Geen verstrekking in Open Data","22625","Ja",,"1025",,"900","900",,,"4",,,,,"189","N1",,,"r. schroefveerkoker","2240","7",,,,,,"0.05","273","Nee","Nee",,"Nee","3140",,,"2023","Logisch","00","Ja","2024-11-11T00:00:00.000","2015-12-28T00:00:00.000","2014-11-11T00:00:00.000","2014-11-11T00:00:00.000",,"0",,,,,,,,,,,,,,,,,,,,,,,,,,"https://opendata.rdw.nl/resource/3huj-srit.json","https://opendata.rdw.nl/resource/8ys7-d773.json","https://opendata.rdw.nl/resource/vezc-m2t6.json","https://opendata.rdw.nl/resource/jhie-znh9.json","https://opendata.rdw.nl/resource/kmfi-hrps.json"
"VT550J","Bedrijfsauto","CITROEN","BERLINGO","20241101","20201210","5967","kipper","2","N.v.t.","N.v.t.","4","1560","1605","2240","1705","655",,"20160203","20160203","Geen verstrekking in Open Data","24244","Ja",,"635",,,"900",,,"4",,,,,"187","N1",,,"r. schroefveerkoker","2240","7",,,,,,"0.04","273","Nee","Nee",,"Nee","3140",,,"2023","Logisch","00","Ja","2024-11-01T00:00:00.000","2020-12-10T00:00:00.000","2016-02-03T00:00:00.000","2016-02-03T00:00:00.000",,"0",,,,,,,,,,,,,,,,,,,,,,,,,,"https://opendata.rdw.nl/resource/3huj-srit.json","https://opendata.rdw.nl/resource/8ys7-d773.json","https://opendata.rdw.nl/resource/vezc-m2t6.json","https://opendata.rdw.nl/resource/jhie-znh9.json","https://opendata.rdw.nl/resource/kmfi-hrps.json"
