"kenteken","voertuigsoort","merk","handelsbenaming","vervaldatum_apk","datum_tenaamstelling","bruto_bpm","inrichting","aantal_zitplaatsen","eerste_kleur","tweede_kleur","aantal_cilinders","cilinderinhoud","massa_ledig_voertuig","toegestane_maximum_massa_voertuig","massa_rijklaar","maximum_massa_trekken_ongeremd","maximum_trekken_massa_geremd","datum_eerste_toelating","datum_eerste_tenaamstelling_in_nederland","wacht_op_keuren","catalogusprijs","wam_verzekerd","maximale_constructiesnelheid","laadvermogen","oplegger_geremd","aanhangwagen_autonoom_geremd","aanhangwagen_middenas_geremd","aantal_staanplaatsen","aantal_deuren","aantal_wielen","afstand_hart_koppeling_tot_achterzijde_voertuig","afstand_voorzijde_voertuig_tot_hart_koppeling","afwijkende_maximum_snelheid","lengte","breedte","europese_voertuigcategorie","europese_voertuigcategorie_toevoeging","europese_uitvoeringcategorie_toevoeging","plaats_chassisnummer","technische_max_massa_voertuig","type","type_gasinstallatie","typegoedkeuringsnummer","variant","uitvoering","volgnummer_wijziging_eu_typegoedkeuring","vermogen_massarijklaar","wielbasis","export_indicator","openstaande_terugroepactie_indicator","vervaldatum_tachograaf","taxi_indicator","maximum_massa_samenstelling","aantal_rolstoelplaatsen","maximum_ondersteunende_snelheid","jaar_laatste_registratie_tellerstand","tellerstandoordeel","code_toelichting_tellerstandoordeel","tenaamstellen_mogelijk","vervaldatum_apk_dt","datum_tenaamstelling_dt","datum_eerste_toelating_dt","datum_eerste_tenaamstelling_in_nederland_dt","vervaldatum_tachograaf_dt","maximum_last_onder_de_vooras_sen_tezamen_koppeling","type_remsysteem_voertuig_code","rupsonderstelconfiguratiecode","wielbasis_voertuig_minimum","wielbasis_voertuig_maximum","lengte_voertuig_minimum","lengte_voertuig_maximum","breedte_voertuig_minimum","breedte_voertuig_maximum","hoogte_voertuig","hoogte_voertuig_minimum","hoogte_voertuig_maximum","massa_bedrijfsklaar_minimaal","massa_bedrijfsklaar_maximaal","technisch_toelaatbaar_massa_koppelpunt","maximum_massa_technisch_maximaal","maximum_massa_technisch_minimaal","subcategorie_nederland","verticale_belasting_koppelpunt_getrokken_voertuig","zuinigheidsclassificatie","registratie_datum_goedkeuring_afschrijvingsmoment_bpm","registratie_datum_goedkeuring_afschrijvingsmoment_bpm_dt","gem_lading_wrde","aerodyn_voorz","massa_alt_aandr","verl_cab_ind","api_gekentekende_voertuigen_assen","api_gekentekende_voertuigen_brandstof","api_gekentekende_voertuigen_carrosserie","api_gekentekende_voertuigen_carrosserie_specifiek","api_gekentekende_voertuigen_voertuigklasse"
"1KJR86","Personenauto","CITROEN","CITROEN C3","20250509","20201028","2762","hatchback","5","GRIJS","Niet geregistreerd","4","1360","989","1510","1089",,"900","20060802","20130506","Geen verstrekking in Open Data",,"Ja",,,,,,,"4","4",,,,,,"M1",,,"r. schutbord motorruimte","1510",,,,,,,"0.05","246","Nee","Nee",,"Nee","2410",,,"2024","Geen oordeel","05","Ja","2025-05-09T00:00:00.000","2020-10-28T00:00:00.000","2006-08-02T00:00:00.000","2013-05-06T00:00:00.000",,"0",,,,,,,,,,,,,,,,,,,,,,,,,,"https://opendata.rdw.nl/resource/3huj-srit.json","https://opendata.rdw.nl/resource/8ys7-d773.json","https://opendata.rdw.nl/resource/vezc-m2t6.json","https://opendata.rdw.nl/resource/jhie-znh9.json","https://opendata.rdw.nl/resource/kmfi-hrps.json"
"3TGK32","Personenauto","CITROEN","CITROEN C3","20240818","20231026","6819","hatchback","5","ZWART","Niet geregistreerd","4","1587","1108","1597","1208",,,"20091012","20140123","Geen verstrekking in Open Data",,"Ja",,,,,,,"4","4",,,,,,"M1",,,"r. schutbord motorruimte","1597",,,,,,,"0.07","246","Nee","Nee",,"Nee","2497",,,"2023","Geen oordeel","05","Ja","2024-08-18T00:00:00.000","2023-10-26T00:00:00.000","2009-10-12T00:00:00.000","2014-01-23T00:00:00.000",,"0",,,,,,,,,,,,,,,,,,,,,,,,,,"https://opendata.rdw.nl/resource/3huj-srit.json","https://opendata.rdw.nl/resource/8ys7-d773.json","https://opendata.rdw.nl/resource/vezc-m2t6.json","https://opendata.rdw.nl/resource/jhie-znh9.json","https://opendata.rdw.nl/resource/kmfi-hrps.json"
"4THV36","Personenauto","CITROEN","CITROEN C3","20241006","20240422","2762","hatchback","5","GROEN","Niet geregistreerd","4","1360","989","1510","1089",,"900","20080305","20140214","Geen verstrekking in Open Data",,"Ja",,,,,,,"4","4",,,,,,"M1",,,"r. tegen schutbord onder motorkap","1510",,,,,,,"0.05","246","Nee","Nee",,"Nee","2410",,,"2024","Onlogisch","04","Ja","2024-10-06T00:00:00.000","2024-04-22T00:00:00.000","2008-03-05T00:00:00.000","2014-02-14T00:00:00.000",,"0",,,,,,,,,,,,,,,,,,,,,,,,,,"https://opendata.rdw.nl/resource/3huj-srit.json","https://opendata.rdw.nl/resource/8ys7-d773.json","https://opendata.rdw.nl/resource/vezc-m2t6.json","https://opendata.rdw.nl/resource/jhie-znh9.json","https://opendata.rdw.nl/resource/kmfi-hrps.json"
"4TXK84","Personenauto","CITROEN","CITROEN C3","20241107","20160603","719","hatchback","5","GRIJS","Niet geregistreerd","4","1360","989","1510","1089","540","1160","20071008","20140822","Geen verstrekking in Open Data","15995","Ja",,,,,,,"4","4",,,,,,"M1",,,"r. schutbord","1510",,,,,,,"0.05","246","Nee","Nee",,"Nee",,,,"2023","Geen oordeel","05","Ja","2024-11-07T00:00:00.000","2016-06-03T00:00:00.000","2007-10-08T00:00:00.000","2014-08-22T00:00:00.000",,"0",,,,,,,,,,,,,,,,,,,,,,,,,,"https://opendata.rdw.nl/resource/3huj-srit.json","https://opendata.rdw.nl/resource/8ys7-d773.json","https://opendata.rdw.nl/resource/vezc-m2t6.json","https://opendata.rdw.nl/resource/jhie-znh9.json","https://opendata.rdw.nl/resource/kmfi-hrps.json"
"4ZDJ85","Personenauto","CITROEN","CITROEN C3 PLURIEL","20240530","20230602","4540","cabriolet","4","GRIJS","Niet geregistreerd","4","1360","1111","1506","1211","605",,"20050422","20141212","Geen verstrekking in Open Data",,"Ja",,,,,,,"2","4",,,,,,"M1",,,"r. schutbord","1506",,,,,,,"0.04","246","Nee","Nee",,"Nee","2106",,,"2023","Geen oordeel","05","Ja","2024-05-30T00:00:00.000","2023-06-02T00:00:00.000","2005-04-22T00:00:00.000","2014-12-12T00:00:00.000",,"0",,,,,,,,,,,,,,,,,,,,,,,,,,"https://opendata.rdw.nl/resource/3huj-srit.json","https://opendata.rdw.nl/resource/8ys7-d773.json","https://opendata.rdw.nl/resource/vezc-m2t6.json","https://opendata.rdw.nl/resource/jhie-znh9.json","https://opendata.rdw.nl/resource/kmfi-hrps.json"
"6KLV75","Personenauto","CITROEN","CITROEN C3","20250609","20130716","2588","hatchback","5","GRIJS","Niet geregistreerd","4","1360","1065","1529","1165","550","1105","20100806","20130614","Geen verstrekking in Open Data","15143","Ja",,,,,,,"4","4",,,,,,"M1",,,"r. schutbord by motorruimte","1529",,,,,,,"0.05","245","Nee","Nee",,"Nee","2329",,,"2024","Geen oordeel","05","Ja","2025-06-09T00:00:00.000","2013-07-16T00:00:00.000","2010-08-06T00:00:00.000","2013-06-14T00:00:00.000",,"0",,,,,,,,,,,,,,,,,,,,,,,,,,"https://opendata.rdw.nl/resource/3huj-srit.json","https://opendata.rdw.nl/resource/8ys7-d773.json","https://opendata.rdw.nl/resource/vezc-m2t6.json","https://opendata.rdw.nl/resource/jhie-znh9.json","https://opendata.rdw.nl/resource/kmfi-hrps.json"
"7XHN80","Personenauto","CITROEN","CITROEN C3","20220909","20221128","2459","hatchback","5","GRIJS","Niet geregistreerd","4","1124","953","1463","1053",,,"20040128","20140902","Geen verstrekking in Open Data",,"Ja",,,,,,,"4","4",,,,,,"M1",,,"r. schutbord by motorruimte","1463",,,,,,,"0.04","246","Nee","Nee",,"Nee",,,,"2022","Geen oordeel","05","Ja","2022-09-09T00:00:00.000","2022-11-28T00:00:00.000","2004-01-28T00:00:00.000","2014-09-02T00:00:00.000",,"0",,,,,,,,,,,,,,,,,,,,,,,,,,"https://opendata.rdw.nl/resource/3huj-srit.json","https://opendata.rdw.nl/resource/8ys7-d773.json","https://opendata.rdw.nl/resource/vezc-m2t6.json","https://opendata.rdw.nl/resource/jhie-znh9.json","https://opendata.rdw.nl/resource/kmfi-hrps.json"
"7XHS74","Personenauto","CITROEN","CITROEN C3","20240811","20200718","4038","hatchback","5","GRIJS","Niet geregistreerd","4","1398","1023","1539","1123",,"900","20080603","20140807","Geen verstrekking in Open Data","19795","Ja",,,,,,,"4","4",,,,,,"M1",,,"r. tegen schutbord onder motorkap","1539",,,,,,,"0.04","246","Nee","Nee",,"Nee","2439",,,"2023","Geen oordeel","05","Ja","2024-08-11T00:00:00.000","2020-07-18T00:00:00.000","2008-06-03T00:00:00.000","2014-08-07T00:00:00.000",,"0",,,,,,,,,,,,,,,,,,,,,,,,,,"https://opendata.rdw.nl/resource/3huj-srit.json","https://opendata.rdw.nl/resource/8ys7-d773.json","https://opendata.rdw.nl/resource/vezc-m2t6.json","https://opendata.rdw.nl/resource/jhie-znh9.json","https://opendata.rdw.nl/resource/kmfi-hrps.json"
"9TRN31","Personenauto","CITROEN","CITROEN C3","20250424","20141029","4573","hatchback","5","GRIJS","Niet geregistreerd","4","1587","1108","1597","1208",,,"20080414","20140428","Geen verstrekking in Open Data",,"Ja",,,,,,,"4","4",,,,,,"M1",,,"r. schutbord motorruimte","1597",,,,,,,"0.07","246","Nee","Nee",,"Nee","2497",,,"2024","Geen oordeel","05","Ja","2025-04-24T00:00:00.000","2014-10-29T00:00:00.000","2008-04-14T00:00:00.000","2014-04-28T00:00:00.000",,"0",,,,,,,,,,,,,,,,,,,,,,,,,,"https://opendata.rdw.nl/resource/3huj-srit.json","https://opendata.rdw.nl/resource/8ys7-d773.json","https://opendata.rdw.nl/resource/vezc-m2t6.json","https://opendata.rdw.nl/resource/jhie-znh9.json","https://opendata.rdw.nl/resource/kmfi-hrps.json"
"G032GX","Personenauto","CITROEN","CITROEN C3","20241003","20190925","2937","hatchback","5","GRIJS","Niet geregistreerd","4","1360","980","1470","1080",,"900","20050803","20190925","Geen verstrekking in Open Data",,"Ja","167",,,,,,"4","4",,,,,,"M1",,,,"1470","F",,,,,,"0.05","246","Nee","Nee",,"Nee","2370",,,"2023","Geen oordeel","05","Ja","2024-10-03T00:00:00.000","2019-09-25T00:00:00.000","2005-08-03T00:00:00.000","2019-09-25T00:00:00.000",,,,,,,,,,,,,,,,,,,,,,,,,,,,"https://opendata.rdw.nl/resource/3huj-srit.json","https://opendata.rdw.nl/resource/8ys7-d773.json","https://opendata.rdw.nl/resource/vezc-m2t6.json","https://opendata.rdw.nl/resource/jhie-znh9.json","https://opendata.rdw.nl/resource/kmfi-hrps.json"
"G224BD","Personenauto","CITROEN","CITROEN C3","20241209","20191204","2543","hatchback","5","ZWART","Niet geregistreerd","4","1124","985","1483","1085","540","920","20061019","20191204","Geen verstrekking in Open Data",,"Ja","153",,,,,,"4","4",,,,,,"M1",,,,"1483","F*HFX*",,,,,,"0.04","246","Nee","Nee",,"Nee","2133",,,"2023","Geen oordeel","05","Ja","2024-12-09T00:00:00.000","2019-12-04T00:00:00.000","2006-10-19T00:00:00.000","2019-12-04T00:00:00.000",,,,,,,,,,,,,,,,,,,,,,,,,,,,"https://opendata.rdw.nl/resource/3huj-srit.json","https://opendata.rdw.nl/resource/8ys7-d773.json","https://opendata.rdw.nl/resource/vezc-m2t6.json","https://opendata.rdw.nl/resource/jhie-znh9.json","https://opendata.rdw.nl/resource/kmfi-hrps.json"
"GR157S","Personenauto","CITROEN","CITROEN C3","20240815","20191206","2098","hatchback","5","GRIJS","Niet geregistreerd","4","1360","980","1470","1080",,"900","20031014","20150731","Geen verstrekking in Open Data",,"Ja",,,,,,,"4","4",,,,,,"M1",,,"r. schutbord","1470",,,,,,,"0.05","246","Nee","Nee",,"Nee","2370",,,"2023","Geen oordeel","05","Ja","2024-08-15T00:00:00.000","2019-12-06T00:00:00.000","2003-10-14T00:00:00.000","2015-07-31T00:00:00.000",,,,,,,,,,,,,,,,,,,,,,,,,,,,"https://opendata.rdw.nl/resource/3huj-srit.json","https://opendata.rdw.nl/resource/8ys7-d773.json","https://opendata.rdw.nl/resource/vezc-m2t6.json","https://opendata.rdw.nl/resource/jhie-znh9.json","https://opendata.rdw.nl/resource/kmfi-hrps.json"
"H206XG","Personenauto","CITROEN","CITROEN C3","20210612",,"1932","hatchback","5","ROOD","Niet geregistreerd","4","1360","980","1470","1080",,,"20031007",,"Geen verstrekking in Open Data",,"Nee","167",,,,,,"4","4",,,,,,"M1",,,,"1470",,,,,,,"0.05","246","Nee","Nee",,"Nee",,,,"2020","Geen oordeel","05","Ja","2021-06-12T00:00:00.000",,"2003-10-07T00:00:00.000",,,,,,,,,,,,,,,,,,,,,,,,,,,,,"https://opendata.rdw.nl/resource/3huj-srit.json","https://opendata.rdw.nl/resource/8ys7-d773.json","https://opendata.rdw.nl/resource/vezc-m2t6.json","https://opendata.rdw.nl/resource/jhie-znh9.json","https://opendata.rdw.nl/resource/kmfi-hrps.json"
"HF431D","Personenauto","CITROEN","CITROEN C3","20250511","20210812","2885","hatchback","5","BLAUW","Niet geregistreerd","4","1124","976","1463","1076","526","650","20040528","20151024","Geen verstrekking in Open Data",,"Ja",,,,,,,"4","4",,,,,,"M1",,,"v. schutbord motorruimte","1463",,,,,,,"0.04","246","Nee","Nee",,"Nee","2113",,,"2024","Geen oordeel","05","Ja","2025-05-11T00:00:00.000","2021-08-12T00:00:00.000","2004-05-28T00:00:00.000","2015-10-24T00:00:00.000",,,,,,,,,,,,,,,,,,,,,,,,,,,,"https://opendata.rdw.nl/resource/3huj-srit.json","https://opendata.rdw.nl/resource/8ys7-d773.json","https://opendata.rdw.nl/resource/vezc-m2t6.json","https://opendata.rdw.nl/resource/jhie-znh9.json","https://opendata.rdw.nl/resource/kmfi-hrps.json"
"J035VL","Personenauto","CITROEN","CITROEN C3","20250104","20230308","3031","hatchback","5","ROOD","Niet geregistreerd","4","1124","953","1463","1053",,"650","20050812","20201022","Geen verstrekking in Open Data",,"Ja","153",,,,,,"4","4",,,,,,"M1",,,,"1463","FCHFXB",,,,,,"0.04","246","Nee","Nee",,"Nee","2113",,,"2023","Geen oordeel","05","Ja","2025-01-04T00:00:00.000","2023-03-08T00:00:00.000","2005-08-12T00:00:00.000","2020-10-22T00:00:00.000",,,,,,,,,,,,,,,,,,,,,,"20221207","2022-12-07T00:00:00.000",,,,,"https://opendata.rdw.nl/resource/3huj-srit.json","https://opendata.rdw.nl/resource/8ys7-d773.json","https://opendata.rdw.nl/resource/vezc-m2t6.json","https://opendata.rdw.nl/resource/jhie-znh9.json","https://opendata.rdw.nl/resource/kmfi-hrps.json"
"J104LX","Personenauto","CITROEN","CITROEN C3","20260529","20200907","1831","hatchback","5","GRIJS","ROOD","3","1199","1116","1640","1216",,,"20180529","20200907","Geen verstrekking in Open Data","23511","Ja",,,,,,,"4","4",,,,,,"M1",,,"r. schutbord","1640",,,,,,,"0.07","254","Nee","Ja",,"Nee","2090",,,"2024","Geen oordeel","05","Ja","2026-05-29T00:00:00.000","2020-09-07T00:00:00.000","2018-05-29T00:00:00.000","2020-09-07T00:00:00.000",,,,,,,,,,,,,,,,,,,,,,,,,,,,"https://opendata.rdw.nl/resource/3huj-srit.json","https://opendata.rdw.nl/resource/8ys7-d773.json","https://opendata.rdw.nl/resource/vezc-m2t6.json","https://opendata.rdw.nl/resource/jhie-znh9.json","https://opendata.rdw.nl/resource/kmfi-hrps.json"
"J758TS","Personenauto","CITROEN","CITROEN C3 PLURIEL","20241027","20201016","4006","cabriolet","4","BLAUW","Niet geregistreerd","4","1360","1133","1513","1233","540","800","20060215","20201016","Geen verstrekking in Open Data",,"Ja","164",,,,,,"2","4",,,,,,"M1",,,"r. motorruimte by schutbord","1513",,,,,,,"0.04","246","Nee","Nee",,"Nee","2113",,,"2023","Geen oordeel","05","Ja","2024-10-27T00:00:00.000","2020-10-16T00:00:00.000","2006-02-15T00:00:00.000","2020-10-16T00:00:00.000",,,,,,,,,,,,,,,,,,,,,,,,,,,,"https://opendata.rdw.nl/resource/3huj-srit.json","https://opendata.rdw.nl/resource/8ys7-d773.json","https://opendata.rdw.nl/resource/vezc-m2t6.json","https://opendata.rdw.nl/resource/jhie-znh9.json","https://opendata.rdw.nl/resource/kmfi-hrps.json"
"KB396V","Personenauto","CITROEN","CITROEN C3","20250325","20240326","3635","hatchback","5","GROEN","Niet geregistreerd","4","1360","989","1510","1089","544","900","20060302","20160808","Geen verstrekking in Open Data",,"Ja",,,,,,,"4","4",,,,,,"M1",,,"r. schutbord by motorruimte","1510",,,,,,,"0.05","246","Nee","Nee",,"Nee","2410",,,"2024","Geen oordeel","05","Ja","2025-03-25T00:00:00.000","2024-03-26T00:00:00.000","2006-03-02T00:00:00.000","2016-08-08T00:00:00.000",,,,,,,,,,,,,,,,,,,,,,,,,,,,"https://opendata.rdw.nl/resource/3huj-srit.json","https://opendata.rdw.nl/resource/8ys7-d773.json","https://opendata.rdw.nl/resource/vezc-m2t6.json","https://opendata.rdw.nl/resource/jhie-znh9.json","https://opendata.rdw.nl/resource/kmfi-hrps.json"
"KB444V","Personenauto","CITROEN","CITROEN C3","20250405","20240201","1800","hatchback","5","ZWART","Niet geregistreerd","4","1124","985","1483","1085",,,"20080429","20170220","Geen verstrekking in Open Data",,"Ja",,,,,,,"4","4",,,,,,"M1",,,"r. schroefveerkoker","1483","FCHFXC",,,,,,"0.04","246","Nee","Nee",,"Nee","2133",,,"2024","Geen oordeel","05","Ja","2025-04-05T00:00:00.000","2024-02-01T00:00:00.000","2008-04-29T00:00:00.000","2017-02-20T00:00:00.000",,,,,,,,,,,,,,,,,,,,,,,,,,,,"https://opendata.rdw.nl/resource/3huj-srit.json","https://opendata.rdw.nl/resource/8ys7-d773.json","https://opendata.rdw.nl/resource/vezc-m2t6.json","https://opendata.rdw.nl/resource/jhie-znh9.json","https://opendata.rdw.nl/resource/kmfi-hrps.json"
"L185GX","Personenauto","CITROEN","CITROEN C3","20250315","20220512","2978","hatchback","5","GROEN","Niet geregistreerd","4","1360","989","1510","1089",,"900","20080229","20210522","Geen verstrekking in Open Data",,"Ja","167",,,,,,"4","4",,,,,,"M1",,,,"1510","FCKFVC",,,,,,"0.05","246","Nee","Nee",,"Nee","2410",,,"2024","Geen oordeel","05","Ja","2025-03-15T00:00:00.000","2022-05-12T00:00:00.000","2008-02-29T00:00:00.000","2021-05-22T00:00:00.000",,,,,,,,,,,,,,,,,,,,,,,,,,,,"https://opendata.rdw.nl/resource/3huj-srit.json","https://opendata.rdw.nl/resource/8ys7-d773.json","https://opendata.rdw.nl/resource/vezc-m2t6.json","https://opendata.rdw.nl/resource/jhie-znh9.json","https://opendata.rdw.nl/resource/kmfi-hrps.json"
"N176FL","Personenauto","CITROEN","CITROEN C3","20250119","20210925","2574","hatchback","5","GRIJS","Niet geregistreerd","4","1124","953","1463","1053",,,"20030107","20210925","Geen verstrekking in Open Data",,"Ja","153",,,,,,"4","4",,,,,,"M1",,,,"1463",,,,,,,"0.04","246","Nee","Nee",,"Nee",,,,"2024","Geen oordeel","05","Ja","2025-01-19T00:00:00.000","2021-09-25T00:00:00.000","2003-01-07T00:00:00.000","2021-09-25T00:00:00.000",,,,,,,,,,,,,,,,,,,,,,,,,,,,"https://opendata.rdw.nl/resource/3huj-srit.json","https://opendata.rdw.nl/resource/8ys7-d773.json","https://opendata.rdw.nl/resource/vezc-m2t6.json","https://opendata.rdw.nl/resource/jhie-znh9.json","https://opendata.rdw.nl/resource/kmfi-hrps.json"
"NS803R","Personenauto","CITROEN","CITROEN C3","20240904","20190821","2789","hatchback","5","BLAUW","Niet geregistreerd","4","1360","980","1470","1080",,"900","20041104","20170408","Geen verstrekking in Open Data",,"Ja",,,,,,,"4","4",,,,,,"M1",,,"r. schutbord by motorruimte","1470","FCKFVB",,,,,,"0.05","246","Nee","Nee",,"Nee","2370",,,"2023","Geen oordeel","05","Ja","2024-09-04T00:00:00.000","2019-08-21T00:00:00.000","2004-11-04T00:00:00.000","2017-04-08T00:00:00.000",,,,,,,,,,,,,,,,,,,,,,,,,,,,"https://opendata.rdw.nl/resource/3huj-srit.json","https://opendata.rdw.nl/resource/8ys7-d773.json","https://opendata.rdw.nl/resource/vezc-m2t6.json","https://opendata.rdw.nl/resource/jhie-znh9.json","https://opendata.rdw.nl/resource/kmfi-hrps.json"
"NX881P","Personenauto","CITROEN","CITROEN C3 PLURIEL","20240602","20240411","5297","cabriolet","4","GRIJS","Niet geregistreerd","4","1587","1152","1556","1252",,,"20050427","20170504","Geen verstrekking in Open Data",,"Nee",,,,,,,"2","4",,,,,,"M1",,,"r. schutbord motorruimte","1556",,,,,,,"0.06","246","Nee","Nee",,"Nee",,,,"2023","Geen oordeel","05","Ja","2024-06-02T00:00:00.000","2024-04-11T00:00:00.000","2005-04-27T00:00:00.000","2017-05-04T00:00:00.000",,,,,,,,,,,,,,,,,,,,,,,,,,,,"https://opendata.rdw.nl/resource/3huj-srit.json","https://opendata.rdw.nl/resource/8ys7-d773.json","https://opendata.rdw.nl/resource/vezc-m2t6.json","https://opendata.rdw.nl/resource/jhie-znh9.json","https://opendata.rdw.nl/resource/kmfi-hrps.json"
"PR114L","Personenauto","CITROEN","CITROEN C3","20250518","20210602","460","hatchback","5","GRIJS","Niet geregistreerd","4","1360","1005","1529","1105","550","1105","20110518","20170831","Geen verstrekking in Open Data","16779","Ja",,,,,,,"4","4","0","0",,"394","0","M1",,,"r. motorruimte","1529","S*****",,"e2*2007/46*0003*09","CKFT","0/1","0","0.05","245","Nee","Nee",,"Nee","2329","0","0.00","2024","Geen oordeel","05","Ja","2025-05-18T00:00:00.000","2021-06-02T00:00:00.000","2011-05-18T00:00:00.000","2017-08-31T00:00:00.000",,,,,,,,,,,,,,,,,,,,,"C",,,,,,,"https://opendata.rdw.nl/resource/3huj-srit.json","https://opendata.rdw.nl/resource/8ys7-d773.json","https://opendata.rdw.nl/resource/vezc-m2t6.json","https://opendata.rdw.nl/resource/jhie-znh9.json","https://opendata.rdw.nl/resource/kmfi-hrps.json"
"R419GZ","Personenauto","CITROEN","CITROEN C3","20241214","20220826","2681","hatchback","5","GRIJS","Niet geregistreerd","4","1124","985","1483","1085",,"650","20060502","20220826","Geen verstrekking in Open Data",,"Ja","153",,,,,,"4","4",,,,,,"M1",,,,"1483",,,,,,,"0.04","246","Nee","Nee",,"Nee","2133",,,"2023","Geen oordeel","05","Ja","2024-12-14T00:00:00.000","2022-08-26T00:00:00.000","2006-05-02T00:00:00.000","2022-08-26T00:00:00.000",,,,,,,,,,,,,,,,,,,,,,"20220804","2022-08-04T00:00:00.000",,,,,"https://opendata.rdw.nl/resource/3huj-srit.json","https://opendata.rdw.nl/resource/8ys7-d773.json","https://opendata.rdw.nl/resource/vezc-m2t6.json","https://opendata.rdw.nl/resource/jhie-znh9.json","https://opendata.rdw.nl/resource/kmfi-hrps.json"
"R466VR","Personenauto","CITROEN","CITROEN C3","20250209","20221201","4299","hatchback","5","GRIJS","Niet geregistreerd","4","1398","997","1501","1097",,"900","20050128","20221201","Geen verstrekking in Open Data",,"Ja","165",,,,,,"5","4",,,,,,"M1",,,,"1501","FC8HXB",,,,,,"0.05","246","Nee","Nee",,"Nee","2401",,,"2024","Geen oordeel","05","Ja","2025-02-09T00:00:00.000","2022-12-01T00:00:00.000","2005-01-28T00:00:00.000","2022-12-01T00:00:00.000",,,,,,,,,,,,,,,,,,,,,,"20221104","2022-11-04T00:00:00.000",,,,,"https://opendata.rdw.nl/resource/3huj-srit.json","https://opendata.rdw.nl/resource/8ys7-d773.json","https://opendata.rdw.nl/resource/vezc-m2t6.json","https://opendata.rdw.nl/resource/jhie-znh9.json","https://opendata.rdw.nl/resource/kmfi-hrps.json"
"RB551R","Personenauto","CITROEN","CITROEN C3 1.4I","20250127","20240416","496","hatchback","5","ZWART","Niet geregistreerd","4","1360","1064","1529","1164",,"1105","20120213","20171019","Geen verstrekking in Open Data","17165","Ja",,,,,,,"4","4",,,,,,"M1",,,"r. motorruimte","1529",,,,,,,"0.05","245","Nee","Nee",,"Nee","2329",,,"2024","Geen oordeel","05","Ja","2025-01-27T00:00:00.000","2024-04-16T00:00:00.000","2012-02-13T00:00:00.000","2017-10-19T00:00:00.000",,,,,,,,,,,,,,,,,,,,,,,,,,,,"https://opendata.rdw.nl/resource/3huj-srit.json","https://opendata.rdw.nl/resource/8ys7-d773.json","https://opendata.rdw.nl/resource/vezc-m2t6.json","https://opendata.rdw.nl/resource/jhie-znh9.json","https://opendata.rdw.nl/resource/kmfi-hrps.json"
"T650BR","Personenauto","CITROEN","CITROEN C3","20240519","20230513","4151","hatchback","5","GROEN","Niet geregistreerd","4","1398","1023","1539","1123",,"900","20060511","20230513","Geen verstrekking in Open Data",,"Ja","165",,,,,,"5","4",,,,,,"M1",,,,"1539",,,,,,,"0.04","246","Nee","Nee",,"Nee","2439",,,"2023","Geen oordeel","05","Ja","2024-05-19T00:00:00.000","2023-05-13T00:00:00.000","2006-05-11T00:00:00.000","2023-05-13T00:00:00.000",,,,,,,,,,,,,,,,,,,,,,"20230502","2023-05-02T00:00:00.000",,,,,"https://opendata.rdw.nl/resource/3huj-srit.json","https://opendata.rdw.nl/resource/8ys7-d773.json","https://opendata.rdw.nl/resource/vezc-m2t6.json","https://opendata.rdw.nl/resource/jhie-znh9.json","https://opendata.rdw.nl/resource/kmfi-hrps.json"
