"kenteken","voertuigsoort","merk","handelsbenaming","vervaldatum_apk","datum_tenaamstelling","bruto_bpm","inrichting","aantal_zitplaatsen","eerste_kleur","tweede_kleur","aantal_cilinders","cilinderinhoud","massa_ledig_voertuig","toegestane_maximum_massa_voertuig","massa_rijklaar","maximum_massa_trekken_ongeremd","maximum_trekken_massa_geremd","datum_eerste_toelating","datum_eerste_tenaamstelling_in_nederland","wacht_op_keuren","catalogusprijs","wam_verzekerd","maximale_constructiesnelheid","laadvermogen","oplegger_geremd","aanhangwagen_autonoom_geremd","aanhangwagen_middenas_geremd","aantal_staanplaatsen","aantal_deuren","aantal_wielen","afstand_hart_koppeling_tot_achterzijde_voertuig","afstand_voorzijde_voertuig_tot_hart_koppeling","afwijkende_maximum_snelheid","lengte","breedte","europese_voertuigcategorie","europese_voertuigcategorie_toevoeging","europese_uitvoeringcategorie_toevoeging","plaats_chassisnummer","technische_max_massa_voertuig","type","type_gasinstallatie","typegoedkeuringsnummer","variant","uitvoering","volgnummer_wijziging_eu_typegoedkeuring","vermogen_massarijklaar","wielbasis","export_indicator","openstaande_terugroepactie_indicator","vervaldatum_tachograaf","taxi_indicator","maximum_massa_samenstelling","aantal_rolstoelplaatsen","maximum_ondersteunende_snelheid","jaar_laatste_registratie_tellerstand","tellerstandoordeel","code_toelichting_tellerstandoordeel","tenaamstellen_mogelijk","vervaldatum_apk_dt","datum_tenaamstelling_dt","datum_eerste_toelating_dt","datum_eerste_tenaamstelling_in_nederland_dt","vervaldatum_tachograaf_dt","maximum_last_onder_de_vooras_sen_tezamen_koppeling","type_remsysteem_voertuig_code","rupsonderstelconfiguratiecode","wielbasis_voertuig_minimum","wielbasis_voertuig_maximum","lengte_voertuig_minimum","lengte_voertuig_maximum","breedte_voertuig_minimum","breedte_voertuig_maximum","hoogte_voertuig","hoogte_voertuig_minimum","hoogte_voertuig_maximum","massa_bedrijfsklaar_minimaal","massa_bedrijfsklaar_maximaal","technisch_toelaatbaar_massa_koppelpunt","maximum_massa_technisch_maximaal","maximum_massa_technisch_minimaal","subcategorie_nederland","verticale_belasting_koppelpunt_getrokken_voertuig","zuinigheidsclassificatie","registratie_datum_goedkeuring_afschrijvingsmoment_bpm","registratie_datum_goedkeuring_afschrijvingsmoment_bpm_dt","gem_lading_wrde","aerodyn_voorz","massa_alt_aandr","verl_cab_ind","api_gekentekende_voertuigen_assen","api_gekentekende_voertuigen_brandstof","api_gekentekende_voertuigen_carrosserie","api_gekentekende_voertuigen_carrosserie_specifiek","api_gekentekende_voertuigen_voertuigklasse"
"H567RL","Personenauto","CARTHAGO","C-TOURER T143LE","20250503","20200408","14372","kampeerwagen","4","WIT","Niet geregistreerd","4","2287","3035","3500","3135","750","1800","20200408","20200408","Geen verstrekking in Open Data","59626","Ja",,,,,,,"3","4","0","0",,"695","234","M1",,,,"4250","EG/CF002",,"e1*2001/116*0423*23","FTR1M","DE2461","0","0.04","380","Nee","Nee",,"Nee","5300","0","0.00","2024","Logisch","00","Ja","2025-05-03T00:00:00.000","2020-04-08T00:00:00.000","2020-04-08T00:00:00.000","2020-04-08T00:00:00.000",,,,,,,,,,,,,,,,,,,,,,,,,,,,"https://opendata.rdw.nl/resource/3huj-srit.json","https://opendata.rdw.nl/resource/8ys7-d773.json","https://opendata.rdw.nl/resource/vezc-m2t6.json","https://opendata.rdw.nl/resource/jhie-znh9.json","https://opendata.rdw.nl/resource/kmfi-hrps.json"
"HD056R","Personenauto","CARTHAGO","C-TOURER T143","20240616","20210623","11845","kampeerwagen","4","WIT","Niet geregistreerd","4","2287","2760","3500","2860","750","2000","20151006","20151006","Geen verstrekking in Open Data",,"Ja",,,,,,,"3","4","0","0",,"684","0","M1",,,"r.","3500","EG/CF004",,"e1*2007/46*0778*05","FFT11","A1I4CFB54","0","0.04","380","Nee","Nee",,"Nee","5500","0","0.00","2023","Logisch","00","Ja","2024-06-16T00:00:00.000","2021-06-23T00:00:00.000","2015-10-06T00:00:00.000","2015-10-06T00:00:00.000",,,,,,,,,,,,,,,,,,,,,,,,,,,,"https://opendata.rdw.nl/resource/3huj-srit.json","https://opendata.rdw.nl/resource/8ys7-d773.json","https://opendata.rdw.nl/resource/vezc-m2t6.json","https://opendata.rdw.nl/resource/jhie-znh9.json","https://opendata.rdw.nl/resource/kmfi-hrps.json"
"J553NB","Personenauto","CARTHAGO","C-TOURER T143","20250604","20200915","12117","kampeerwagen","4","WIT","GRIJS","4","2287","2810","4250","2910","750","1800","20190604","20200915","Geen verstrekking in Open Data","50136","Ja","146",,,,,,"3","4",,,,"684","234","M1",,,,"4250",,,,,,,"0.04","380","Nee","Nee",,"Nee","6000",,,"2024","Geen oordeel","05","Ja","2025-06-04T00:00:00.000","2020-09-15T00:00:00.000","2019-06-04T00:00:00.000","2020-09-15T00:00:00.000",,,,,,,,,,,"294",,,,,,,,,,,"20230419","2023-04-19T00:00:00.000",,,,,"https://opendata.rdw.nl/resource/3huj-srit.json","https://opendata.rdw.nl/resource/8ys7-d773.json","https://opendata.rdw.nl/resource/vezc-m2t6.json","https://opendata.rdw.nl/resource/jhie-znh9.json","https://opendata.rdw.nl/resource/kmfi-hrps.json"
"JL572J","Personenauto","CARTHAGO","C-TOURER T143","20250419","20160426","11317","kampeerwagen","4","WIT","GRIJS","4","2287","2760","3500","2860","750","2000","20160426","20160426","Geen verstrekking in Open Data",,"Ja",,,,,,,"3","4","0","0",,"684","0","M1",,,"r.","3500","EG/CF004",,"e1*2007/46*0778*05","FFT11","A1H4BFB54","0","0.03","380","Nee","Nee",,"Nee","5500","0","0.00","2024","Logisch","00","Ja","2025-04-19T00:00:00.000","2016-04-26T00:00:00.000","2016-04-26T00:00:00.000","2016-04-26T00:00:00.000",,,,,,,,,,,,,,,,,,,,,,,,,,,,"https://opendata.rdw.nl/resource/3huj-srit.json","https://opendata.rdw.nl/resource/8ys7-d773.json","https://opendata.rdw.nl/resource/vezc-m2t6.json","https://opendata.rdw.nl/resource/jhie-znh9.json","https://opendata.rdw.nl/resource/kmfi-hrps.json"
"JZ272P","Personenauto","CARTHAGO","C-TOURER T143","20250609","20160721","11149","kampeerwagen","4","WIT","Niet geregistreerd","4","2287","2685","3500","2785","750","2500","20160609","20160721","Geen verstrekking in Open Data",,"Ja",,,,,,,"3","4","0","0",,"636","0","M1",,,"r.","3500","EG/CF004",,"e1*2007/46*0778*06","FFT11","A1I4CDB54","0","0.04","380","Nee","Ja",,"Nee","6000","0","0.00","2024","Logisch","00","Ja","2025-06-09T00:00:00.000","2016-07-21T00:00:00.000","2016-06-09T00:00:00.000","2016-07-21T00:00:00.000",,,,,,,,,,,,,,,,,,,,,,,,,,,,"https://opendata.rdw.nl/resource/3huj-srit.json","https://opendata.rdw.nl/resource/8ys7-d773.json","https://opendata.rdw.nl/resource/vezc-m2t6.json","https://opendata.rdw.nl/resource/jhie-znh9.json","https://opendata.rdw.nl/resource/kmfi-hrps.json"
"KR529J","Personenauto","CARTHAGO","C-TOURER T143","20240510","20161110","11449","kampeerwagen","4","GRIJS","WIT","4","2287","2760","3500","2860","750","1800","20160510","20161110","Geen verstrekking in Open Data",,"Ja",,,,,,,"3","4","0","0",,"684","0","M1",,,"r.","4250","EG/CF004",,"e1*2007/46*0778*07","FFT11","D1I4CDB54","0","0.04","380","Nee","Nee",,"Nee","5300","0","0.00","2023","Geen oordeel","05","Ja","2024-05-10T00:00:00.000","2016-11-10T00:00:00.000","2016-05-10T00:00:00.000","2016-11-10T00:00:00.000",,,,,,,,,,,,,,,,,,,,,,,,,,,,"https://opendata.rdw.nl/resource/3huj-srit.json","https://opendata.rdw.nl/resource/8ys7-d773.json","https://opendata.rdw.nl/resource/vezc-m2t6.json","https://opendata.rdw.nl/resource/jhie-znh9.json","https://opendata.rdw.nl/resource/kmfi-hrps.json"
"KX833J","Personenauto","CARTHAGO","C-TOURER T143","20241018","20231104","11976","kampeerwagen","4","WIT","GRIJS","4","2287","2800","4250","2900","750","1800","20160228","20161222","Geen verstrekking in Open Data",,"Ja",,,,,,,"3","4","0","0",,"684","0","M1",,,"r.","4250","EG/CF004",,"e1*2007/46*0778*07","FFT11","D1I4CDB54","0","0.04","380","Nee","Nee",,"Nee","6000","0","0.00","2023","Geen oordeel","05","Ja","2024-10-18T00:00:00.000","2023-11-04T00:00:00.000","2016-02-28T00:00:00.000","2016-12-22T00:00:00.000",,,,,,,,,,,,,,,,,,,,,,,,,,,,"https://opendata.rdw.nl/resource/3huj-srit.json","https://opendata.rdw.nl/resource/8ys7-d773.json","https://opendata.rdw.nl/resource/vezc-m2t6.json","https://opendata.rdw.nl/resource/jhie-znh9.json","https://opendata.rdw.nl/resource/kmfi-hrps.json"
"N542DF","Personenauto","CARTHAGO","C-TOURER T143LE","20240122","20231006","11877","kampeerwagen","4","WIT","Niet geregistreerd","4","2287","2770","3500","2870","750","2000","20210122","20211001","Geen verstrekking in Open Data","49120","Ja","148",,,,,,"3","4","0","0",,"690","234","M1",,,,"3500","EG/CF002",,"e1*2001/116*0423*23","FTR1I","DA1461","0","0.04","380","Nee","Nee",,"Nee","6000","0","0.00","2023","Geen oordeel","05","Ja","2024-01-22T00:00:00.000","2023-10-06T00:00:00.000","2021-01-22T00:00:00.000","2021-10-01T00:00:00.000",,,,,,,,,,,"289",,,,,,,,,,,,,,,,,"https://opendata.rdw.nl/resource/3huj-srit.json","https://opendata.rdw.nl/resource/8ys7-d773.json","https://opendata.rdw.nl/resource/vezc-m2t6.json","https://opendata.rdw.nl/resource/jhie-znh9.json","https://opendata.rdw.nl/resource/kmfi-hrps.json"
"NL657L","Personenauto","CARTHAGO","C-TOURER T143","20240517","20210420","12127","kampeerwagen","4","WIT","GRIJS","4","2287","2800","3500","2900","750","1750","20170118","20170304","Geen verstrekking in Open Data",,"Ja",,,,,,,"3","4",,,,,,"M1",,,"r.","4250","EG/CF004",,,,,,"0.04","380","Nee","Nee",,"Nee","5250",,,"2023","Geen oordeel","05","Ja","2024-05-17T00:00:00.000","2021-04-20T00:00:00.000","2017-01-18T00:00:00.000","2017-03-04T00:00:00.000",,,,,,,,,,,,,,,,,,,,,,,,,,,,"https://opendata.rdw.nl/resource/3huj-srit.json","https://opendata.rdw.nl/resource/8ys7-d773.json","https://opendata.rdw.nl/resource/vezc-m2t6.json","https://opendata.rdw.nl/resource/jhie-znh9.json","https://opendata.rdw.nl/resource/kmfi-hrps.json"
"NS714K","Personenauto","CARTHAGO","C-TOURER T143","20250412","20170412","11402","kampeerwagen","4","WIT","Niet geregistreerd","4","2287","2810","4250","2910","750","1800","20170412","20170412","Geen verstrekking in Open Data",,"Ja",,,,,,,"3","4","0","0",,"684","0","M1",,,"r.","4250","EG/CF004",,"e1*2007/46*0778*08","FFT11","D1M4GHB254","0","0.03","380","Nee","Nee",,"Nee","6000","0","0.00","2024","Logisch","00","Ja","2025-04-12T00:00:00.000","2017-04-12T00:00:00.000","2017-04-12T00:00:00.000","2017-04-12T00:00:00.000",,,,,,,,,,,,,,,,,,,,,,,,,,,,"https://opendata.rdw.nl/resource/3huj-srit.json","https://opendata.rdw.nl/resource/8ys7-d773.json","https://opendata.rdw.nl/resource/vezc-m2t6.json","https://opendata.rdw.nl/resource/jhie-znh9.json","https://opendata.rdw.nl/resource/kmfi-hrps.json"
"NX977L","Personenauto","CARTHAGO","C-TOURER T143","20250505","20170505","12287","kampeerwagen","4","WIT","Niet geregistreerd","4","2287","2760","3500","2860","750","2000","20170505","20170505","Geen verstrekking in Open Data",,"Ja",,,,,,,"2","4","0","0",,"684","0","M1",,,"r.","3500","EG/CF004",,"e1*2007/46*0778*08","FFT11","A1N4HKB254","0","0.04","380","Nee","Nee",,"Nee","5500","0","0.00","2024","Logisch","00","Ja","2025-05-05T00:00:00.000","2017-05-05T00:00:00.000","2017-05-05T00:00:00.000","2017-05-05T00:00:00.000",,,,,,,,,,,,,,,,,,,,,,,,,,,,"https://opendata.rdw.nl/resource/3huj-srit.json","https://opendata.rdw.nl/resource/8ys7-d773.json","https://opendata.rdw.nl/resource/vezc-m2t6.json","https://opendata.rdw.nl/resource/jhie-znh9.json","https://opendata.rdw.nl/resource/kmfi-hrps.json"
"PB998D","Personenauto","CARTHAGO","C-TOURER T143","20250606","20180424","11713","kampeerwagen","4","WIT","Niet geregistreerd","4","2287","2800","3500","2900","750","1800","20170606","20170606","Geen verstrekking in Open Data","91000","Ja",,,,,,,"3","4","0","0",,"684","234","M1",,,"in bodemplaat r. v.","4250","EG/CF004",,"e1*2007/46*0778*07","FFT11","D1H4BDB54","0","0.03","380","Nee","Nee",,"Nee","5300","0","0.00","2024","Logisch","00","Ja","2025-06-06T00:00:00.000","2018-04-24T00:00:00.000","2017-06-06T00:00:00.000","2017-06-06T00:00:00.000",,,,,,,,,,,"294",,,,,,,,,,,,,,,,,"https://opendata.rdw.nl/resource/3huj-srit.json","https://opendata.rdw.nl/resource/8ys7-d773.json","https://opendata.rdw.nl/resource/vezc-m2t6.json","https://opendata.rdw.nl/resource/jhie-znh9.json","https://opendata.rdw.nl/resource/kmfi-hrps.json"
"PD092D","Personenauto","CARTHAGO","C-TOURER T143","20240927","20220929","12393","kampeerwagen","4","WIT","GRIJS","4","2287","2760","3500","2860","750","2000","20170603","20170603","Geen verstrekking in Open Data",,"Ja",,,,,,,"3","4","0","0",,"684","0","M1",,,"r.","3500","EG/CF004",,"e1*2007/46*0778*08","FFT11","A1N4HKB254","0","0.04","380","Nee","Nee",,"Nee","5500","0","0.00","2024","Logisch","00","Ja","2024-09-27T00:00:00.000","2022-09-29T00:00:00.000","2017-06-03T00:00:00.000","2017-06-03T00:00:00.000",,,,,,,,,,,,,,,,,,,,,,,,,,,,"https://opendata.rdw.nl/resource/3huj-srit.json","https://opendata.rdw.nl/resource/8ys7-d773.json","https://opendata.rdw.nl/resource/vezc-m2t6.json","https://opendata.rdw.nl/resource/jhie-znh9.json","https://opendata.rdw.nl/resource/kmfi-hrps.json"
"PF915S","Personenauto","CARTHAGO","C-TOURER T143","20241119","20201124","12664","kampeerwagen","4","WIT","Niet geregistreerd","4","2287","2810","4250","2910","750","1800","20170703","20170703","Geen verstrekking in Open Data",,"Ja",,,,,,,"3","4","0","0",,"684","0","M1",,,"r.","4250","EG/CF004",,"e1*2007/46*0778*08","FFT11","D1N4HKB254","0","0.04","380","Nee","Nee",,"Nee","6000","0","0.00","2023","Logisch","00","Ja","2024-11-19T00:00:00.000","2020-11-24T00:00:00.000","2017-07-03T00:00:00.000","2017-07-03T00:00:00.000",,,,,,,,,,,,,,,,,,,,,,,,,,,,"https://opendata.rdw.nl/resource/3huj-srit.json","https://opendata.rdw.nl/resource/8ys7-d773.json","https://opendata.rdw.nl/resource/vezc-m2t6.json","https://opendata.rdw.nl/resource/jhie-znh9.json","https://opendata.rdw.nl/resource/kmfi-hrps.json"
"R470KN","Personenauto","CARTHAGO","C-TOURER T143","20240929","20221006","10058","kampeerwagen","4","WIT","Niet geregistreerd","4","2287","2800","3500","2900","750","1800","20141223","20221006","Geen verstrekking in Open Data","41463","Ja","146",,,,,,"3","4",,,,"684","234","M1",,,,"4250","EG/CF004",,"e1*2007/46*0778*05","FFT11","D1I4CDB54","0","0.04","380","Nee","Nee",,"Nee","5300",,,"2023","Geen oordeel","05","Ja","2024-09-29T00:00:00.000","2022-10-06T00:00:00.000","2014-12-23T00:00:00.000","2022-10-06T00:00:00.000",,,,,,,,,,,,,,,,,,,,,,"20220517","2022-05-17T00:00:00.000",,,,,"https://opendata.rdw.nl/resource/3huj-srit.json","https://opendata.rdw.nl/resource/8ys7-d773.json","https://opendata.rdw.nl/resource/vezc-m2t6.json","https://opendata.rdw.nl/resource/jhie-znh9.json","https://opendata.rdw.nl/resource/kmfi-hrps.json"
"RV535T","Personenauto","CARTHAGO","C-TOURER T143","20240606","20180602","11750","kampeerwagen","4","WIT","Niet geregistreerd","4","2287","2800","3500","2900","750","1800","20170412","20180602","Geen verstrekking in Open Data",,"Ja",,,,,,,"3","4",,,,,,"M1",,,"r.","4250","EG/CF004",,,,,,"0.04","380","Nee","Nee",,"Nee","5300",,,"2023","Geen oordeel","05","Ja","2024-06-06T00:00:00.000","2018-06-02T00:00:00.000","2017-04-12T00:00:00.000","2018-06-02T00:00:00.000",,,,,,,,,,,,,,,,,,,,,,,,,,,,"https://opendata.rdw.nl/resource/3huj-srit.json","https://opendata.rdw.nl/resource/8ys7-d773.json","https://opendata.rdw.nl/resource/vezc-m2t6.json","https://opendata.rdw.nl/resource/jhie-znh9.json","https://opendata.rdw.nl/resource/kmfi-hrps.json"
"SR859G","Personenauto","CARTHAGO","C-TOURER T143","20240908","20200915","12287","kampeerwagen","4","WIT","Niet geregistreerd","4","2287","2800","3500","2900",,,"20180529","20180529","Geen verstrekking in Open Data",,"Ja",,,,,,,"3","4","0","0",,"684","0","M1",,,"r.","3500","EG/CF004",,"e1*2007/46*0778*10","T11","A1N4HKB254","0","0.04","380","Nee","Nee",,"Nee","5500","0","0.00","2023","Logisch","00","Ja","2024-09-08T00:00:00.000","2020-09-15T00:00:00.000","2018-05-29T00:00:00.000","2018-05-29T00:00:00.000",,,,,,,,,,,,,,,,,,,,,,,,,,,,"https://opendata.rdw.nl/resource/3huj-srit.json","https://opendata.rdw.nl/resource/8ys7-d773.json","https://opendata.rdw.nl/resource/vezc-m2t6.json","https://opendata.rdw.nl/resource/jhie-znh9.json","https://opendata.rdw.nl/resource/kmfi-hrps.json"
"SV692T","Personenauto","CARTHAGO","C-TOURER T143","20240920","20221014","12287","kampeerwagen","4","WIT","Niet geregistreerd","4","2287","2800","3500","2900","750","2000","20180612","20180612","Geen verstrekking in Open Data",,"Ja",,,,,,,"3","4","0","0",,"684","0","M1",,,"r.","3500","EG/CF004",,"e1*2007/46*0778*10","T11","A1N4HKB254","0","0.04","380","Nee","Nee",,"Nee","5500","0","0.00","2023","Logisch","00","Ja","2024-09-20T00:00:00.000","2022-10-14T00:00:00.000","2018-06-12T00:00:00.000","2018-06-12T00:00:00.000",,,,,,,,,,,,,,,,,,,,,,,,,,,,"https://opendata.rdw.nl/resource/3huj-srit.json","https://opendata.rdw.nl/resource/8ys7-d773.json","https://opendata.rdw.nl/resource/vezc-m2t6.json","https://opendata.rdw.nl/resource/jhie-znh9.json","https://opendata.rdw.nl/resource/kmfi-hrps.json"
"T898RR","Personenauto","CARTHAGO","C-TOURER T143","20250331","20230816","4017","kampeerwagen","4","WIT","Niet geregistreerd","4","2287","2810","3500","2910","750","2000","20170403","20230816","Geen verstrekking in Open Data","41050","Ja","146",,,,,,"3","4",,,,"684","234","M1",,,,"3500","EG/CF004",,"e1*2007/46*0778*08","FFT11","C1N4DIB254","0","0.04","380","Nee","Nee",,"Nee","5500",,,"2024","Geen oordeel","05","Ja","2025-03-31T00:00:00.000","2023-08-16T00:00:00.000","2017-04-03T00:00:00.000","2023-08-16T00:00:00.000",,,,,,,,,,,"294",,,,,,,,,,,"20230808","2023-08-08T00:00:00.000",,,,,"https://opendata.rdw.nl/resource/3huj-srit.json","https://opendata.rdw.nl/resource/8ys7-d773.json","https://opendata.rdw.nl/resource/vezc-m2t6.json","https://opendata.rdw.nl/resource/jhie-znh9.json","https://opendata.rdw.nl/resource/kmfi-hrps.json"
"TS833J","Personenauto","CARTHAGO","C-TOURER T143","20241009","20181009","12457","kampeerwagen","4","WIT","Niet geregistreerd","4","2287","2850","3500","2950",,,"20181009","20181009","Geen verstrekking in Open Data",,"Ja",,,,,,,"3","4","0","0",,"684","0","M1",,,"r.","4250","EG/CF004",,"e1*2007/46*0778*10","T11","D1N4HKB254","0","0.04","380","Nee","Nee",,"Nee","6000","0","0.00","2023","Logisch","00","Ja","2024-10-09T00:00:00.000","2018-10-09T00:00:00.000","2018-10-09T00:00:00.000","2018-10-09T00:00:00.000",,,,,,,,,,,,,,,,,,,,,,,,,,,,"https://opendata.rdw.nl/resource/3huj-srit.json","https://opendata.rdw.nl/resource/8ys7-d773.json","https://opendata.rdw.nl/resource/vezc-m2t6.json","https://opendata.rdw.nl/resource/jhie-znh9.json","https://opendata.rdw.nl/resource/kmfi-hrps.json"
"TX282T","Personenauto","CARTHAGO","C-TOURER T143","20241018","20181108","12318","kampeerwagen","4","WIT","Niet geregistreerd","4","2287","2850","3500","2950","750","1800","20181018","20181108","Geen verstrekking in Open Data",,"Ja",,,,,,,"3","4",,,,,,"M1",,,"r.","4250","EG/CF004",,,,,,"0.04","380","Nee","Nee",,"Nee","5300",,,"2023","Logisch","00","Ja","2024-10-18T00:00:00.000","2018-11-08T00:00:00.000","2018-10-18T00:00:00.000","2018-11-08T00:00:00.000",,,,,,,,,,,,,,,,,,,,,,,,,,,,"https://opendata.rdw.nl/resource/3huj-srit.json","https://opendata.rdw.nl/resource/8ys7-d773.json","https://opendata.rdw.nl/resource/vezc-m2t6.json","https://opendata.rdw.nl/resource/jhie-znh9.json","https://opendata.rdw.nl/resource/kmfi-hrps.json"
"X170FV","Personenauto","CARTHAGO","C-TOURER T143","20250731","20231117","10299","kampeerwagen","4","WIT","GRIJS","4","2287","2760","3500","2860","750","2000","20160719","20231117","Geen verstrekking in Open Data","42487","Ja","143",,,,,,"3","4",,,,"684","234","M1",,,"r.","3500","EG/CF004",,"e1*2007/46*0778*07","FFT11","A1H4BDB54","0","0.03","380","Nee","Nee",,"Nee","5500",,,"2023","Geen oordeel","05","Ja","2025-07-31T00:00:00.000","2023-11-17T00:00:00.000","2016-07-19T00:00:00.000","2023-11-17T00:00:00.000",,,,,,,,,,,"307",,,,,,,,,,,"20231025","2023-10-25T00:00:00.000",,,,,"https://opendata.rdw.nl/resource/3huj-srit.json","https://opendata.rdw.nl/resource/8ys7-d773.json","https://opendata.rdw.nl/resource/vezc-m2t6.json","https://opendata.rdw.nl/resource/jhie-znh9.json","https://opendata.rdw.nl/resource/kmfi-hrps.json"
"XS601S","Personenauto","CARTHAGO","C-TOURER T143","20241221","20240119","11449","kampeerwagen","4","WIT","Niet geregistreerd","4","2287","2800","3500","2900","750","2000","20150625","20190315","Geen verstrekking in Open Data","47319","Ja",,,,,,,"3","4","0","0",,"684","0","M1",,,"r.","3500","EG/CF004",,"e1*2007/46*0778*05","FFT11","C1I4CDB54","0","0.04","380","Nee","Nee",,"Nee","5500","0","0.00","2024","Geen oordeel","05","Ja","2024-12-21T00:00:00.000","2024-01-19T00:00:00.000","2015-06-25T00:00:00.000","2019-03-15T00:00:00.000",,,,,,,,,,,,,,,,,,,,,,,,,,,,"https://opendata.rdw.nl/resource/3huj-srit.json","https://opendata.rdw.nl/resource/8ys7-d773.json","https://opendata.rdw.nl/resource/vezc-m2t6.json","https://opendata.rdw.nl/resource/jhie-znh9.json","https://opendata.rdw.nl/resource/kmfi-hrps.json"
"ZB033T","Personenauto","CARTHAGO","C-TOURER T143","20250513","20190802","11901","kampeerwagen","4","WIT","Niet geregistreerd","4","2287","2800","3500","2900","750","1800","20151119","20190426","Geen verstrekking in Open Data",,"Ja",,,,,,,"3","4","0","0",,"684","0","M1",,,"r.","4250","EG/CF004",,"e1*2007/46*0778*05","FFT11","D1I4CFB54","0","0.04","380","Nee","Nee",,"Nee","6000","0","0.00","2024","Geen oordeel","05","Ja","2025-05-13T00:00:00.000","2019-08-02T00:00:00.000","2015-11-19T00:00:00.000","2019-04-26T00:00:00.000",,,,,,,,,,,,,,,,,,,,,,,,,,,,"https://opendata.rdw.nl/resource/3huj-srit.json","https://opendata.rdw.nl/resource/8ys7-d773.json","https://opendata.rdw.nl/resource/vezc-m2t6.json","https://opendata.rdw.nl/resource/jhie-znh9.json","https://opendata.rdw.nl/resource/kmfi-hrps.json"
