"kenteken","voertuigsoort","merk","handelsbenaming","vervaldatum_apk","datum_tenaamstelling","bruto_bpm","inrichting","aantal_zitplaatsen","eerste_kleur","tweede_kleur","aantal_cilinders","cilinderinhoud","massa_ledig_voertuig","toegestane_maximum_massa_voertuig","massa_rijklaar","maximum_massa_trekken_ongeremd","maximum_trekken_massa_geremd","datum_eerste_toelating","datum_eerste_tenaamstelling_in_nederland","wacht_op_keuren","catalogusprijs","wam_verzekerd","maximale_constructiesnelheid","laadvermogen","oplegger_geremd","aanhangwagen_autonoom_geremd","aanhangwagen_middenas_geremd","aantal_staanplaatsen","aantal_deuren","aantal_wielen","afstand_hart_koppeling_tot_achterzijde_voertuig","afstand_voorzijde_voertuig_tot_hart_koppeling","afwijkende_maximum_snelheid","lengte","breedte","europese_voertuigcategorie","europese_voertuigcategorie_toevoeging","europese_uitvoeringcategorie_toevoeging","plaats_chassisnummer","technische_max_massa_voertuig","type","type_gasinstallatie","typegoedkeuringsnummer","variant","uitvoering","volgnummer_wijziging_eu_typegoedkeuring","vermogen_massarijklaar","wielbasis","export_indicator","openstaande_terugroepactie_indicator","vervaldatum_tachograaf","taxi_indicator","maximum_massa_samenstelling","aantal_rolstoelplaatsen","maximum_ondersteunende_snelheid","jaar_laatste_registratie_tellerstand","tellerstandoordeel","code_toelichting_tellerstandoordeel","tenaamstellen_mogelijk","vervaldatum_apk_dt","datum_tenaamstelling_dt","datum_eerste_toelating_dt","datum_eerste_tenaamstelling_in_nederland_dt","vervaldatum_tachograaf_dt","maximum_last_onder_de_vooras_sen_tezamen_koppeling","type_remsysteem_voertuig_code","rupsonderstelconfiguratiecode","wielbasis_voertuig_minimum","wielbasis_voertuig_maximum","lengte_voertuig_minimum","lengte_voertuig_maximum","breedte_voertuig_minimum","breedte_voertuig_maximum","hoogte_voertuig","hoogte_voertuig_minimum","hoogte_voertuig_maximum","massa_bedrijfsklaar_minimaal","massa_bedrijfsklaar_maximaal","technisch_toelaatbaar_massa_koppelpunt","maximum_massa_technisch_maximaal","maximum_massa_technisch_minimaal","subcategorie_nederland","verticale_belasting_koppelpunt_getrokken_voertuig","zuinigheidsclassificatie","registratie_datum_goedkeuring_afschrijvingsmoment_bpm","registratie_datum_goedkeuring_afschrijvingsmoment_bpm_dt","gem_lading_wrde","aerodyn_voorz","massa_alt_aandr","verl_cab_ind","api_gekentekende_voertuigen_assen","api_gekentekende_voertuigen_brandstof","api_gekentekende_voertuigen_carrosserie","api_gekentekende_voertuigen_carrosserie_specifiek","api_gekentekende_voertuigen_voertuigklasse"
"G172KL","Personenauto","BMW I","I8","20251019","20210126","2618","cabriolet","2","GRIJS","ZWART","3","1499","1570","1900","1670",,,"20191019","20191019","Geen verstrekking in Open Data","172958","Ja","250",,,,,,"2","4","0","0",,"469","194","M1",,,,"1900","BMWI-2",,"e1*2007/46*1287*07","2Z61","DAW200T0","0","0.10","280","Nee","Nee",,"Nee","0","0","0.00","2024","Logisch","00","Ja","2025-10-19T00:00:00.000","2021-01-26T00:00:00.000","2019-10-19T00:00:00.000","2019-10-19T00:00:00.000",,,,,,,,,,,"129",,,,,,,,,,,,,,,,,"https://opendata.rdw.nl/resource/3huj-srit.json","https://opendata.rdw.nl/resource/8ys7-d773.json","https://opendata.rdw.nl/resource/vezc-m2t6.json","https://opendata.rdw.nl/resource/jhie-znh9.json","https://opendata.rdw.nl/resource/kmfi-hrps.json"
"H381VS","Personenauto","BMW I","I8","20240606","20200606","2586","cabriolet","2","WIT","ZWART","3","1499","1570","1900","1670",,,"20200606","20200606","Geen verstrekking in Open Data","182866","Ja","250",,,,,,"2","4","0","0",,"469","194","M1",,,,"1900","BMWI-2",,"e1*2007/46*1287*07","2Z61","DAW200T0","0","0.10","280","Nee","Nee",,"Nee","0","0","0.00","2023","Logisch","00","Ja","2024-06-06T00:00:00.000","2020-06-06T00:00:00.000","2020-06-06T00:00:00.000","2020-06-06T00:00:00.000",,,,,,,,,,,"129",,,,,,,,,,"A",,,,,,,"https://opendata.rdw.nl/resource/3huj-srit.json","https://opendata.rdw.nl/resource/8ys7-d773.json","https://opendata.rdw.nl/resource/vezc-m2t6.json","https://opendata.rdw.nl/resource/jhie-znh9.json","https://opendata.rdw.nl/resource/kmfi-hrps.json"
"H473TV","Personenauto","BMW I","I8","20240525","20240420","2586","cabriolet","2","GRIJS","Niet geregistreerd","3","1499","1570","1900","1670",,,"20200525","20200525","Geen verstrekking in Open Data","186295","Nee","250",,,,,,"2","4","0","0",,"469","194","M1",,,,"1900","BMWI-2",,"e1*2007/46*1287*07","2Z61","DAW200T0","0","0.10","280","Nee","Nee",,"Nee","0","0","0.00","2024","Logisch","00","Ja","2024-05-25T00:00:00.000","2024-04-20T00:00:00.000","2020-05-25T00:00:00.000","2020-05-25T00:00:00.000",,,,,,,,,,,"129",,,,,,,,,,"A",,,,,,,"https://opendata.rdw.nl/resource/3huj-srit.json","https://opendata.rdw.nl/resource/8ys7-d773.json","https://opendata.rdw.nl/resource/vezc-m2t6.json","https://opendata.rdw.nl/resource/jhie-znh9.json","https://opendata.rdw.nl/resource/kmfi-hrps.json"
"H582KL","Personenauto","BMW I","I8","20240302","20231227","2586","cabriolet","2","GRIJS","Niet geregistreerd","3","1499","1570","1900","1670",,,"20200302","20200302","Geen verstrekking in Open Data","175544","Ja","250",,,,,,"2","4","0","0",,"469","194","M1",,,,"1900","BMWI-2",,"e1*2007/46*1287*07","2Z61","DAW200T0","0","0.10","280","Nee","Nee",,"Nee","0","0","0.00","2023","Logisch","00","Ja","2024-03-02T00:00:00.000","2023-12-27T00:00:00.000","2020-03-02T00:00:00.000","2020-03-02T00:00:00.000",,,,,,,,,,,"129",,,,,,,,,,"A",,,,,,,"https://opendata.rdw.nl/resource/3huj-srit.json","https://opendata.rdw.nl/resource/8ys7-d773.json","https://opendata.rdw.nl/resource/vezc-m2t6.json","https://opendata.rdw.nl/resource/jhie-znh9.json","https://opendata.rdw.nl/resource/kmfi-hrps.json"
"J312JD","Personenauto","BMW I","I8","20240814","20200811","1353","cabriolet","2","ORANJE","Niet geregistreerd","3","1499","1570","1900","1670",,,"20180814","20200811","Geen verstrekking in Open Data","179201","Ja","250",,,,,,"2","4","0","0",,"469","194","M1",,,,"1900","BMWI-2",,"e1*2007/46*1287*04","2Z61","6AW20000","0","0.04","280","Nee","Nee",,"Nee","0","0","0.00","2022","Geen oordeel","05","Ja","2024-08-14T00:00:00.000","2020-08-11T00:00:00.000","2018-08-14T00:00:00.000","2020-08-11T00:00:00.000",,,,,,,,,,,"129",,,,,,,,,,,,,,,,,"https://opendata.rdw.nl/resource/3huj-srit.json","https://opendata.rdw.nl/resource/8ys7-d773.json","https://opendata.rdw.nl/resource/vezc-m2t6.json","https://opendata.rdw.nl/resource/jhie-znh9.json","https://opendata.rdw.nl/resource/kmfi-hrps.json"
"L809VZ","Personenauto","BMW I","I8","20250620","20210818","2143","cabriolet","2","GRIJS","Niet geregistreerd","3","1499","1570","1900","1670",,,"20200609","20210818","Geen verstrekking in Open Data","169474","Ja","250",,,,,,"2","4","0","0",,"469","194","M1",,,,"1900","BMWI-2",,"e1*2007/46*1287*07","2Z61","DAW200T0","0","0.04","280","Nee","Nee",,"Nee","0","0","0.00","2024","Geen oordeel","05","Ja","2025-06-20T00:00:00.000","2021-08-18T00:00:00.000","2020-06-09T00:00:00.000","2021-08-18T00:00:00.000",,,,,,,,,,,"129",,,,,,,,,,,,,,,,,"https://opendata.rdw.nl/resource/3huj-srit.json","https://opendata.rdw.nl/resource/8ys7-d773.json","https://opendata.rdw.nl/resource/vezc-m2t6.json","https://opendata.rdw.nl/resource/jhie-znh9.json","https://opendata.rdw.nl/resource/kmfi-hrps.json"
"N017TZ","Personenauto","BMW I","I8","20251031","20211224","1379","cabriolet","2","WIT","ZWART","3","1499","1570","1900","1670",,,"20181108","20211224","Geen verstrekking in Open Data","162780","Ja","250",,,,,,"2","4","0","0",,"469","194","M1",,,,"1900","BMWI-2",,"e1*2007/46*1287*04","2Z61","6AW20000","0","0.04","280","Nee","Nee",,"Nee","0","0","0.00","2023","Geen oordeel","05","Ja","2025-10-31T00:00:00.000","2021-12-24T00:00:00.000","2018-11-08T00:00:00.000","2021-12-24T00:00:00.000",,,,,,,,,,,"129",,,,,,,,,,,"20211223","2021-12-23T00:00:00.000",,,,,"https://opendata.rdw.nl/resource/3huj-srit.json","https://opendata.rdw.nl/resource/8ys7-d773.json","https://opendata.rdw.nl/resource/vezc-m2t6.json","https://opendata.rdw.nl/resource/jhie-znh9.json","https://opendata.rdw.nl/resource/kmfi-hrps.json"
"N057DT","Personenauto","BMW I","I8","20250921","20230922","1962","cabriolet","2","ORANJE","Niet geregistreerd","3","1499","1570","1900","1670",,,"20180509","20210923","Geen verstrekking in Open Data","173987","Ja","250",,,,,,"2","4","0","0",,"469","194","M1",,,,"1900","BMWI-2",,"e1*2007/46*1287*04","2Z61","6AW20000","0","0.04","280","Nee","Nee",,"Nee","0","0","0.00","2023","Geen oordeel","05","Ja","2025-09-21T00:00:00.000","2023-09-22T00:00:00.000","2018-05-09T00:00:00.000","2021-09-23T00:00:00.000",,,,,,,,,,,"129",,,,,,,,,,,,,,,,,"https://opendata.rdw.nl/resource/3huj-srit.json","https://opendata.rdw.nl/resource/8ys7-d773.json","https://opendata.rdw.nl/resource/vezc-m2t6.json","https://opendata.rdw.nl/resource/jhie-znh9.json","https://opendata.rdw.nl/resource/kmfi-hrps.json"
"N878HB","Personenauto","BMW I","I8","20251110","20231122","1961","cabriolet","2","ORANJE","Niet geregistreerd","3","1499","1570","1900","1670",,,"20180716","20211008","Geen verstrekking in Open Data","186385","Ja","250",,,,,,"2","4","0","0",,"469","194","M1",,,,"1900","BMWI-2",,"e1*2007/46*1287*04","2Z61","6AW20000","0","0.04","280","Nee","Nee",,"Nee","0","0","0.00","2023","Geen oordeel","05","Ja","2025-11-10T00:00:00.000","2023-11-22T00:00:00.000","2018-07-16T00:00:00.000","2021-10-08T00:00:00.000",,,,,,,,,,,"129",,,,,,,,,,,,,,,,,"https://opendata.rdw.nl/resource/3huj-srit.json","https://opendata.rdw.nl/resource/8ys7-d773.json","https://opendata.rdw.nl/resource/vezc-m2t6.json","https://opendata.rdw.nl/resource/jhie-znh9.json","https://opendata.rdw.nl/resource/kmfi-hrps.json"
"R248VS","Personenauto","BMW I","I8","20260516","20221207","1251","cabriolet","2","WIT","Niet geregistreerd","3","1499","1570","1900","1670",,,"20200430","20221207","Geen verstrekking in Open Data","174709","Ja","250",,,,,,"2","4","0","0",,"469","194","M1",,,,"1900","BMWI-2",,"e1*2007/46*1287*07","2Z61","DAW200T0","0","0.04","280","Nee","Nee",,"Nee","0","0","0.00","2024","Geen oordeel","05","Ja","2026-05-16T00:00:00.000","2022-12-07T00:00:00.000","2020-04-30T00:00:00.000","2022-12-07T00:00:00.000",,,,,,,,,,,"129",,,,,,,,,,,"20221123","2022-11-23T00:00:00.000",,,,,"https://opendata.rdw.nl/resource/3huj-srit.json","https://opendata.rdw.nl/resource/8ys7-d773.json","https://opendata.rdw.nl/resource/vezc-m2t6.json","https://opendata.rdw.nl/resource/jhie-znh9.json","https://opendata.rdw.nl/resource/kmfi-hrps.json"
"S595SX","Personenauto","BMW I","I8","20250406","20230331","1962","cabriolet","2","GRIJS","Niet geregistreerd","3","1499","1570","1900","1670",,,"20180626","20230331","Geen verstrekking in Open Data","181605","Ja","250",,,,,,"2","4","0","0",,"469","194","M1",,,,"1900","BMWI-2",,"e1*2007/46*1287*04","2Z61","6AW20000","0","0.04","280","Nee","Nee",,"Nee","0","0","0.00","2024","Geen oordeel","05","Ja","2025-04-06T00:00:00.000","2023-03-31T00:00:00.000","2018-06-26T00:00:00.000","2023-03-31T00:00:00.000",,,,,,,,,,,"129",,,,,,,,,,,"20230328","2023-03-28T00:00:00.000",,,,,"https://opendata.rdw.nl/resource/3huj-srit.json","https://opendata.rdw.nl/resource/8ys7-d773.json","https://opendata.rdw.nl/resource/vezc-m2t6.json","https://opendata.rdw.nl/resource/jhie-znh9.json","https://opendata.rdw.nl/resource/kmfi-hrps.json"
"S719RS","Personenauto","BMW I","I8","20260222","20240226","1962","cabriolet","2","GRIJS","Niet geregistreerd","3","1499","1570","1900","1670",,,"20180910","20230327","Geen verstrekking in Open Data","162780","Ja","250",,,,,,"2","4","0","0",,"469","194","M1",,,,"1900","BMWI-2",,"e1*2007/46*1287*04","2Z61","6AW20000","0","0.04","280","Nee","Nee",,"Nee","0","0","0.00","2024","Geen oordeel","05","Ja","2026-02-22T00:00:00.000","2024-02-26T00:00:00.000","2018-09-10T00:00:00.000","2023-03-27T00:00:00.000",,,,,,,,,,,"129",,,,,,,,,,,"20230320","2023-03-20T00:00:00.000",,,,,"https://opendata.rdw.nl/resource/3huj-srit.json","https://opendata.rdw.nl/resource/8ys7-d773.json","https://opendata.rdw.nl/resource/vezc-m2t6.json","https://opendata.rdw.nl/resource/jhie-znh9.json","https://opendata.rdw.nl/resource/kmfi-hrps.json"
"S897NR","Personenauto","BMW I","I8","20241130","20230303","1961","cabriolet","2","ORANJE","Niet geregistreerd","3","1499","1570","1900","1670",,,"20180523","20230303","Geen verstrekking in Open Data","175299","Ja","250",,,,,,"2","4","0","0",,"469","194","M1",,,"r. by voorzitting","1900","BMWI-2",,"e1*2007/46*1287*04","2Z61","6AW20000","0","0.04","280","Nee","Nee",,"Nee","0","0","0.00","2023","Geen oordeel","05","Ja","2024-11-30T00:00:00.000","2023-03-03T00:00:00.000","2018-05-23T00:00:00.000","2023-03-03T00:00:00.000",,,,,,,,,,,"129",,,,,,,,,,,"20230224","2023-02-24T00:00:00.000",,,,,"https://opendata.rdw.nl/resource/3huj-srit.json","https://opendata.rdw.nl/resource/8ys7-d773.json","https://opendata.rdw.nl/resource/vezc-m2t6.json","https://opendata.rdw.nl/resource/jhie-znh9.json","https://opendata.rdw.nl/resource/kmfi-hrps.json"
"SP245N","Personenauto","BMW I","I8","20260526","20200129",,"cabriolet","2","ORANJE","Niet geregistreerd","3","1499","1570","1900","1670",,,"20180526","20180526","Geen verstrekking in Open Data","171872","Ja",,,,,,,"2","4","0","0",,"469","194","M1",,,,"1900","BMWI-2",,"e1*2007/46*1287*04","2Z61","6AW20000","0","0.10","280","Nee","Nee",,"Nee","0","0","0.00","2024","Logisch","00","Ja","2026-05-26T00:00:00.000","2020-01-29T00:00:00.000","2018-05-26T00:00:00.000","2018-05-26T00:00:00.000",,,,,,,,,,,"129",,,,,,,,,,,,,,,,,"https://opendata.rdw.nl/resource/3huj-srit.json","https://opendata.rdw.nl/resource/8ys7-d773.json","https://opendata.rdw.nl/resource/vezc-m2t6.json","https://opendata.rdw.nl/resource/jhie-znh9.json","https://opendata.rdw.nl/resource/kmfi-hrps.json"
"SP977F","Personenauto","BMW I","I8","20260519","20180519",,"cabriolet","2","WIT","ZWART","3","1499","1570","1900","1670",,,"20180519","20180519","Geen verstrekking in Open Data","169574","Ja",,,,,,,"2","4","0","0",,"469","194","M1",,,,"1900","BMWI-2",,"e1*2007/46*1287*04","2Z61","6AW20000","0","0.10","280","Nee","Nee",,"Nee","0","0","0.00","2024","Logisch","00","Ja","2026-05-19T00:00:00.000","2018-05-19T00:00:00.000","2018-05-19T00:00:00.000","2018-05-19T00:00:00.000",,,,,,,,,,,"129",,,,,,,,,,,,,,,,,"https://opendata.rdw.nl/resource/3huj-srit.json","https://opendata.rdw.nl/resource/8ys7-d773.json","https://opendata.rdw.nl/resource/vezc-m2t6.json","https://opendata.rdw.nl/resource/jhie-znh9.json","https://opendata.rdw.nl/resource/kmfi-hrps.json"
"SR957X","Personenauto","BMW I","I8","20240601","20180619",,"cabriolet","2","GRIJS","ZWART","3","1499","1570","1900","1670",,,"20180601","20180601","Geen verstrekking in Open Data","177389","Ja",,,,,,,"2","4","0","0",,"469","194","M1",,,,"1900","BMWI-2",,"e1*2007/46*1287*04","2Z61","6AW20000","0","0.10","280","Nee","Nee",,"Nee","0","0","0.00","2023","Logisch","00","Ja","2024-06-01T00:00:00.000","2018-06-19T00:00:00.000","2018-06-01T00:00:00.000","2018-06-01T00:00:00.000",,,,,,,,,,,"129",,,,,,,,,,,,,,,,,"https://opendata.rdw.nl/resource/3huj-srit.json","https://opendata.rdw.nl/resource/8ys7-d773.json","https://opendata.rdw.nl/resource/vezc-m2t6.json","https://opendata.rdw.nl/resource/jhie-znh9.json","https://opendata.rdw.nl/resource/kmfi-hrps.json"
"ST406F","Personenauto","BMW I","I8","20260530","20230210",,"cabriolet","2","GRIJS","Niet geregistreerd","3","1499","1570","1900","1670",,,"20180530","20180530","Geen verstrekking in Open Data","171009","Ja",,,,,,,"2","4","0","0",,"469","194","M1",,,,"1900","BMWI-2",,"e1*2007/46*1287*04","2Z61","6AW20000","0","0.10","280","Nee","Nee",,"Nee","0","0","0.00","2024","Logisch","00","Ja","2026-05-30T00:00:00.000","2023-02-10T00:00:00.000","2018-05-30T00:00:00.000","2018-05-30T00:00:00.000",,,,,,,,,,,"129",,,,,,,,,,,,,,,,,"https://opendata.rdw.nl/resource/3huj-srit.json","https://opendata.rdw.nl/resource/8ys7-d773.json","https://opendata.rdw.nl/resource/vezc-m2t6.json","https://opendata.rdw.nl/resource/jhie-znh9.json","https://opendata.rdw.nl/resource/kmfi-hrps.json"
"ST806R","Personenauto","BMW I","I8","20250609","20210923",,"cabriolet","2","GRIJS","Niet geregistreerd","3","1499","1570","1900","1670",,,"20180607","20180607","Geen verstrekking in Open Data","182592","Ja",,,,,,,"2","4","0","0",,"469","194","M1",,,,"1900","BMWI-2",,"e1*2007/46*1287*04","2Z61","6AW20000","0","0.10","280","Nee","Nee",,"Nee","0","0","0.00","2023","Logisch","00","Ja","2025-06-09T00:00:00.000","2021-09-23T00:00:00.000","2018-06-07T00:00:00.000","2018-06-07T00:00:00.000",,,,,,,,,,,"129",,,,,,,,,,,,,,,,,"https://opendata.rdw.nl/resource/3huj-srit.json","https://opendata.rdw.nl/resource/8ys7-d773.json","https://opendata.rdw.nl/resource/vezc-m2t6.json","https://opendata.rdw.nl/resource/jhie-znh9.json","https://opendata.rdw.nl/resource/kmfi-hrps.json"
"SV433H","Personenauto","BMW I","I8","20250523","20180614",,"cabriolet","2","ORANJE","Niet geregistreerd","3","1499","1570","1900","1670",,,"20180614","20180614","Geen verstrekking in Open Data","182438","Ja",,,,,,,"2","4","0","0",,"469","194","M1",,,,"1900","BMWI-2",,"e1*2007/46*1287*04","2Z61","6AW20000","0","0.10","280","Nee","Nee",,"Nee","0","0","0.00","2024","Logisch","00","Ja","2025-05-23T00:00:00.000","2018-06-14T00:00:00.000","2018-06-14T00:00:00.000","2018-06-14T00:00:00.000",,,,,,,,,,,"129",,,,,,,,,,,,,,,,,"https://opendata.rdw.nl/resource/3huj-srit.json","https://opendata.rdw.nl/resource/8ys7-d773.json","https://opendata.rdw.nl/resource/vezc-m2t6.json","https://opendata.rdw.nl/resource/jhie-znh9.json","https://opendata.rdw.nl/resource/kmfi-hrps.json"
"SX464X","Personenauto","BMW I","I8","20250822","20230825","1962","cabriolet","2","ORANJE","Niet geregistreerd","3","1499","1570","1900","1670",,,"20180621","20180621","Geen verstrekking in Open Data","174515","Ja",,,,,,,"2","4","0","0",,"469","194","M1",,,,"1900","BMWI-2",,"e1*2007/46*1287*04","2Z61","6AW20000","0","0.10","280","Nee","Nee",,"Nee","0","0","0.00","2023","Logisch","00","Ja","2025-08-22T00:00:00.000","2023-08-25T00:00:00.000","2018-06-21T00:00:00.000","2018-06-21T00:00:00.000",,,,,,,,,,,"129",,,,,,,,,,,,,,,,,"https://opendata.rdw.nl/resource/3huj-srit.json","https://opendata.rdw.nl/resource/8ys7-d773.json","https://opendata.rdw.nl/resource/vezc-m2t6.json","https://opendata.rdw.nl/resource/jhie-znh9.json","https://opendata.rdw.nl/resource/kmfi-hrps.json"
"SX556N","Personenauto","BMW I","I8","20240803","20230413","1962","cabriolet","2","GRIJS","Niet geregistreerd","3","1499","1570","1900","1670",,,"20180615","20180615","Geen verstrekking in Open Data","179945","Ja",,,,,,,"2","4","0","0",,"469","194","M1",,,,"1900","BMWI-2",,"e1*2007/46*1287*04","2Z61","6AW20000","0","0.10","280","Nee","Nee",,"Nee","0","0","0.00","2024","Logisch","00","Ja","2024-08-03T00:00:00.000","2023-04-13T00:00:00.000","2018-06-15T00:00:00.000","2018-06-15T00:00:00.000",,,,,,,,,,,"129",,,,,,,,,,,,,,,,,"https://opendata.rdw.nl/resource/3huj-srit.json","https://opendata.rdw.nl/resource/8ys7-d773.json","https://opendata.rdw.nl/resource/vezc-m2t6.json","https://opendata.rdw.nl/resource/jhie-znh9.json","https://opendata.rdw.nl/resource/kmfi-hrps.json"
"SZ740H","Personenauto","BMW I","I8","20240705","20201223","1962","cabriolet","2","GRIJS","ZWART","3","1499","1570","1900","1670",,,"20180705","20180705","Geen verstrekking in Open Data","171363","Ja",,,,,,,"2","4","0","0",,"469","194","M1",,,,"1900","BMWI-2",,"e1*2007/46*1287*04","2Z61","6AW20000","0","0.10","280","Nee","Nee",,"Nee","0","0","0.00","2024","Logisch","00","Ja","2024-07-05T00:00:00.000","2020-12-23T00:00:00.000","2018-07-05T00:00:00.000","2018-07-05T00:00:00.000",,,,,,,,,,,"129",,,,,,,,,,,,,,,,,"https://opendata.rdw.nl/resource/3huj-srit.json","https://opendata.rdw.nl/resource/8ys7-d773.json","https://opendata.rdw.nl/resource/vezc-m2t6.json","https://opendata.rdw.nl/resource/jhie-znh9.json","https://opendata.rdw.nl/resource/kmfi-hrps.json"
"T038PD","Personenauto","BMW I","I8","20250731","20230726","1962","cabriolet","2","WIT","ZWART","3","1499","1570","1900","1670",,,"20191218","20230726","Geen verstrekking in Open Data","180408","Ja","250",,,,,,"2","4","0","0",,"469","194","M1",,,,"1900","BMWI-2",,"e1*2007/46*1287*06","2Z61","DAW200T0","0","0.04","280","Nee","Nee",,"Nee","0","0","0.00","2023","Geen oordeel","05","Ja","2025-07-31T00:00:00.000","2023-07-26T00:00:00.000","2019-12-18T00:00:00.000","2023-07-26T00:00:00.000",,,,,,,,,,,"129",,,,,,,,,,,"20230721","2023-07-21T00:00:00.000",,,,,"https://opendata.rdw.nl/resource/3huj-srit.json","https://opendata.rdw.nl/resource/8ys7-d773.json","https://opendata.rdw.nl/resource/vezc-m2t6.json","https://opendata.rdw.nl/resource/jhie-znh9.json","https://opendata.rdw.nl/resource/kmfi-hrps.json"
"T890TX","Personenauto","BMW I","I8","20250831","20230902","2227","cabriolet","2","GRIJS","Niet geregistreerd","3","1499","1570","1900","1670",,,"20200603","20230902","Geen verstrekking in Open Data","185049","Ja","250",,,,,,"2","4","0","0",,"469","194","M1",,,,"1900","BMWI-2",,"e1*2007/46*1287*07","2Z61","DAW200T0","0","0.04","280","Nee","Nee",,"Nee","0","0","0.00","2023","Geen oordeel","05","Ja","2025-08-31T00:00:00.000","2023-09-02T00:00:00.000","2020-06-03T00:00:00.000","2023-09-02T00:00:00.000",,,,,,,,,,,"129",,,,,,,,,,,"20230901","2023-09-01T00:00:00.000",,,,,"https://opendata.rdw.nl/resource/3huj-srit.json","https://opendata.rdw.nl/resource/8ys7-d773.json","https://opendata.rdw.nl/resource/vezc-m2t6.json","https://opendata.rdw.nl/resource/jhie-znh9.json","https://opendata.rdw.nl/resource/kmfi-hrps.json"
"TD064G","Personenauto","BMW I","I8","20240818","20180710","1962","cabriolet","2","GRIJS","Niet geregistreerd","3","1499","1570","1900","1670",,,"20180710","20180710","Geen verstrekking in Open Data","184944","Ja",,,,,,,"2","4","0","0",,"469","194","M1",,,,"1900","BMWI-2",,"e1*2007/46*1287*04","2Z61","6AW20000","0","0.10","280","Nee","Nee",,"Nee","0","0","0.00","2024","Logisch","00","Ja","2024-08-18T00:00:00.000","2018-07-10T00:00:00.000","2018-07-10T00:00:00.000","2018-07-10T00:00:00.000",,,,,,,,,,,"129",,,,,,,,,,,,,,,,,"https://opendata.rdw.nl/resource/3huj-srit.json","https://opendata.rdw.nl/resource/8ys7-d773.json","https://opendata.rdw.nl/resource/vezc-m2t6.json","https://opendata.rdw.nl/resource/jhie-znh9.json","https://opendata.rdw.nl/resource/kmfi-hrps.json"
"TF828B","Personenauto","BMW I","I8","20260325","20220324","1962","cabriolet","2","WIT","ZWART","3","1499","1570","1900","1670",,,"20180719","20180719","Geen verstrekking in Open Data","176855","Ja",,,,,,,"2","4","0","0",,"469","194","M1",,,,"1900","BMWI-2",,"e1*2007/46*1287*04","2Z61","6AW20000","0","0.10","280","Nee","Nee",,"Nee","0","0","0.00","2024","Logisch","00","Ja","2026-03-25T00:00:00.000","2022-03-24T00:00:00.000","2018-07-19T00:00:00.000","2018-07-19T00:00:00.000",,,,,,,,,,,"129",,,,,,,,,,,,,,,,,"https://opendata.rdw.nl/resource/3huj-srit.json","https://opendata.rdw.nl/resource/8ys7-d773.json","https://opendata.rdw.nl/resource/vezc-m2t6.json","https://opendata.rdw.nl/resource/jhie-znh9.json","https://opendata.rdw.nl/resource/kmfi-hrps.json"
"TG858S","Personenauto","BMW I","I8","20240806","20181109","1962","cabriolet","2","GRIJS","ZWART","3","1499","1570","1900","1670",,,"20180806","20180806","Geen verstrekking in Open Data","176183","Ja",,,,,,,"2","4","0","0",,"469","194","M1",,,,"1900","BMWI-2",,"e1*2007/46*1287*04","2Z61","6AW20000","0","0.10","280","Nee","Nee",,"Nee","0","0","0.00","2023","Logisch","00","Ja","2024-08-06T00:00:00.000","2018-11-09T00:00:00.000","2018-08-06T00:00:00.000","2018-08-06T00:00:00.000",,,,,,,,,,,"129",,,,,,,,,,,,,,,,,"https://opendata.rdw.nl/resource/3huj-srit.json","https://opendata.rdw.nl/resource/8ys7-d773.json","https://opendata.rdw.nl/resource/vezc-m2t6.json","https://opendata.rdw.nl/resource/jhie-znh9.json","https://opendata.rdw.nl/resource/kmfi-hrps.json"