"kenteken","voertuigsoort","merk","handelsbenaming","vervaldatum_apk","datum_tenaamstelling","bruto_bpm","inrichting","aantal_zitplaatsen","eerste_kleur","tweede_kleur","aantal_cilinders","cilinderinhoud","massa_ledig_voertuig","toegestane_maximum_massa_voertuig","massa_rijklaar","maximum_massa_trekken_ongeremd","maximum_trekken_massa_geremd","datum_eerste_toelating","datum_eerste_tenaamstelling_in_nederland","wacht_op_keuren","catalogusprijs","wam_verzekerd","maximale_constructiesnelheid","laadvermogen","oplegger_geremd","aanhangwagen_autonoom_geremd","aanhangwagen_middenas_geremd","aantal_staanplaatsen","aantal_deuren","aantal_wielen","afstand_hart_koppeling_tot_achterzijde_voertuig","afstand_voorzijde_voertuig_tot_hart_koppeling","afwijkende_maximum_snelheid","lengte","breedte","europese_voertuigcategorie","europese_voertuigcategorie_toevoeging","europese_uitvoeringcategorie_toevoeging","plaats_chassisnummer","technische_max_massa_voertuig","type","type_gasinstallatie","typegoedkeuringsnummer","variant","uitvoering","volgnummer_wijziging_eu_typegoedkeuring","vermogen_massarijklaar","wielbasis","export_indicator","openstaande_terugroepactie_indicator","vervaldatum_tachograaf","taxi_indicator","maximum_massa_samenstelling","aantal_rolstoelplaatsen","maximum_ondersteunende_snelheid","jaar_laatste_registratie_tellerstand","tellerstandoordeel","code_toelichting_tellerstandoordeel","tenaamstellen_mogelijk","vervaldatum_apk_dt","datum_tenaamstelling_dt","datum_eerste_toelating_dt","datum_eerste_tenaamstelling_in_nederland_dt","vervaldatum_tachograaf_dt","maximum_last_onder_de_vooras_sen_tezamen_koppeling","type_remsysteem_voertuig_code","rupsonderstelconfiguratiecode","wielbasis_voertuig_minimum","wielbasis_voertuig_maximum","lengte_voertuig_minimum","lengte_voertuig_maximum","breedte_voertuig_minimum","breedte_voertuig_maximum","hoogte_voertuig","hoogte_voertuig_minimum","hoogte_voertuig_maximum","massa_bedrijfsklaar_minimaal","massa_bedrijfsklaar_maximaal","technisch_toelaatbaar_massa_koppelpunt","maximum_massa_technisch_maximaal","maximum_massa_technisch_minimaal","subcategorie_nederland","verticale_belasting_koppelpunt_getrokken_voertuig","zuinigheidsclassificatie","registratie_datum_goedkeuring_afschrijvingsmoment_bpm","registratie_datum_goedkeuring_afschrijvingsmoment_bpm_dt","gem_lading_wrde","aerodyn_voorz","massa_alt_aandr","verl_cab_ind","api_gekentekende_voertuigen_assen","api_gekentekende_voertuigen_brandstof","api_gekentekende_voertuigen_carrosserie","api_gekentekende_voertuigen_carrosserie_specifiek","api_gekentekende_voertuigen_voertuigklasse"
"01RLP8","Personenauto","BMW","520D","20240911","20210802","12429","sedan","5","GRIJS","Niet geregistreerd","4","1995","1600","2235","1700","750","2000","20110624","20110624","Geen verstrekking in Open Data","64675","Ja",,,,,,,"4","4","0","0",,"490","0","M1",,,"r. motorruimte","2235","5L",,"e1*2007/46*0363*04","FW11","5B","0","0.08","297","Nee","Nee",,"Nee","4325","0","0.00","2023","Logisch","00","Ja","2024-09-11T00:00:00.000","2021-08-02T00:00:00.000","2011-06-24T00:00:00.000","2011-06-24T00:00:00.000",,,,,,,,,,,,,,,,,,,,,"A",,,,,,,"https://opendata.rdw.nl/resource/3huj-srit.json","https://opendata.rdw.nl/resource/8ys7-d773.json","https://opendata.rdw.nl/resource/vezc-m2t6.json","https://opendata.rdw.nl/resource/jhie-znh9.json","https://opendata.rdw.nl/resource/kmfi-hrps.json"
"01RPN6","Personenauto","BMW","520D","20241026","20211031","12291","sedan","5","ZWART","Niet geregistreerd","4","1995","1600","2235","1700","750","2000","20110630","20110630","Geen verstrekking in Open Data","63668","Ja",,,,,,,"4","4","0","0",,"490","0","M1",,,"r. motorruimte","2235","5L",,"e1*2007/46*0363*03","FW11","5B","0","0.08","297","Nee","Nee",,"Nee","4325","0","0.00","2023","Logisch","00","Ja","2024-10-26T00:00:00.000","2021-10-31T00:00:00.000","2011-06-30T00:00:00.000","2011-06-30T00:00:00.000",,,,,,,,,,,,,,,,,,,,,"A",,,,,,,"https://opendata.rdw.nl/resource/3huj-srit.json","https://opendata.rdw.nl/resource/8ys7-d773.json","https://opendata.rdw.nl/resource/vezc-m2t6.json","https://opendata.rdw.nl/resource/jhie-znh9.json","https://opendata.rdw.nl/resource/kmfi-hrps.json"
"01YA63","Personenauto","BMW","520",,"20071117",,"sedan",,"BRUIN","Niet geregistreerd","4",,"1293","1700","1393","500","1200","19730615","19990922","Geen verstrekking in Open Data",,"Ja",,,,,,,"4","4",,,,,,"M1",,,"op r. voorwielscherm onder motorkap","1700",,"G2 gasinstallatie",,,,,"0.00","264","Nee","Nee",,"Nee",,,,"2023","Geen oordeel","05","Ja",,"2007-11-17T00:00:00.000","1973-06-15T00:00:00.000","1999-09-22T00:00:00.000",,"0",,,,,,,,,,,,,,,,,,,,,,,,,,"https://opendata.rdw.nl/resource/3huj-srit.json","https://opendata.rdw.nl/resource/8ys7-d773.json","https://opendata.rdw.nl/resource/vezc-m2t6.json","https://opendata.rdw.nl/resource/jhie-znh9.json","https://opendata.rdw.nl/resource/kmfi-hrps.json"
"01ZRPV","Personenauto","BMW","520 I","20251227","20180626",,"sedan","5","GRIJS","Niet geregistreerd","6","1990","1192","1730","1292","500","1400","19830825","20080712","Geen verstrekking in Open Data",,"Ja",,,,,,,"4","4","0","0",,"0","0","M1",,,"op randprofiel r. voorwielscherm onder motorkap","1730",,"G2 gasinstallatie",,,,"0","0.07","263","Nee","Nee",,"Nee","0",,,"2023","Geen oordeel","05","Ja","2025-12-27T00:00:00.000","2018-06-26T00:00:00.000","1983-08-25T00:00:00.000","2008-07-12T00:00:00.000",,"0",,,,,,,,,,,,,,,,,,,,,,,,,,"https://opendata.rdw.nl/resource/3huj-srit.json","https://opendata.rdw.nl/resource/8ys7-d773.json","https://opendata.rdw.nl/resource/vezc-m2t6.json","https://opendata.rdw.nl/resource/jhie-znh9.json","https://opendata.rdw.nl/resource/kmfi-hrps.json"
"02HGT2","Personenauto","BMW","520 I","20240106","20240302",,"sedan","5","GROEN","Niet geregistreerd","6","1990","1185","1730","1285","500","1400","19820629","20081121","Geen verstrekking in Open Data",,"Nee",,,,,,,"4","4","0","0",,"0","0","M1",,,"r. v. watergoot","1730",,,,,,"0","0.07","263","Nee","Nee",,"Nee","3130",,,"2024","Geen oordeel","01","Ja","2024-01-06T00:00:00.000","2024-03-02T00:00:00.000","1982-06-29T00:00:00.000","2008-11-21T00:00:00.000",,"0",,,,,,,,,,,,,,,,,,,,,,,,,,"https://opendata.rdw.nl/resource/3huj-srit.json","https://opendata.rdw.nl/resource/8ys7-d773.json","https://opendata.rdw.nl/resource/vezc-m2t6.json","https://opendata.rdw.nl/resource/jhie-znh9.json","https://opendata.rdw.nl/resource/kmfi-hrps.json"
"02PFG9","Personenauto","BMW","520D","20250131","20210521","11652","sedan","5","BRUIN","Niet geregistreerd","4","1995","1600","2235","1700","750","2000","20110114","20110114","Geen verstrekking in Open Data","59029","Ja",,,,,,,"4","4","0","0",,"490","0","M1",,,"r. motorruimte","2235","5L",,"e1*2007/46*0363*03","FW11","5B","0","0.08","297","Nee","Nee",,"Nee","4325","0","0.00","2024","Logisch","00","Ja","2025-01-31T00:00:00.000","2021-05-21T00:00:00.000","2011-01-14T00:00:00.000","2011-01-14T00:00:00.000",,,,,,,,,,,,,,,,,,,,,"A",,,,,,,"https://opendata.rdw.nl/resource/3huj-srit.json","https://opendata.rdw.nl/resource/8ys7-d773.json","https://opendata.rdw.nl/resource/vezc-m2t6.json","https://opendata.rdw.nl/resource/jhie-znh9.json","https://opendata.rdw.nl/resource/kmfi-hrps.json"
"02PRK9","Personenauto","BMW","520D","20221001","20191001","11601","sedan","5","GRIJS","Niet geregistreerd","4","1995","1595","2230","1695","750","2000","20110318","20110318","Geen verstrekking in Open Data","61717","Ja",,,,,,,"4","4","0","0",,"490","0","M1",,,"r. motorruimte","2230","5L",,"e1*2007/46*0363*03","FW11","5A","0","0.08","297","Nee","Nee",,"Nee","4320","0","0.00","2021","Logisch","00","Ja","2022-10-01T00:00:00.000","2019-10-01T00:00:00.000","2011-03-18T00:00:00.000","2011-03-18T00:00:00.000",,,,,,,,,,,,,,,,,,,,,"A",,,,,,,"https://opendata.rdw.nl/resource/3huj-srit.json","https://opendata.rdw.nl/resource/8ys7-d773.json","https://opendata.rdw.nl/resource/vezc-m2t6.json","https://opendata.rdw.nl/resource/jhie-znh9.json","https://opendata.rdw.nl/resource/kmfi-hrps.json"
"02RPDP","Personenauto","BMW","520","20250221","20230130",,"sedan","5","GROEN","Niet geregistreerd","6","1990","1351","1770","1451","500","1200","19780705","20050621","Geen verstrekking in Open Data",,"Nee",,,,,,,"4","4",,,,,,"M1",,,"op r. voorwielscherm onder motorkap","1770",,"G2 gasinstallatie",,,,,"0.06","264","Nee","Nee",,"Nee",,,,"2023","Geen oordeel","01","Ja","2025-02-21T00:00:00.000","2023-01-30T00:00:00.000","1978-07-05T00:00:00.000","2005-06-21T00:00:00.000",,,,,,,,,,,,,,,,,,,,,,,,,,,,"https://opendata.rdw.nl/resource/3huj-srit.json","https://opendata.rdw.nl/resource/8ys7-d773.json","https://opendata.rdw.nl/resource/vezc-m2t6.json","https://opendata.rdw.nl/resource/jhie-znh9.json","https://opendata.rdw.nl/resource/kmfi-hrps.json"
"02RSH9","Personenauto","BMW","520D","20240610","20170727","12239","sedan","5","ZWART","Niet geregistreerd","4","1995","1600","2235","1700","750","2000","20110718","20110718","Geen verstrekking in Open Data","63294","Ja",,,,,,,"4","4","0","0",,"490","0","M1",,,"r. motorruimte","2235","5L",,"e1*2007/46*0363*04","FW11","5B","0","0.08","297","Nee","Nee",,"Nee","4325","0","0.00","2023","Logisch","00","Ja","2024-06-10T00:00:00.000","2017-07-27T00:00:00.000","2011-07-18T00:00:00.000","2011-07-18T00:00:00.000",,,,,,,,,,,,,,,,,,,,,"A",,,,,,,"https://opendata.rdw.nl/resource/3huj-srit.json","https://opendata.rdw.nl/resource/8ys7-d773.json","https://opendata.rdw.nl/resource/vezc-m2t6.json","https://opendata.rdw.nl/resource/jhie-znh9.json","https://opendata.rdw.nl/resource/kmfi-hrps.json"
"02TFR4","Personenauto","BMW","520D","20250424","20150621","11740","sedan","5","GRIJS","Niet geregistreerd","4","1995","1600","2235","1700","750","2000","20120116","20120116","Geen verstrekking in Open Data","74917","Ja",,,,,,,"4","4","0","0",,"490","0","M1",,,"r. motorruimte","2235","5L",,"e1*2007/46*0363*04","FW11","5B","0","0.08","297","Nee","Nee",,"Nee","4325","0","0.00","2024","Logisch","00","Ja","2025-04-24T00:00:00.000","2015-06-21T00:00:00.000","2012-01-16T00:00:00.000","2012-01-16T00:00:00.000",,,,,,,,,,,,,,,,,,,,,"B",,,,,,,"https://opendata.rdw.nl/resource/3huj-srit.json","https://opendata.rdw.nl/resource/8ys7-d773.json","https://opendata.rdw.nl/resource/vezc-m2t6.json","https://opendata.rdw.nl/resource/jhie-znh9.json","https://opendata.rdw.nl/resource/kmfi-hrps.json"
"03GJF1","Personenauto","BMW","520 I","20180420","20120702",,"sedan","5","ROOD","Niet geregistreerd","6","1990","1192","1730","1292","500","1400","19831215","20080625","Geen verstrekking in Open Data",,"Nee",,,,,,,"4","4","0","0",,"0","0","M1",,,"op randprofiel r. voorwielscherm onder motorkap","1730",,,,,,"0","0.07","263","Nee","Nee",,"Nee","0",,,"2016","Geen oordeel","01","Ja","2018-04-20T00:00:00.000","2012-07-02T00:00:00.000","1983-12-15T00:00:00.000","2008-06-25T00:00:00.000",,"0",,,,,,,,,,,,,,,,,,,,,,,,,,"https://opendata.rdw.nl/resource/3huj-srit.json","https://opendata.rdw.nl/resource/8ys7-d773.json","https://opendata.rdw.nl/resource/vezc-m2t6.json","https://opendata.rdw.nl/resource/jhie-znh9.json","https://opendata.rdw.nl/resource/kmfi-hrps.json"
"03LSZS","Personenauto","BMW","520","20260419","20141113",,"sedan","5","BLAUW","Niet geregistreerd","6","1990","1321","1770","1421","500","1400","19780405","20030502","Geen verstrekking in Open Data",,"Ja",,,,,,,"4","4","0","0",,"0","0","M1",,,"op randprofiel r. voorwielscherm onder motorkap","1770",,,,,,"0","0.06","264","Nee","Nee",,"Nee","0",,,"2024","Geen oordeel","01","Ja","2026-04-19T00:00:00.000","2014-11-13T00:00:00.000","1978-04-05T00:00:00.000","2003-05-02T00:00:00.000",,"0",,,,,,,,,,,,,,,,,,,,,,,,,,"https://opendata.rdw.nl/resource/3huj-srit.json","https://opendata.rdw.nl/resource/8ys7-d773.json","https://opendata.rdw.nl/resource/vezc-m2t6.json","https://opendata.rdw.nl/resource/jhie-znh9.json","https://opendata.rdw.nl/resource/kmfi-hrps.json"
"03YA82","Personenauto","BMW","520","20251106","20180113",,"sedan","5","BLAUW","Niet geregistreerd","4","1990","1285","1700","1385","500","1200","19750831","20010206","Geen verstrekking in Open Data",,"Ja",,,,,,,"4","4","0","0",,"0","0","M1",,,"r. op randprofiel onder motorkap","1700",,,,,,"0","0.06","264","Nee","Nee",,"Nee","0",,,"2023","Onlogisch","04","Ja","2025-11-06T00:00:00.000","2018-01-13T00:00:00.000","1975-08-31T00:00:00.000","2001-02-06T00:00:00.000",,"0",,,,,,,,,,,,,,,,,,,,,,,,,,"https://opendata.rdw.nl/resource/3huj-srit.json","https://opendata.rdw.nl/resource/8ys7-d773.json","https://opendata.rdw.nl/resource/vezc-m2t6.json","https://opendata.rdw.nl/resource/jhie-znh9.json","https://opendata.rdw.nl/resource/kmfi-hrps.json"
"03YD05","Personenauto","BMW","520",,"20190907",,"sedan","5","BLAUW","Niet geregistreerd","4","1990","1240","1700","1340","670","1400","19730903","20140725","Geen verstrekking in Open Data",,"Ja",,,,,,,"4","4","0","0",,"0","0","M1",,,"r. voorwielscherm motorruimte","1700",,,,,,"0","0.06","264","Nee","Nee",,"Nee","0",,,"2021","Geen oordeel","05","Ja",,"2019-09-07T00:00:00.000","1973-09-03T00:00:00.000","2014-07-25T00:00:00.000",,"0",,,,,,,,,,,,,,,,,,,,,,,,,,"https://opendata.rdw.nl/resource/3huj-srit.json","https://opendata.rdw.nl/resource/8ys7-d773.json","https://opendata.rdw.nl/resource/vezc-m2t6.json","https://opendata.rdw.nl/resource/jhie-znh9.json","https://opendata.rdw.nl/resource/kmfi-hrps.json"
"03YD42","Personenauto","BMW","520",,"20230111",,"sedan","5","WIT","Niet geregistreerd","4","1990","1293",,"1393","500","1200","19740220","20140812","Geen verstrekking in Open Data",,"Nee",,,,,,,"4","4","0","0",,"0","0","M1",,,"r. voorwielscherm","0",,"G2 gasinstallatie",,,,"0","0.06","264","Nee","Nee",,"Nee","0",,,"2020","Geen oordeel","05","Ja",,"2023-01-11T00:00:00.000","1974-02-20T00:00:00.000","2014-08-12T00:00:00.000",,"0",,,,,,,,,,,,,,,,,,,,,,,,,,"https://opendata.rdw.nl/resource/3huj-srit.json","https://opendata.rdw.nl/resource/8ys7-d773.json","https://opendata.rdw.nl/resource/vezc-m2t6.json","https://opendata.rdw.nl/resource/jhie-znh9.json","https://opendata.rdw.nl/resource/kmfi-hrps.json"
"04PVH5","Personenauto","BMW","520D","20250511","20150901","12671","sedan","5","GRIJS","Niet geregistreerd","4","1995","1600","2235","1700","750","2000","20110401","20110401","Geen verstrekking in Open Data","66429","Ja",,,,,,,"4","4","0","0",,"490","0","M1",,,"r. motorruimte","2235","5L",,"e1*2007/46*0363*04","FW11","5B","0","0.08","297","Nee","Nee",,"Nee","4325","0","0.00","2024","Logisch","00","Ja","2025-05-11T00:00:00.000","2015-09-01T00:00:00.000","2011-04-01T00:00:00.000","2011-04-01T00:00:00.000",,,,,,,,,,,,,,,,,,,,,"A",,,,,,,"https://opendata.rdw.nl/resource/3huj-srit.json","https://opendata.rdw.nl/resource/8ys7-d773.json","https://opendata.rdw.nl/resource/vezc-m2t6.json","https://opendata.rdw.nl/resource/jhie-znh9.json","https://opendata.rdw.nl/resource/kmfi-hrps.json"
"04RJXD","Personenauto","BMW","520I U9","20260206","20221011","8776","sedan","5","BEIGE","Niet geregistreerd","6","1991","1450","1935","1550","650","1400","19910906","20050425","Geen verstrekking in Open Data",,"Ja",,,,,,,"4","4","0","0",,"0","0","M1",,,"r. in watergoot v. voorruit","1935",,,,,,"0","0.07","277","Nee","Nee",,"Nee","0",,,"2024","Geen oordeel","05","Ja","2026-02-06T00:00:00.000","2022-10-11T00:00:00.000","1991-09-06T00:00:00.000","2005-04-25T00:00:00.000",,"0",,,,,,,,,,,,,,,,,,,,,,,,,,"https://opendata.rdw.nl/resource/3huj-srit.json","https://opendata.rdw.nl/resource/8ys7-d773.json","https://opendata.rdw.nl/resource/vezc-m2t6.json","https://opendata.rdw.nl/resource/jhie-znh9.json","https://opendata.rdw.nl/resource/kmfi-hrps.json"
"05FSHV","Personenauto","BMW","520","20260206","20210114","3331","sedan","5","GROEN","Niet geregistreerd","6","1990","1280","1770","1380","500","1400","19781005","20000726","Geen verstrekking in Open Data",,"Ja",,,,,,,"4","4",,,,,,"M1",,,"r. op randprofiel onder motorkap","1770",,,,,,,"0.07","264","Nee","Nee",,"Nee",,,,"2024","Geen oordeel","05","Ja","2026-02-06T00:00:00.000","2021-01-14T00:00:00.000","1978-10-05T00:00:00.000","2000-07-26T00:00:00.000",,,,,,,,,,,,,,,,,,,,,,,,,,,,"https://opendata.rdw.nl/resource/3huj-srit.json","https://opendata.rdw.nl/resource/8ys7-d773.json","https://opendata.rdw.nl/resource/vezc-m2t6.json","https://opendata.rdw.nl/resource/jhie-znh9.json","https://opendata.rdw.nl/resource/kmfi-hrps.json"
"05HVR7","Personenauto","BMW","520I AUTOMATIC","20190911","20171111",,"sedan","5","GRIJS","Niet geregistreerd","6","1990","1197","1730","1297","500","1400","19840116","20100327","Geen verstrekking in Open Data",,"Nee",,,,,,,"4","4","0","0",,"0","0","M1",,,"op randprofiel r. voorwielscherm onder motorkap","1730",,"G2 gasinstallatie",,,,"0","0.07","263","Nee","Nee",,"Nee","0",,,"2017","Geen oordeel","01","Ja","2019-09-11T00:00:00.000","2017-11-11T00:00:00.000","1984-01-16T00:00:00.000","2010-03-27T00:00:00.000",,"0",,,,,,,,,,,,,,,,,,,,,,,,,,"https://opendata.rdw.nl/resource/3huj-srit.json","https://opendata.rdw.nl/resource/8ys7-d773.json","https://opendata.rdw.nl/resource/vezc-m2t6.json","https://opendata.rdw.nl/resource/jhie-znh9.json","https://opendata.rdw.nl/resource/kmfi-hrps.json"
"06HKB6","Personenauto","BMW","520I","20240110","20081230","10391","sedan","5","GRIJS","Niet geregistreerd","6","1991","1470","1945","1570","740","1500","19970729","20081219","Geen verstrekking in Open Data",,"Nee",,,,,,,"4","4",,,,,,"M1",,,"r. schroefveerkoker","1945",,,,,,,"0.07","283","Nee","Nee",,"Nee","3520",,,"2022","Geen oordeel","05","Ja","2024-01-10T00:00:00.000","2008-12-30T00:00:00.000","1997-07-29T00:00:00.000","2008-12-19T00:00:00.000",,"0",,,,,,,,,,,,,,,,,,,,,,,,,,"https://opendata.rdw.nl/resource/3huj-srit.json","https://opendata.rdw.nl/resource/8ys7-d773.json","https://opendata.rdw.nl/resource/vezc-m2t6.json","https://opendata.rdw.nl/resource/jhie-znh9.json","https://opendata.rdw.nl/resource/kmfi-hrps.json"
"06JJL3","Personenauto","BMW","520 AUTOMATIC","20250329","20170128",,"sedan","5","GROEN","Niet geregistreerd","6","1977","1295","1770","1395","500","1200","19780307","20090604","Geen verstrekking in Open Data",,"Ja",,,,,,,"4","4","0","0",,"0","0","M1",,,"r. voorwielscherm motorruimte","1770",,,,,,"0","0.06","264","Nee","Nee",,"Nee","0",,,"2023","Geen oordeel","01","Ja","2025-03-29T00:00:00.000","2017-01-28T00:00:00.000","1978-03-07T00:00:00.000","2009-06-04T00:00:00.000",,"0",,,,,,,,,,,,,,,,,,,,,,,,,,"https://opendata.rdw.nl/resource/3huj-srit.json","https://opendata.rdw.nl/resource/8ys7-d773.json","https://opendata.rdw.nl/resource/vezc-m2t6.json","https://opendata.rdw.nl/resource/jhie-znh9.json","https://opendata.rdw.nl/resource/kmfi-hrps.json"
"06PHR9","Personenauto","BMW","520D","20240831","20230417","13788","sedan","5","ZWART","Niet geregistreerd","4","1995","1600","2235","1700","750","2000","20110128","20110128","Geen verstrekking in Open Data","74545","Ja",,,,,,,"4","4","0","0",,"490","0","M1",,,"r. motorruimte","2235","5L",,"e1*2007/46*0363*03","FW11","5B","0","0.08","297","Nee","Nee",,"Nee","4325","0","0.00","2023","Logisch","00","Ja","2024-08-31T00:00:00.000","2023-04-17T00:00:00.000","2011-01-28T00:00:00.000","2011-01-28T00:00:00.000",,,,,,,,,,,,,,,,,,,,,"A",,,,,,,"https://opendata.rdw.nl/resource/3huj-srit.json","https://opendata.rdw.nl/resource/8ys7-d773.json","https://opendata.rdw.nl/resource/vezc-m2t6.json","https://opendata.rdw.nl/resource/jhie-znh9.json","https://opendata.rdw.nl/resource/kmfi-hrps.json"
"06YD18","Personenauto","BMW","520","20231217","20141203",,"sedan","5","WIT","Niet geregistreerd","4","1990","1237","1750","1337","500","1200","19740702","20141126","Geen verstrekking in Open Data",,"Ja",,,,,,,"4","4","0","0",,"0","0","M1",,,"r. voorwielscherm motorruimte","1750",,,,,,"0","0.06","264","Nee","Nee",,"Nee","0",,,"2021","Geen oordeel","05","Ja","2023-12-17T00:00:00.000","2014-12-03T00:00:00.000","1974-07-02T00:00:00.000","2014-11-26T00:00:00.000",,"0",,,,,,,,,,,,,,,,,,,,,,,,,,"https://opendata.rdw.nl/resource/3huj-srit.json","https://opendata.rdw.nl/resource/8ys7-d773.json","https://opendata.rdw.nl/resource/vezc-m2t6.json","https://opendata.rdw.nl/resource/jhie-znh9.json","https://opendata.rdw.nl/resource/kmfi-hrps.json"
"07LVN4","Personenauto","BMW","520D","20250327","20240301","13559","sedan","5","GRIJS","Niet geregistreerd","4","1995","1600","2235","1700","750","2000","20100707","20100707","Geen verstrekking in Open Data","62876","Ja",,,,,,,"4","4","0","0",,"490","0","M1",,,"r. motorruimte","2235","5L",,"e1*2007/46*0363*02","FW11","5B","0","0.08","297","Nee","Nee",,"Nee","4325","0","0.00","2024","Logisch","00","Ja","2025-03-27T00:00:00.000","2024-03-01T00:00:00.000","2010-07-07T00:00:00.000","2010-07-07T00:00:00.000",,,,,,,,,,,,,,,,,,,,,"A",,,,,,,"https://opendata.rdw.nl/resource/3huj-srit.json","https://opendata.rdw.nl/resource/8ys7-d773.json","https://opendata.rdw.nl/resource/vezc-m2t6.json","https://opendata.rdw.nl/resource/jhie-znh9.json","https://opendata.rdw.nl/resource/kmfi-hrps.json"
"08NFB7","Personenauto","BMW","520D","20240707","20150207","13492","sedan","5","ZWART","Niet geregistreerd","4","1995","1600","2235","1700","750","2000","20100818","20100818","Geen verstrekking in Open Data","62517","Ja",,,,,,,"4","4","0","0",,"490","0","M1",,,"r. motorruimte","2235","5L",,"e1*2007/46*0363*02","FW11","5B","0","0.08","297","Nee","Nee",,"Nee","4325","0","0.00","2023","Logisch","00","Ja","2024-07-07T00:00:00.000","2015-02-07T00:00:00.000","2010-08-18T00:00:00.000","2010-08-18T00:00:00.000",,,,,,,,,,,,,,,,,,,,,"A",,,,,,,"https://opendata.rdw.nl/resource/3huj-srit.json","https://opendata.rdw.nl/resource/8ys7-d773.json","https://opendata.rdw.nl/resource/vezc-m2t6.json","https://opendata.rdw.nl/resource/jhie-znh9.json","https://opendata.rdw.nl/resource/kmfi-hrps.json"
"08NJJ9","Personenauto","BMW","520D","20241013","20231013","12062","sedan","5","BLAUW","Niet geregistreerd","4","1995","1595","2230","1695","750","2000","20100924","20100924","Geen verstrekking in Open Data","56058","Ja",,,,,,,"4","4",,,,"490",,"M1",,,"r. motorruimte","2230","5L",,,,,,"0.08","297","Nee","Nee",,"Nee","4320",,,"2023","Logisch","00","Ja","2024-10-13T00:00:00.000","2023-10-13T00:00:00.000","2010-09-24T00:00:00.000","2010-09-24T00:00:00.000",,,,,,,,,,,,,,,,,,,,,"A",,,,,,,"https://opendata.rdw.nl/resource/3huj-srit.json","https://opendata.rdw.nl/resource/8ys7-d773.json","https://opendata.rdw.nl/resource/vezc-m2t6.json","https://opendata.rdw.nl/resource/jhie-znh9.json","https://opendata.rdw.nl/resource/kmfi-hrps.json"
"08RGD2","Personenauto","BMW","520D","20250121","20151222","12466","sedan","5","GRIJS","Niet geregistreerd","4","1995","1600","2235","1700","750","2000","20110524","20110524","Geen verstrekking in Open Data","64942","Ja",,,,,,,"4","4",,,,"490",,"M1",,,"r. motorruimte","2235","5L",,,,,,"0.08","297","Nee","Nee",,"Nee","4325",,,"2024","Logisch","00","Ja","2025-01-21T00:00:00.000","2015-12-22T00:00:00.000","2011-05-24T00:00:00.000","2011-05-24T00:00:00.000",,,,,,,,,,,,,,,,,,,,,"A",,,,,,,"https://opendata.rdw.nl/resource/3huj-srit.json","https://opendata.rdw.nl/resource/8ys7-d773.json","https://opendata.rdw.nl/resource/vezc-m2t6.json","https://opendata.rdw.nl/resource/jhie-znh9.json","https://opendata.rdw.nl/resource/kmfi-hrps.json"
"08XTSX","Personenauto","BMW","520 I","20150624","20150504",,"sedan","5","GRIJS","Niet geregistreerd","6","1990","1211","1750","1311","500","1400","19820916","20070927","Geen verstrekking in Open Data",,"Ja",,,,,,,"4","4","0","0",,"0","0","M1",,,"op r. voorwielscherm onder motorkap","1750",,,,,,"0","0.07","263","Nee","Nee",,"Nee","0",,,"2015","Niet geregistreerd","NG","Ja","2015-06-24T00:00:00.000","2015-05-04T00:00:00.000","1982-09-16T00:00:00.000","2007-09-27T00:00:00.000",,"0",,,,,,,,,,,,,,,,,,,,,,,,,,"https://opendata.rdw.nl/resource/3huj-srit.json","https://opendata.rdw.nl/resource/8ys7-d773.json","https://opendata.rdw.nl/resource/vezc-m2t6.json","https://opendata.rdw.nl/resource/jhie-znh9.json","https://opendata.rdw.nl/resource/kmfi-hrps.json"