"kenteken","voertuigsoort","merk","handelsbenaming","vervaldatum_apk","datum_tenaamstelling","bruto_bpm","inrichting","aantal_zitplaatsen","eerste_kleur","tweede_kleur","aantal_cilinders","cilinderinhoud","massa_ledig_voertuig","toegestane_maximum_massa_voertuig","massa_rijklaar","maximum_massa_trekken_ongeremd","maximum_trekken_massa_geremd","datum_eerste_toelating","datum_eerste_tenaamstelling_in_nederland","wacht_op_keuren","catalogusprijs","wam_verzekerd","maximale_constructiesnelheid","laadvermogen","oplegger_geremd","aanhangwagen_autonoom_geremd","aanhangwagen_middenas_geremd","aantal_staanplaatsen","aantal_deuren","aantal_wielen","afstand_hart_koppeling_tot_achterzijde_voertuig","afstand_voorzijde_voertuig_tot_hart_koppeling","afwijkende_maximum_snelheid","lengte","breedte","europese_voertuigcategorie","europese_voertuigcategorie_toevoeging","europese_uitvoeringcategorie_toevoeging","plaats_chassisnummer","technische_max_massa_voertuig","type","type_gasinstallatie","typegoedkeuringsnummer","variant","uitvoering","volgnummer_wijziging_eu_typegoedkeuring","vermogen_massarijklaar","wielbasis","export_indicator","openstaande_terugroepactie_indicator","vervaldatum_tachograaf","taxi_indicator","maximum_massa_samenstelling","aantal_rolstoelplaatsen","maximum_ondersteunende_snelheid","jaar_laatste_registratie_tellerstand","tellerstandoordeel","code_toelichting_tellerstandoordeel","tenaamstellen_mogelijk","vervaldatum_apk_dt","datum_tenaamstelling_dt","datum_eerste_toelating_dt","datum_eerste_tenaamstelling_in_nederland_dt","vervaldatum_tachograaf_dt","maximum_last_onder_de_vooras_sen_tezamen_koppeling","type_remsysteem_voertuig_code","rupsonderstelconfiguratiecode","wielbasis_voertuig_minimum","wielbasis_voertuig_maximum","lengte_voertuig_minimum","lengte_voertuig_maximum","breedte_voertuig_minimum","breedte_voertuig_maximum","hoogte_voertuig","hoogte_voertuig_minimum","hoogte_voertuig_maximum","massa_bedrijfsklaar_minimaal","massa_bedrijfsklaar_maximaal","technisch_toelaatbaar_massa_koppelpunt","maximum_massa_technisch_maximaal","maximum_massa_technisch_minimaal","subcategorie_nederland","verticale_belasting_koppelpunt_getrokken_voertuig","zuinigheidsclassificatie","registratie_datum_goedkeuring_afschrijvingsmoment_bpm","registratie_datum_goedkeuring_afschrijvingsmoment_bpm_dt","gem_lading_wrde","aerodyn_voorz","massa_alt_aandr","verl_cab_ind","api_gekentekende_voertuigen_assen","api_gekentekende_voertuigen_brandstof","api_gekentekende_voertuigen_carrosserie","api_gekentekende_voertuigen_carrosserie_specifiek","api_gekentekende_voertuigen_voertuigklasse"
"21XJN1","Personenauto","BMW","118D","20210529","20200901","12021","cabriolet","4","ZWART","Niet geregistreerd","4","1995","1475","1940","1575","690","1200","20111130","20120614","Geen verstrekking in Open Data","56406","Nee",,,,,,,"2","4","0","0",,"436","0","M1",,,"r. motorruimte","1940","1C",,"e1*2007/46*0277*03","UM91","5B","0","0.07","266","Nee","Nee",,"Nee","3205","0","0.00","2020","Geen oordeel","05","Nee","2021-05-29T00:00:00.000","2020-09-01T00:00:00.000","2011-11-30T00:00:00.000","2012-06-14T00:00:00.000",,,,,,,,,,,,,,,,,,,,,"E",,,,,,,"https://opendata.rdw.nl/resource/3huj-srit.json","https://opendata.rdw.nl/resource/8ys7-d773.json","https://opendata.rdw.nl/resource/vezc-m2t6.json","https://opendata.rdw.nl/resource/jhie-znh9.json","https://opendata.rdw.nl/resource/kmfi-hrps.json"
"3SBB68","Personenauto","BMW","118D","20250214","20230218","8074","cabriolet","4","ZWART","Niet geregistreerd","4","1995","1460","1925","1560","690","1200","20130930","20130930","Geen verstrekking in Open Data","43770","Ja",,,,,,,"2","4","0","0",,"436","0","M1",,,"r. motorruimte","1925","1C",,"e1*2007/46*0277*07","UM91","5H000","0","0.07","266","Nee","Nee",,"Nee","3180","0","0.00","2023","Logisch","00","Ja","2025-02-14T00:00:00.000","2023-02-18T00:00:00.000","2013-09-30T00:00:00.000","2013-09-30T00:00:00.000",,,,,,,,,,,,,,,,,,,,,"D",,,,,,,"https://opendata.rdw.nl/resource/3huj-srit.json","https://opendata.rdw.nl/resource/8ys7-d773.json","https://opendata.rdw.nl/resource/vezc-m2t6.json","https://opendata.rdw.nl/resource/jhie-znh9.json","https://opendata.rdw.nl/resource/kmfi-hrps.json"
"51SRG1","Personenauto","BMW","118D","20250224","20210412","9720","cabriolet","4","ROOD","Niet geregistreerd","4","1995","1460","1925","1560","690","1200","20111116","20111116","Geen verstrekking in Open Data","48815","Ja",,,,,,,"2","4","0","0",,"436","0","M1",,,"r. motorruimte","1925","1C",,"e1*2007/46*0277*03","UM91","5A","0","0.07","266","Nee","Nee",,"Nee","3180","0","0.00","2024","Logisch","00","Ja","2025-02-24T00:00:00.000","2021-04-12T00:00:00.000","2011-11-16T00:00:00.000","2011-11-16T00:00:00.000",,,,,,,,,,,,,,,,,,,,,"C",,,,,,,"https://opendata.rdw.nl/resource/3huj-srit.json","https://opendata.rdw.nl/resource/8ys7-d773.json","https://opendata.rdw.nl/resource/vezc-m2t6.json","https://opendata.rdw.nl/resource/jhie-znh9.json","https://opendata.rdw.nl/resource/kmfi-hrps.json"
"63SFL5","Personenauto","BMW","118D","20250303","20170718","9153","cabriolet","4","ROOD","Niet geregistreerd","4","1995","1460","1925","1560","690","1200","20110914","20110914","Geen verstrekking in Open Data","44698","Ja",,,,,,,"2","4","0","0",,"436","0","M1",,,"r. motorruimte","1925","1C",,"e1*2007/46*0277*03","UM91","5A","0","0.07","266","Nee","Nee",,"Nee","3180","0","0.00","2024","Logisch","00","Ja","2025-03-03T00:00:00.000","2017-07-18T00:00:00.000","2011-09-14T00:00:00.000","2011-09-14T00:00:00.000",,,,,,,,,,,,,,,,,,,,,"C",,,,,,,"https://opendata.rdw.nl/resource/3huj-srit.json","https://opendata.rdw.nl/resource/8ys7-d773.json","https://opendata.rdw.nl/resource/vezc-m2t6.json","https://opendata.rdw.nl/resource/jhie-znh9.json","https://opendata.rdw.nl/resource/kmfi-hrps.json"
"68XVH2","Personenauto","BMW","118D","20240515","20210414","1395","cabriolet","4","ZWART","Niet geregistreerd","4","1995","1460","1925","1560","690","1200","20110617","20130415","Geen verstrekking in Open Data","46888","Ja",,,,,,,"2","4","0","0",,"436","0","M1",,,"r. motorruimte","1925","1C",,"e1*2007/46*0277*03","UM91","5A","0","0.07","266","Nee","Nee",,"Nee","3180","0","0.00","2023","Geen oordeel","05","Ja","2024-05-15T00:00:00.000","2021-04-14T00:00:00.000","2011-06-17T00:00:00.000","2013-04-15T00:00:00.000",,,,,,,,,,,,,,,,,,,,,"C",,,,,,,"https://opendata.rdw.nl/resource/3huj-srit.json","https://opendata.rdw.nl/resource/8ys7-d773.json","https://opendata.rdw.nl/resource/vezc-m2t6.json","https://opendata.rdw.nl/resource/jhie-znh9.json","https://opendata.rdw.nl/resource/kmfi-hrps.json"
"6KFG46","Personenauto","BMW","118D","20240702","20130329","8039","cabriolet","4","ZWART","Niet geregistreerd","4","1995","1475","1940","1575","690","1200","20100702","20130329","Geen verstrekking in Open Data","57637","Ja",,,,,,,"2","4","0","0",,"436","0","M1",,,"r. motorruimte","1940","1C",,"e1*2007/46*0277*01","UM91","5I","0","0.06","266","Nee","Nee",,"Nee","3205","0","0.00","2023","Geen oordeel","05","Ja","2024-07-02T00:00:00.000","2013-03-29T00:00:00.000","2010-07-02T00:00:00.000","2013-03-29T00:00:00.000",,"0",,,,,,,,,,,,,,,,,,,"D",,,,,,,"https://opendata.rdw.nl/resource/3huj-srit.json","https://opendata.rdw.nl/resource/8ys7-d773.json","https://opendata.rdw.nl/resource/vezc-m2t6.json","https://opendata.rdw.nl/resource/jhie-znh9.json","https://opendata.rdw.nl/resource/kmfi-hrps.json"
"6ZRT33","Personenauto","BMW","118D","20240619","20150311","10317","cabriolet","4","WIT","Niet geregistreerd","4","1995","1475","1940","1575","690","1200","20110222","20150311","Geen verstrekking in Open Data","50174","Ja",,,,,,,"2","4",,,,,,"M1",,,"r. motorruimte","1940",,,,,,,"0.07","266","Nee","Nee",,"Nee","3205",,,"2023","Geen oordeel","05","Ja","2024-06-19T00:00:00.000","2015-03-11T00:00:00.000","2011-02-22T00:00:00.000","2015-03-11T00:00:00.000",,,,,,,,,,,,,,,,,,,,,,,,,,,,"https://opendata.rdw.nl/resource/3huj-srit.json","https://opendata.rdw.nl/resource/8ys7-d773.json","https://opendata.rdw.nl/resource/vezc-m2t6.json","https://opendata.rdw.nl/resource/jhie-znh9.json","https://opendata.rdw.nl/resource/kmfi-hrps.json"
"71SHX5","Personenauto","BMW","118D","20250510","20221004","10117","cabriolet","4","ZWART","Niet geregistreerd","4","1995","1475","1940","1575","690","1200","20111004","20111004","Geen verstrekking in Open Data","44826","Ja",,,,,,,"2","4","0","0",,"436","0","M1",,,"r. motorruimte","1940","1C",,"e1*2007/46*0277*03","UM91","5B","0","0.07","266","Nee","Nee",,"Nee","3205","0","0.00","2024","Logisch","00","Ja","2025-05-10T00:00:00.000","2022-10-04T00:00:00.000","2011-10-04T00:00:00.000","2011-10-04T00:00:00.000",,,,,,,,,,,,,,,,,,,,,"E",,,,,,,"https://opendata.rdw.nl/resource/3huj-srit.json","https://opendata.rdw.nl/resource/8ys7-d773.json","https://opendata.rdw.nl/resource/vezc-m2t6.json","https://opendata.rdw.nl/resource/jhie-znh9.json","https://opendata.rdw.nl/resource/kmfi-hrps.json"
"77SBZ1","Personenauto","BMW","118D","20250413","20150209","9159","cabriolet","4","WIT","Niet geregistreerd","4","1995","1460","1925","1560","690","1200","20110907","20110907","Geen verstrekking in Open Data","44744","Ja",,,,,,,"2","4","0","0",,"436","0","M1",,,"r. motorruimte","1925","1C",,"e1*2007/46*0277*03","UM91","5A","0","0.07","266","Nee","Nee",,"Nee","3180","0","0.00","2024","Logisch","00","Ja","2025-04-13T00:00:00.000","2015-02-09T00:00:00.000","2011-09-07T00:00:00.000","2011-09-07T00:00:00.000",,,,,,,,,,,,,,,,,,,,,"C",,,,,,,"https://opendata.rdw.nl/resource/3huj-srit.json","https://opendata.rdw.nl/resource/8ys7-d773.json","https://opendata.rdw.nl/resource/vezc-m2t6.json","https://opendata.rdw.nl/resource/jhie-znh9.json","https://opendata.rdw.nl/resource/kmfi-hrps.json"
"92ZFT7","Personenauto","BMW","118D","20250330","20121027","6122","cabriolet","4","ZWART","Niet geregistreerd","4","1995","1450","1915","1550","690","1200","20110330","20121027","Geen verstrekking in Open Data","49188","Ja",,,,,,,"2","4","0","0",,"436","0","M1",,,"r. motorruimte","1915","1C",,"e1*2007/46*0277*02","UM91","5A","0","0.07","266","Nee","Nee",,"Nee","3180","0","0.00","2024","Geen oordeel","05","Ja","2025-03-30T00:00:00.000","2012-10-27T00:00:00.000","2011-03-30T00:00:00.000","2012-10-27T00:00:00.000",,"0",,,,,,,,,,,,,,,,,,,"C",,,,,,,"https://opendata.rdw.nl/resource/3huj-srit.json","https://opendata.rdw.nl/resource/8ys7-d773.json","https://opendata.rdw.nl/resource/vezc-m2t6.json","https://opendata.rdw.nl/resource/jhie-znh9.json","https://opendata.rdw.nl/resource/kmfi-hrps.json"
"G377DP","Personenauto","BMW","118D","20250615","20200615","292","cabriolet","4","ZWART","Niet geregistreerd","4","1995","1460","1925","1560","690","1200","20110427","20200507","Geen verstrekking in Open Data","48823","Ja","205",,,,,,"2","4","0","0",,"436","175","M1",,,,"1925","1C",,"e1*2007/46*0277*03","UM91","5H","0","0.06","266","Nee","Nee",,"Nee","3180","0","0.00","2024","Geen oordeel","05","Ja","2025-06-15T00:00:00.000","2020-06-15T00:00:00.000","2011-04-27T00:00:00.000","2020-05-07T00:00:00.000",,,,,,,,,,,"141",,,,,,,,,,"C",,,,,,,"https://opendata.rdw.nl/resource/3huj-srit.json","https://opendata.rdw.nl/resource/8ys7-d773.json","https://opendata.rdw.nl/resource/vezc-m2t6.json","https://opendata.rdw.nl/resource/jhie-znh9.json","https://opendata.rdw.nl/resource/kmfi-hrps.json"
"GH766D","Personenauto","BMW","118D","20250116","20210501","7253","cabriolet","4","ZWART","Niet geregistreerd","4","1995","1475","1940","1575","690","1200","20120305","20150527","Geen verstrekking in Open Data","50558","Ja",,,,,,,"2","4","0","0",,"436","0","M1",,,"r. motorruimte","1940","1C",,"e1*2007/46*0277*04","UM91","5B","0","0.07","266","Nee","Nee",,"Nee","3205","0","0.00","2023","Geen oordeel","05","Ja","2025-01-16T00:00:00.000","2021-05-01T00:00:00.000","2012-03-05T00:00:00.000","2015-05-27T00:00:00.000",,,,,,,,,,,,,,,,,,,,,"D",,,,,,,"https://opendata.rdw.nl/resource/3huj-srit.json","https://opendata.rdw.nl/resource/8ys7-d773.json","https://opendata.rdw.nl/resource/vezc-m2t6.json","https://opendata.rdw.nl/resource/jhie-znh9.json","https://opendata.rdw.nl/resource/kmfi-hrps.json"
"GH813K","Personenauto","BMW","118D","20240610","20220722","8436","cabriolet","4","ZWART","Niet geregistreerd","4","1995","1450","1915","1550","690","1200","20110224","20150612","Geen verstrekking in Open Data","49318","Ja",,,,,,,"2","4","0","0",,"436","0","M1",,,"r. motorruimte","1915","1C",,"e1*2007/46*0277*02","UM91","5H","0","0.06","266","Nee","Nee",,"Nee","3180","0","0.00","2023","Geen oordeel","05","Ja","2024-06-10T00:00:00.000","2022-07-22T00:00:00.000","2011-02-24T00:00:00.000","2015-06-12T00:00:00.000",,,,,,,,,,,,,,,,,,,,,"C",,,,,,,"https://opendata.rdw.nl/resource/3huj-srit.json","https://opendata.rdw.nl/resource/8ys7-d773.json","https://opendata.rdw.nl/resource/vezc-m2t6.json","https://opendata.rdw.nl/resource/jhie-znh9.json","https://opendata.rdw.nl/resource/kmfi-hrps.json"
"J724FN","Personenauto","BMW","118D","20241010","20200714","662","cabriolet","4","ZWART","Niet geregistreerd","4","1995","1460","1925","1560","690","1200","20130529","20200714","Geen verstrekking in Open Data","48618","Ja","208",,,,,,"2","4","0","0",,"436","175","M1",,,,"1925","1C",,"e1*2007/46*0277*07","UM91","5H000","0","0.07","266","Nee","Nee",,"Nee","3180","0","0.00","2023","Geen oordeel","05","Ja","2024-10-10T00:00:00.000","2020-07-14T00:00:00.000","2013-05-29T00:00:00.000","2020-07-14T00:00:00.000",,,,,,,,,,,"141",,,,,,,,,,"D",,,,,,,"https://opendata.rdw.nl/resource/3huj-srit.json","https://opendata.rdw.nl/resource/8ys7-d773.json","https://opendata.rdw.nl/resource/vezc-m2t6.json","https://opendata.rdw.nl/resource/jhie-znh9.json","https://opendata.rdw.nl/resource/kmfi-hrps.json"
"JB434R","Personenauto","BMW","118D","20241102","20201107","3342","cabriolet","4","GRIJS","Niet geregistreerd","4","1995","1460","1925","1560","690","1200","20130422","20160429","Geen verstrekking in Open Data","49481","Ja",,,,,,,"2","4","0","0",,"436","0","M1",,,"r. motorruimte","1925","1C",,"e1*2007/46*0277*07","UM91","5H0R0","0","0.06","266","Nee","Nee",,"Nee","3180","0","0.00","2023","Geen oordeel","05","Ja","2024-11-02T00:00:00.000","2020-11-07T00:00:00.000","2013-04-22T00:00:00.000","2016-04-29T00:00:00.000",,,,,,,,,,,,,,,,,,,,,"D",,,,,,,"https://opendata.rdw.nl/resource/3huj-srit.json","https://opendata.rdw.nl/resource/8ys7-d773.json","https://opendata.rdw.nl/resource/vezc-m2t6.json","https://opendata.rdw.nl/resource/jhie-znh9.json","https://opendata.rdw.nl/resource/kmfi-hrps.json"
"KH616H","Personenauto","BMW","118D","20250103","20160902","2661","cabriolet","4","ZWART","Niet geregistreerd","4","1995","1450","1915","1550","690","1200","20100422","20160902","Geen verstrekking in Open Data","51889","Ja",,,,,,,"2","4","0","0",,"436","0","M1",,,"r. motorruimte","1915","1C",,"e1*2007/46*0277*01","UM91","5A","0","0.07","266","Nee","Nee",,"Nee","3180","0","0.00","2024","Geen oordeel","05","Ja","2025-01-03T00:00:00.000","2016-09-02T00:00:00.000","2010-04-22T00:00:00.000","2016-09-02T00:00:00.000",,,,,,,,,,,,,,,,,,,,,"C",,,,,,,"https://opendata.rdw.nl/resource/3huj-srit.json","https://opendata.rdw.nl/resource/8ys7-d773.json","https://opendata.rdw.nl/resource/vezc-m2t6.json","https://opendata.rdw.nl/resource/jhie-znh9.json","https://opendata.rdw.nl/resource/kmfi-hrps.json"
"L539GJ","Personenauto","BMW","118D","20240601","20210510","8074","cabriolet","4","ZWART","Niet geregistreerd","4","1995","1475","1940","1575","690","1200","20120521","20210510","Geen verstrekking in Open Data","56661","Ja","208",,,,,,"2","4","0","0",,"436","175","M1",,,,"1940","1C",,"e1*2007/46*0277*04","UM91","5B","0","0.07","266","Nee","Nee",,"Nee","3205","0","0.00","2023","Geen oordeel","05","Ja","2024-06-01T00:00:00.000","2021-05-10T00:00:00.000","2012-05-21T00:00:00.000","2021-05-10T00:00:00.000",,,,,,,,,,,"141",,,,,,,,,,,,,,,,,"https://opendata.rdw.nl/resource/3huj-srit.json","https://opendata.rdw.nl/resource/8ys7-d773.json","https://opendata.rdw.nl/resource/vezc-m2t6.json","https://opendata.rdw.nl/resource/jhie-znh9.json","https://opendata.rdw.nl/resource/kmfi-hrps.json"
"N623PH","Personenauto","BMW","118D","20250216","20211126","10588","cabriolet","4","ZWART","Niet geregistreerd","4","1995","1475","1940","1575","690","1200","20110321","20211126","Geen verstrekking in Open Data","46408","Ja","205",,,,,,"2","4","0","0",,"436","175","M1",,,,"1940","1C",,"e1*2007/46*0277*02","UM91","5I","0","0.06","266","Nee","Nee",,"Nee","3205","0","0.00","2024","Geen oordeel","05","Ja","2025-02-16T00:00:00.000","2021-11-26T00:00:00.000","2011-03-21T00:00:00.000","2021-11-26T00:00:00.000",,,,,,,,,,,"141",,,,,,,,,,,"20211116","2021-11-16T00:00:00.000",,,,,"https://opendata.rdw.nl/resource/3huj-srit.json","https://opendata.rdw.nl/resource/8ys7-d773.json","https://opendata.rdw.nl/resource/vezc-m2t6.json","https://opendata.rdw.nl/resource/jhie-znh9.json","https://opendata.rdw.nl/resource/kmfi-hrps.json"
"N986PH","Personenauto","BMW","118D","20241023","20211128","7942","cabriolet","4","WIT","Niet geregistreerd","4","1995","1450","1915","1550","690","1200","20110131","20211128","Geen verstrekking in Open Data","38983","Ja","205",,,,,,"2","4","0","0",,"436","175","M1",,,,"1915","1C",,"e1*2007/46*0277*02","UM91","5H","0","0.06","266","Nee","Nee",,"Nee","3180","0","0.00","2023","Geen oordeel","05","Ja","2024-10-23T00:00:00.000","2021-11-28T00:00:00.000","2011-01-31T00:00:00.000","2021-11-28T00:00:00.000",,,,,,,,,,,"141",,,,,,,,,,,"20211022","2021-10-22T00:00:00.000",,,,,"https://opendata.rdw.nl/resource/3huj-srit.json","https://opendata.rdw.nl/resource/8ys7-d773.json","https://opendata.rdw.nl/resource/vezc-m2t6.json","https://opendata.rdw.nl/resource/jhie-znh9.json","https://opendata.rdw.nl/resource/kmfi-hrps.json"
"NP743D","Personenauto","BMW","118D","20250216","20200522","8074","cabriolet","4","ZWART","Niet geregistreerd","4","1995","1460","1925","1560","690","1200","20130415","20170315","Geen verstrekking in Open Data","44347","Ja",,,,,,,"2","4","0","0",,"436","0","M1",,,"r. motorruimte","1925","1C",,"e1*2007/46*0277*07","UM91","5H000","0","0.07","266","Nee","Nee",,"Nee","3180","0","0.00","2024","Geen oordeel","05","Ja","2025-02-16T00:00:00.000","2020-05-22T00:00:00.000","2013-04-15T00:00:00.000","2017-03-15T00:00:00.000",,,,,,,,,,,,,,,,,,,,,"D",,,,,,,"https://opendata.rdw.nl/resource/3huj-srit.json","https://opendata.rdw.nl/resource/8ys7-d773.json","https://opendata.rdw.nl/resource/vezc-m2t6.json","https://opendata.rdw.nl/resource/jhie-znh9.json","https://opendata.rdw.nl/resource/kmfi-hrps.json"
"NX998P","Personenauto","BMW","118D","20250430","20170504","11656","cabriolet","4","ZWART","Niet geregistreerd","4","1995","1475","1940","1575","690","1200","20120924","20170504","Geen verstrekking in Open Data","51101","Ja",,,,,,,"2","4",,,,,,"M1",,,"r. motorruimte","1940","1C",,,,,,"0.07","266","Nee","Nee",,"Nee","3215",,,"2024","Geen oordeel","05","Ja","2025-04-30T00:00:00.000","2017-05-04T00:00:00.000","2012-09-24T00:00:00.000","2017-05-04T00:00:00.000",,,,,,,,,,,,,,,,,,,,,,,,,,,,"https://opendata.rdw.nl/resource/3huj-srit.json","https://opendata.rdw.nl/resource/8ys7-d773.json","https://opendata.rdw.nl/resource/vezc-m2t6.json","https://opendata.rdw.nl/resource/jhie-znh9.json","https://opendata.rdw.nl/resource/kmfi-hrps.json"
"PP881X","Personenauto","BMW","118D","20241111","20240516","485","cabriolet","4","WIT","ZWART","4","1995","1450","1915","1550","690","1200","20101230","20170823","Geen verstrekking in Open Data","45132","Nee",,,,,,,"2","4","0","0",,"436","0","M1",,,"r. motorruimte","1915","1C",,"e1*2007/46*0277*01","UM91","5A","0","0.07","266","Nee","Nee",,"Nee","3180","0","0.00","2024","Geen oordeel","05","Ja","2024-11-11T00:00:00.000","2024-05-16T00:00:00.000","2010-12-30T00:00:00.000","2017-08-23T00:00:00.000",,,,,,,,,,,,,,,,,,,,,"C",,,,,,,"https://opendata.rdw.nl/resource/3huj-srit.json","https://opendata.rdw.nl/resource/8ys7-d773.json","https://opendata.rdw.nl/resource/vezc-m2t6.json","https://opendata.rdw.nl/resource/jhie-znh9.json","https://opendata.rdw.nl/resource/kmfi-hrps.json"
"PV352K","Personenauto","BMW","118D","20240522","20180622","8074","cabriolet","4","GRIJS","Niet geregistreerd","4","1995","1460","1925","1560","690","1200","20130716","20180420","Geen verstrekking in Open Data","43290","Ja",,,,,,,"2","4","0","0",,"436","0","M1",,,"r. motorruimte","1925","1C",,"e1*2007/46*0277*07","UM91","5H0R0","0","0.06","266","Nee","Nee",,"Nee","3180","0","0.00","2023","Geen oordeel","05","Ja","2024-05-22T00:00:00.000","2018-06-22T00:00:00.000","2013-07-16T00:00:00.000","2018-04-20T00:00:00.000",,,,,,,,,,,,,,,,,,,,,"D",,,,,,,"https://opendata.rdw.nl/resource/3huj-srit.json","https://opendata.rdw.nl/resource/8ys7-d773.json","https://opendata.rdw.nl/resource/vezc-m2t6.json","https://opendata.rdw.nl/resource/jhie-znh9.json","https://opendata.rdw.nl/resource/kmfi-hrps.json"
"RG264K","Personenauto","BMW","118D","20241209","20221209","555","cabriolet","4","GRIJS","Niet geregistreerd","4","1995","1450","1915","1550","690","1200","20100709","20171110","Geen verstrekking in Open Data","40340","Ja",,,,,,,"2","4",,,,,,"M1",,,"r. motorruimte","1915","1C",,,,,,"0.06","266","Nee","Nee",,"Nee","3180",,,"2023","Geen oordeel","05","Ja","2024-12-09T00:00:00.000","2022-12-09T00:00:00.000","2010-07-09T00:00:00.000","2017-11-10T00:00:00.000",,,,,,,,,,,,,,,,,,,,,,,,,,,,"https://opendata.rdw.nl/resource/3huj-srit.json","https://opendata.rdw.nl/resource/8ys7-d773.json","https://opendata.rdw.nl/resource/vezc-m2t6.json","https://opendata.rdw.nl/resource/jhie-znh9.json","https://opendata.rdw.nl/resource/kmfi-hrps.json"
"RX704P","Personenauto","BMW","118D","20240916","20210406","1346","cabriolet","4","GRIJS","Niet geregistreerd","4","1995","1450","1915","1550","690","1200","20100702","20200914","Geen verstrekking in Open Data","43541","Ja",,,,,,,"2","4","0","0",,"436","0","M1",,,"r. motorruimte","1915","1C",,"e1*2007/46*0277*01","UM91","5H","0","0.06","266","Nee","Nee",,"Nee","3180","0","0.00","2023","Geen oordeel","05","Ja","2024-09-16T00:00:00.000","2021-04-06T00:00:00.000","2010-07-02T00:00:00.000","2020-09-14T00:00:00.000",,,,,,,,,,,,,,,,,,,,,"C",,,,,,,"https://opendata.rdw.nl/resource/3huj-srit.json","https://opendata.rdw.nl/resource/8ys7-d773.json","https://opendata.rdw.nl/resource/vezc-m2t6.json","https://opendata.rdw.nl/resource/jhie-znh9.json","https://opendata.rdw.nl/resource/kmfi-hrps.json"
"TD277Z","Personenauto","BMW","118D","20250401","20180709","8074","cabriolet","4","GRIJS","Niet geregistreerd","4","1995","1460","1925","1560","690","1200","20120326","20180709","Geen verstrekking in Open Data","43993","Ja",,,,,,,"2","4","0","0",,"436","0","M1",,,"r. motorruimte","1925","1C",,"e1*2007/46*0277*04","UM91","5A","0","0.07","266","Nee","Nee",,"Nee","3180","0","0.00","2024","Geen oordeel","05","Ja","2025-04-01T00:00:00.000","2018-07-09T00:00:00.000","2012-03-26T00:00:00.000","2018-07-09T00:00:00.000",,,,,,,,,,,,,,,,,,,,,"D",,,,,,,"https://opendata.rdw.nl/resource/3huj-srit.json","https://opendata.rdw.nl/resource/8ys7-d773.json","https://opendata.rdw.nl/resource/vezc-m2t6.json","https://opendata.rdw.nl/resource/jhie-znh9.json","https://opendata.rdw.nl/resource/kmfi-hrps.json"
"TD959X","Personenauto","BMW","118D","20250131","20180827","8074","cabriolet","4","ZWART","Niet geregistreerd","4","1995","1460","1925","1560","690","1200","20130118","20180827","Geen verstrekking in Open Data","43032","Ja",,,,,,,"2","4","0","0",,"436","0","M1",,,"r. motorruimte","1925","1C",,"e1*2007/46*0277*04","UM91","5A","0","0.07","266","Nee","Nee",,"Nee","3180","0","0.00","2023","Geen oordeel","05","Ja","2025-01-31T00:00:00.000","2018-08-27T00:00:00.000","2013-01-18T00:00:00.000","2018-08-27T00:00:00.000",,,,,,,,,,,,,,,,,,,,,"D",,,,,,,"https://opendata.rdw.nl/resource/3huj-srit.json","https://opendata.rdw.nl/resource/8ys7-d773.json","https://opendata.rdw.nl/resource/vezc-m2t6.json","https://opendata.rdw.nl/resource/jhie-znh9.json","https://opendata.rdw.nl/resource/kmfi-hrps.json"