"kenteken","voertuigsoort","merk","handelsbenaming","vervaldatum_apk","datum_tenaamstelling","bruto_bpm","inrichting","aantal_zitplaatsen","eerste_kleur","tweede_kleur","aantal_cilinders","cilinderinhoud","massa_ledig_voertuig","toegestane_maximum_massa_voertuig","massa_rijklaar","maximum_massa_trekken_ongeremd","maximum_trekken_massa_geremd","datum_eerste_toelating","datum_eerste_tenaamstelling_in_nederland","wacht_op_keuren","catalogusprijs","wam_verzekerd","maximale_constructiesnelheid","laadvermogen","oplegger_geremd","aanhangwagen_autonoom_geremd","aanhangwagen_middenas_geremd","aantal_staanplaatsen","aantal_deuren","aantal_wielen","afstand_hart_koppeling_tot_achterzijde_voertuig","afstand_voorzijde_voertuig_tot_hart_koppeling","afwijkende_maximum_snelheid","lengte","breedte","europese_voertuigcategorie","europese_voertuigcategorie_toevoeging","europese_uitvoeringcategorie_toevoeging","plaats_chassisnummer","technische_max_massa_voertuig","type","type_gasinstallatie","typegoedkeuringsnummer","variant","uitvoering","volgnummer_wijziging_eu_typegoedkeuring","vermogen_massarijklaar","wielbasis","export_indicator","openstaande_terugroepactie_indicator","vervaldatum_tachograaf","taxi_indicator","maximum_massa_samenstelling","aantal_rolstoelplaatsen","maximum_ondersteunende_snelheid","jaar_laatste_registratie_tellerstand","tellerstandoordeel","code_toelichting_tellerstandoordeel","tenaamstellen_mogelijk","vervaldatum_apk_dt","datum_tenaamstelling_dt","datum_eerste_toelating_dt","datum_eerste_tenaamstelling_in_nederland_dt","vervaldatum_tachograaf_dt","maximum_last_onder_de_vooras_sen_tezamen_koppeling","type_remsysteem_voertuig_code","rupsonderstelconfiguratiecode","wielbasis_voertuig_minimum","wielbasis_voertuig_maximum","lengte_voertuig_minimum","lengte_voertuig_maximum","breedte_voertuig_minimum","breedte_voertuig_maximum","hoogte_voertuig","hoogte_voertuig_minimum","hoogte_voertuig_maximum","massa_bedrijfsklaar_minimaal","massa_bedrijfsklaar_maximaal","technisch_toelaatbaar_massa_koppelpunt","maximum_massa_technisch_maximaal","maximum_massa_technisch_minimaal","subcategorie_nederland","verticale_belasting_koppelpunt_getrokken_voertuig","zuinigheidsclassificatie","registratie_datum_goedkeuring_afschrijvingsmoment_bpm","registratie_datum_goedkeuring_afschrijvingsmoment_bpm_dt","gem_lading_wrde","aerodyn_voorz","massa_alt_aandr","verl_cab_ind","api_gekentekende_voertuigen_assen","api_gekentekende_voertuigen_brandstof","api_gekentekende_voertuigen_carrosserie","api_gekentekende_voertuigen_carrosserie_specifiek","api_gekentekende_voertuigen_voertuigklasse"
"05GPK5","Personenauto","BMW","Z3 COUPE","20250227","20080801","11469","coupe","2","ZWART","Niet geregistreerd","6","2793","1275","1570","1375","600","1200","20000809","20080801","Geen verstrekking in Open Data",,"Ja",,,,,,,"2","4",,,,,,"M1",,,"schutbord","1570",,,,,,,"0.10","244","Nee","Nee",,"Nee","2845",,,"2024","Geen oordeel","05","Ja","2025-02-27T00:00:00.000","2008-08-01T00:00:00.000","2000-08-09T00:00:00.000","2008-08-01T00:00:00.000",,"0",,,,,,,,,,,,,,,,,,,,,,,,,,"https://opendata.rdw.nl/resource/3huj-srit.json","https://opendata.rdw.nl/resource/8ys7-d773.json","https://opendata.rdw.nl/resource/vezc-m2t6.json","https://opendata.rdw.nl/resource/jhie-znh9.json","https://opendata.rdw.nl/resource/kmfi-hrps.json"
"28NKF9","Personenauto","BMW","Z3 COUPE","20241120","20140820","12599","coupe","2","ZWART","Niet geregistreerd","6","2979","1345","1640","1445",,,"20010613","20101001","Geen verstrekking in Open Data",,"Ja",,,,,,,"2","4",,,,,,"M1",,,"schutbord motorruimte","1640",,,,,,,"0.12","245","Nee","Nee",,"Nee",,,,"2024","Geen oordeel","05","Ja","2024-11-20T00:00:00.000","2014-08-20T00:00:00.000","2001-06-13T00:00:00.000","2010-10-01T00:00:00.000",,"0",,,,,,,,,,,,,,,,,,,,,,,,,,"https://opendata.rdw.nl/resource/3huj-srit.json","https://opendata.rdw.nl/resource/8ys7-d773.json","https://opendata.rdw.nl/resource/vezc-m2t6.json","https://opendata.rdw.nl/resource/jhie-znh9.json","https://opendata.rdw.nl/resource/kmfi-hrps.json"
"32TNV2","Personenauto","BMW","Z3 COUPE","20200408","20210315","12250","coupe","2","GROEN","Niet geregistreerd","6","2793","1280","1570","1380","690","1200","19990210","20120315","Geen verstrekking in Open Data",,"Ja",,,,,,,"2","4",,,,,,"M1",,,"schutbord motorruimte","1570",,,,,,,"0.10","244","Nee","Nee",,"Nee","2845",,,"2019","Geen oordeel","05","Ja","2020-04-08T00:00:00.000","2021-03-15T00:00:00.000","1999-02-10T00:00:00.000","2012-03-15T00:00:00.000",,"0",,,,,,,,,,,,,,,,,,,,,,,,,,"https://opendata.rdw.nl/resource/3huj-srit.json","https://opendata.rdw.nl/resource/8ys7-d773.json","https://opendata.rdw.nl/resource/vezc-m2t6.json","https://opendata.rdw.nl/resource/jhie-znh9.json","https://opendata.rdw.nl/resource/kmfi-hrps.json"
"34GNV4","Personenauto","BMW","Z3 COUPE","20201105","20151005","11044","coupe","4","BLAUW","Niet geregistreerd","6","2793","1340","1570","1440",,,"19990305","20080728","Geen verstrekking in Open Data",,"Nee",,,,,,,"2","4",,,,,,"M1",,,"schutbord","1570",,,,,,,"0.10","246","Nee","Nee",,"Nee",,,,"2019","Geen oordeel","05","Ja","2020-11-05T00:00:00.000","2015-10-05T00:00:00.000","1999-03-05T00:00:00.000","2008-07-28T00:00:00.000",,"0",,,,,,,,,,,,,,,,,,,,,,,,,,"https://opendata.rdw.nl/resource/3huj-srit.json","https://opendata.rdw.nl/resource/8ys7-d773.json","https://opendata.rdw.nl/resource/vezc-m2t6.json","https://opendata.rdw.nl/resource/jhie-znh9.json","https://opendata.rdw.nl/resource/kmfi-hrps.json"
"3XTG64","Personenauto","BMW","Z3 COUPE","20250420","20240205","12042","coupe","2","ZWART","Niet geregistreerd","6","2793","1275","1570","1375",,"1200","20000420","20141023","Geen verstrekking in Open Data",,"Ja",,,,,,,"2","4",,,,,,"M1",,,"r. schutbord","1570",,,,,,,"0.10","245","Nee","Nee",,"Nee","2845",,,"2024","Geen oordeel","05","Ja","2025-04-20T00:00:00.000","2024-02-05T00:00:00.000","2000-04-20T00:00:00.000","2014-10-23T00:00:00.000",,"0",,,,,,,,,,,,,,,,,,,,,,,,,,"https://opendata.rdw.nl/resource/3huj-srit.json","https://opendata.rdw.nl/resource/8ys7-d773.json","https://opendata.rdw.nl/resource/vezc-m2t6.json","https://opendata.rdw.nl/resource/jhie-znh9.json","https://opendata.rdw.nl/resource/kmfi-hrps.json"
"43XNPN","Personenauto","BMW","Z3 COUPE","20181005","20070724","11910","coupe","2","GROEN","Niet geregistreerd","6","2979","1380","1640","1480",,,"20001121","20070724","Geen verstrekking in Open Data",,"Ja",,,,,,,"2","4",,,,,,"M1",,,"midden tegen schutbord onder motorkap","1640",,,,,,,"0.11","245","Nee","Nee",,"Nee",,,,"2017","Geen oordeel","07","Ja","2018-10-05T00:00:00.000","2007-07-24T00:00:00.000","2000-11-21T00:00:00.000","2007-07-24T00:00:00.000",,"0",,,,,,,,,,,,,,,,,,,,,,,,,,"https://opendata.rdw.nl/resource/3huj-srit.json","https://opendata.rdw.nl/resource/8ys7-d773.json","https://opendata.rdw.nl/resource/vezc-m2t6.json","https://opendata.rdw.nl/resource/jhie-znh9.json","https://opendata.rdw.nl/resource/kmfi-hrps.json"
"4XTS72","Personenauto","BMW","Z3 COUPE","20240731","20230817","12134","coupe","2","BLAUW","Niet geregistreerd","6","2979","1345","1640","1445",,,"20000912","20141105","Geen verstrekking in Open Data",,"Ja",,,,,,,"2","4",,,,,,"M1",,,"midden op schutbord","1640",,,,,,,"0.12","244","Nee","Nee",,"Nee",,,,"2023","Geen oordeel","05","Ja","2024-07-31T00:00:00.000","2023-08-17T00:00:00.000","2000-09-12T00:00:00.000","2014-11-05T00:00:00.000",,"0",,,,,,,,,,,,,,,,,,,,,,,,,,"https://opendata.rdw.nl/resource/3huj-srit.json","https://opendata.rdw.nl/resource/8ys7-d773.json","https://opendata.rdw.nl/resource/vezc-m2t6.json","https://opendata.rdw.nl/resource/jhie-znh9.json","https://opendata.rdw.nl/resource/kmfi-hrps.json"
"66XVVT","Personenauto","BMW","Z3 COUPE","20240822","20201219","11676","coupe","2","ZWART","Niet geregistreerd","6","2793","1315","1610","1415","600","1200","19990908","20071016","Geen verstrekking in Open Data",,"Ja",,,,,,,"2","4",,,,,,"M1",,,"tegen schutbord onder motorkap","1610",,,,,,,"0.10","245","Nee","Nee",,"Nee",,,,"2023","Geen oordeel","05","Ja","2024-08-22T00:00:00.000","2020-12-19T00:00:00.000","1999-09-08T00:00:00.000","2007-10-16T00:00:00.000",,"0",,,,,,,,,,,,,,,,,,,,,,,,,,"https://opendata.rdw.nl/resource/3huj-srit.json","https://opendata.rdw.nl/resource/8ys7-d773.json","https://opendata.rdw.nl/resource/vezc-m2t6.json","https://opendata.rdw.nl/resource/jhie-znh9.json","https://opendata.rdw.nl/resource/kmfi-hrps.json"
"G040ND","Personenauto","BMW","Z3 COUPE","20250130","20240131","9566","coupe","2","ZWART","Niet geregistreerd","6","2979","1335","1630","1435",,,"20020531","20191025","Geen verstrekking in Open Data",,"Ja",,,,,,,"2","4",,,,,,"M1",,,"r. schutbord","1630",,,,,,,"0.12","245","Nee","Nee",,"Nee",,,,"2024","Niet geregistreerd","NG","Ja","2025-01-30T00:00:00.000","2024-01-31T00:00:00.000","2002-05-31T00:00:00.000","2019-10-25T00:00:00.000",,,,,,,,,,,,,,,,,,,,,,"20240207","2024-02-07T00:00:00.000",,,,,"https://opendata.rdw.nl/resource/3huj-srit.json","https://opendata.rdw.nl/resource/8ys7-d773.json","https://opendata.rdw.nl/resource/vezc-m2t6.json","https://opendata.rdw.nl/resource/jhie-znh9.json","https://opendata.rdw.nl/resource/kmfi-hrps.json"
"G736ZF","Personenauto","BMW","Z3 COUPE","20231222","20231211","20744","coupe","2","BLAUW","Niet geregistreerd","6","2979","1344","1600","1444",,,"20001201","20191218","Geen verstrekking in Open Data",,"Nee",,,,,,,"2","4",,,,,,"M1",,,"schutbord","1600",,,,,,,"0.12","245","Nee","Nee",,"Nee",,,,"2022","Geen oordeel","05","Ja","2023-12-22T00:00:00.000","2023-12-11T00:00:00.000","2000-12-01T00:00:00.000","2019-12-18T00:00:00.000",,,,,,,,,,,,,,,,,,,,,,,,,,,,"https://opendata.rdw.nl/resource/3huj-srit.json","https://opendata.rdw.nl/resource/8ys7-d773.json","https://opendata.rdw.nl/resource/vezc-m2t6.json","https://opendata.rdw.nl/resource/jhie-znh9.json","https://opendata.rdw.nl/resource/kmfi-hrps.json"
"GK539N","Personenauto","BMW","Z3 COUPE","20240831","20231002","11469","coupe","2","GRIJS","Niet geregistreerd","6","2793","1275","1570","1375","600","1200","20000323","20150612","Geen verstrekking in Open Data",,"Ja",,,,,,,"2","4",,,,,,"M1",,,"midden tegen schutbord onder motorkap","1570",,,,,,,"0.10","245","Nee","Nee",,"Nee","2845",,,"2023","Onlogisch","04","Ja","2024-08-31T00:00:00.000","2023-10-02T00:00:00.000","2000-03-23T00:00:00.000","2015-06-12T00:00:00.000",,,,,,,,,,,,,,,,,,,,,,,,,,,,"https://opendata.rdw.nl/resource/3huj-srit.json","https://opendata.rdw.nl/resource/8ys7-d773.json","https://opendata.rdw.nl/resource/vezc-m2t6.json","https://opendata.rdw.nl/resource/jhie-znh9.json","https://opendata.rdw.nl/resource/kmfi-hrps.json"
"JK872K","Personenauto","BMW","Z3 COUPE","20241231","20200103","13547","coupe","2","ZWART","Niet geregistreerd","6","2979","1305","1600","1405",,,"20010719","20160408","Geen verstrekking in Open Data",,"Ja",,,,,,,"2","4",,,,,,"M1",,,"schutbord motorruimte","1600","R/C",,,,,,"0.12","245","Nee","Nee",,"Nee",,,,"2023","Geen oordeel","05","Ja","2024-12-31T00:00:00.000","2020-01-03T00:00:00.000","2001-07-19T00:00:00.000","2016-04-08T00:00:00.000",,,,,,,,,,,,,,,,,,,,,,,,,,,,"https://opendata.rdw.nl/resource/3huj-srit.json","https://opendata.rdw.nl/resource/8ys7-d773.json","https://opendata.rdw.nl/resource/vezc-m2t6.json","https://opendata.rdw.nl/resource/jhie-znh9.json","https://opendata.rdw.nl/resource/kmfi-hrps.json"
"JX876R","Personenauto","BMW","Z3 COUPE","20240803","20220718","12599","coupe","2","BLAUW","Niet geregistreerd","6","2979","1340","1640","1440",,,"20010626","20160701","Geen verstrekking in Open Data",,"Ja","250",,,,,,"2","4",,,,,,"M1",,,"schutbord","1640","Z3 COUPE",,,,,,"0.12","245","Nee","Nee",,"Nee",,,,"2023","Geen oordeel","05","Ja","2024-08-03T00:00:00.000","2022-07-18T00:00:00.000","2001-06-26T00:00:00.000","2016-07-01T00:00:00.000",,,,,,,,,,,,,,,,,,,,,,,,,,,,"https://opendata.rdw.nl/resource/3huj-srit.json","https://opendata.rdw.nl/resource/8ys7-d773.json","https://opendata.rdw.nl/resource/vezc-m2t6.json","https://opendata.rdw.nl/resource/jhie-znh9.json","https://opendata.rdw.nl/resource/kmfi-hrps.json"
"KL708P","Personenauto","BMW","Z3 COUPE","20240528","20190528",,"coupe","2","GRIJS","Niet geregistreerd","6","2793","1325","1570","1425",,,"19990301","20161014","Geen verstrekking in Open Data",,"Ja",,,,,,,"2","4",,,,,,"M1",,,"schutbord by motorruimte","1570",,,,,,,"0.10","245","Nee","Nee",,"Nee",,,,"2023","Geen oordeel","05","Ja","2024-05-28T00:00:00.000","2019-05-28T00:00:00.000","1999-03-01T00:00:00.000","2016-10-14T00:00:00.000",,,,,,,,,,,,,,,,,,,,,,,,,,,,"https://opendata.rdw.nl/resource/3huj-srit.json","https://opendata.rdw.nl/resource/8ys7-d773.json","https://opendata.rdw.nl/resource/vezc-m2t6.json","https://opendata.rdw.nl/resource/jhie-znh9.json","https://opendata.rdw.nl/resource/kmfi-hrps.json"
"NN837L","Personenauto","BMW","BMW Z3 COUPE","20240729","20170316","11617","coupe","2","GEEL","Niet geregistreerd","6","2979","1305","1600","1405",,,"20000928","20170316","Geen verstrekking in Open Data",,"Ja",,,,,,,"2","4",,,,,,"M1",,,"r. schutbord by motorruimte","1600",,,,,,,"0.12","245","Nee","Nee",,"Nee",,,,"2023","Geen oordeel","05","Ja","2024-07-29T00:00:00.000","2017-03-16T00:00:00.000","2000-09-28T00:00:00.000","2017-03-16T00:00:00.000",,,,,,,,,,,,,,,,,,,,,,,,,,,,"https://opendata.rdw.nl/resource/3huj-srit.json","https://opendata.rdw.nl/resource/8ys7-d773.json","https://opendata.rdw.nl/resource/vezc-m2t6.json","https://opendata.rdw.nl/resource/jhie-znh9.json","https://opendata.rdw.nl/resource/kmfi-hrps.json"
"P237RZ","Personenauto","BMW","Z3 COUPE","20241031","20220523","19877","coupe","2","BLAUW","Niet geregistreerd","6","2979","1345","1640","1445",,,"20010820","20220523","Geen verstrekking in Open Data",,"Ja","242",,,,,,"2","4",,,,"403","174","M1",,,"midden tegen schutbord onder motorkap","1640",,,,,,,"0.12","245","Nee","Nee",,"Nee",,,,"2023","Geen oordeel","05","Ja","2024-10-31T00:00:00.000","2022-05-23T00:00:00.000","2001-08-20T00:00:00.000","2022-05-23T00:00:00.000",,,,,,,,,,,"131",,,,,,,,,,,"20220523","2022-05-23T00:00:00.000",,,,,"https://opendata.rdw.nl/resource/3huj-srit.json","https://opendata.rdw.nl/resource/8ys7-d773.json","https://opendata.rdw.nl/resource/vezc-m2t6.json","https://opendata.rdw.nl/resource/jhie-znh9.json","https://opendata.rdw.nl/resource/kmfi-hrps.json"
"PS782K","Personenauto","BMW","Z3 COUPE","20240913","20220507",,"coupe","2","BLAUW","Niet geregistreerd","6","2793","1315","1610","1415","600","1200","19990722","20170901","Geen verstrekking in Open Data",,"Ja",,,,,,,"2","4",,,,,,"M1",,,"by schutbord","1610","R/C",,,,,,"0.10","245","Nee","Nee",,"Nee","2885",,,"2023","Geen oordeel","05","Ja","2024-09-13T00:00:00.000","2022-05-07T00:00:00.000","1999-07-22T00:00:00.000","2017-09-01T00:00:00.000",,,,,,,,,,,,,,,,,,,,,,,,,,,,"https://opendata.rdw.nl/resource/3huj-srit.json","https://opendata.rdw.nl/resource/8ys7-d773.json","https://opendata.rdw.nl/resource/vezc-m2t6.json","https://opendata.rdw.nl/resource/jhie-znh9.json","https://opendata.rdw.nl/resource/kmfi-hrps.json"
"RB992R","Personenauto","BMW","BMW Z3 COUPE","20230517","20230415","13414","coupe","2","GRIJS","Niet geregistreerd","6","2979","1335","1630","1435",,,"20020714","20171019","Geen verstrekking in Open Data",,"Ja",,,,,,,"2","4",,,,,,"M1",,,"r. schutbord by motorruimte","1630","R/C",,,,,,"0.12","245","Nee","Nee",,"Nee",,,,"2023","Geen oordeel","05","Ja","2023-05-17T00:00:00.000","2023-04-15T00:00:00.000","2002-07-14T00:00:00.000","2017-10-19T00:00:00.000",,,,,,,,,,,,,,,,,,,,,,,,,,,,"https://opendata.rdw.nl/resource/3huj-srit.json","https://opendata.rdw.nl/resource/8ys7-d773.json","https://opendata.rdw.nl/resource/vezc-m2t6.json","https://opendata.rdw.nl/resource/jhie-znh9.json","https://opendata.rdw.nl/resource/kmfi-hrps.json"
"RH523N","Personenauto","BMW","Z3 COUPE","20240625","20171122",,"coupe","2","ZWART","Niet geregistreerd","6","2793","1336","1610","1436",,,"19990601","20171122","Geen verstrekking in Open Data",,"Ja",,,,,,,"2","4",,,,,,"M1",,,"schutbord","1610",,,,,,,"0.10","245","Nee","Nee",,"Nee",,,,"2023","Geen oordeel","05","Ja","2024-06-25T00:00:00.000","2017-11-22T00:00:00.000","1999-06-01T00:00:00.000","2017-11-22T00:00:00.000",,,,,,,,,,,,,,,,,,,,,,,,,,,,"https://opendata.rdw.nl/resource/3huj-srit.json","https://opendata.rdw.nl/resource/8ys7-d773.json","https://opendata.rdw.nl/resource/vezc-m2t6.json","https://opendata.rdw.nl/resource/jhie-znh9.json","https://opendata.rdw.nl/resource/kmfi-hrps.json"
"S577XL","Personenauto","BMW","Z3 COUPE","20250331","20230423","15965","coupe","2","WIT","Niet geregistreerd","6","2979","1305","1600","1405",,,"20001212","20230423","Geen verstrekking in Open Data",,"Ja","250",,,,,,"2","4",,,,,,"M1",,,,"1600","R/C",,,,,,"0.12","244","Nee","Nee",,"Nee",,,,"2023","Geen oordeel","05","Ja","2025-03-31T00:00:00.000","2023-04-23T00:00:00.000","2000-12-12T00:00:00.000","2023-04-23T00:00:00.000",,,,,,,,,,,,,,,,,,,,,,"20230419","2023-04-19T00:00:00.000",,,,,"https://opendata.rdw.nl/resource/3huj-srit.json","https://opendata.rdw.nl/resource/8ys7-d773.json","https://opendata.rdw.nl/resource/vezc-m2t6.json","https://opendata.rdw.nl/resource/jhie-znh9.json","https://opendata.rdw.nl/resource/kmfi-hrps.json"
"T028JP","Personenauto","BMW","Z3 COUPE","20241231","20230623","20953","coupe","2","ZWART","Niet geregistreerd","6","2979","1345","1640","1445",,,"20010201","20230623","Geen verstrekking in Open Data",,"Ja","242",,,,,,"2","4",,,,,,"M1",,,,"1640","R7C",,,,,,"0.12","245","Nee","Nee",,"Nee",,,,"2023","Geen oordeel","05","Ja","2024-12-31T00:00:00.000","2023-06-23T00:00:00.000","2001-02-01T00:00:00.000","2023-06-23T00:00:00.000",,,,,,,,,,,,,,,,,,,,,,"20230623","2023-06-23T00:00:00.000",,,,,"https://opendata.rdw.nl/resource/3huj-srit.json","https://opendata.rdw.nl/resource/8ys7-d773.json","https://opendata.rdw.nl/resource/vezc-m2t6.json","https://opendata.rdw.nl/resource/jhie-znh9.json","https://opendata.rdw.nl/resource/kmfi-hrps.json"
"T099TS","Personenauto","BMW","Z3 COUPE","20250531","20230912","12704","coupe","2","ZWART","Niet geregistreerd","6","2979","1305","1600","1405",,,"20031209","20230912","Geen verstrekking in Open Data",,"Ja","250",,,,,,"2","4",,,,"403","174","M1",,,,"1600","R/C",,,,,,"0.12","245","Nee","Nee",,"Nee",,,,"2023","Geen oordeel","05","Ja","2025-05-31T00:00:00.000","2023-09-12T00:00:00.000","2003-12-09T00:00:00.000","2023-09-12T00:00:00.000",,,,,,,,,,,"131",,,,,,,,,,,"20230824","2023-08-24T00:00:00.000",,,,,"https://opendata.rdw.nl/resource/3huj-srit.json","https://opendata.rdw.nl/resource/8ys7-d773.json","https://opendata.rdw.nl/resource/vezc-m2t6.json","https://opendata.rdw.nl/resource/jhie-znh9.json","https://opendata.rdw.nl/resource/kmfi-hrps.json"
"TK728B","Personenauto","BMW","Z3 COUPE","20230901","20230124","12080","coupe","2","GEEL","Niet geregistreerd","6","2793","1275","1570","1375","600","1200","20000212","20180824","Geen verstrekking in Open Data",,"Ja",,,,,,,"2","4",,,,,,"M1",,,"r. schutbord","1570","R/C",,,,,,"0.10","246","Nee","Nee",,"Nee",,,,"2023","Geen oordeel","05","Ja","2023-09-01T00:00:00.000","2023-01-24T00:00:00.000","2000-02-12T00:00:00.000","2018-08-24T00:00:00.000",,,,,,,,,,,,,,,,,,,,,,,,,,,,"https://opendata.rdw.nl/resource/3huj-srit.json","https://opendata.rdw.nl/resource/8ys7-d773.json","https://opendata.rdw.nl/resource/vezc-m2t6.json","https://opendata.rdw.nl/resource/jhie-znh9.json","https://opendata.rdw.nl/resource/kmfi-hrps.json"
"TT266K","Personenauto","BMW","Z3 COUPE","20240811","20230129","13476","coupe","2","BLAUW","Niet geregistreerd","6","2979","1305","1600","1405",,,"20010313","20191108","Geen verstrekking in Open Data",,"Ja",,,,,,,"2","4",,,,,,"M1",,,"r. schutbord motorruimte","1600",,,,,,,"0.12","245","Nee","Nee",,"Nee",,,,"2023","Geen oordeel","05","Ja","2024-08-11T00:00:00.000","2023-01-29T00:00:00.000","2001-03-13T00:00:00.000","2019-11-08T00:00:00.000",,,,,,,,,,,,,,,,,,,,,,,,,,,,"https://opendata.rdw.nl/resource/3huj-srit.json","https://opendata.rdw.nl/resource/8ys7-d773.json","https://opendata.rdw.nl/resource/vezc-m2t6.json","https://opendata.rdw.nl/resource/jhie-znh9.json","https://opendata.rdw.nl/resource/kmfi-hrps.json"
"XK875Z","Personenauto","BMW","Z3 COUPE","20240718","20190719","12401","coupe","2","BLAUW","Niet geregistreerd","6","2793","1250","1615","1350","600","1200","19990911","20190719","Geen verstrekking in Open Data",,"Ja",,,,,,,"2","4",,,,,,"M1",,,"r. schutbord by motorruimte","1615","R/C",,,,,,"0.11","245","Nee","Nee",,"Nee",,,,"2023","Geen oordeel","05","Ja","2024-07-18T00:00:00.000","2019-07-19T00:00:00.000","1999-09-11T00:00:00.000","2019-07-19T00:00:00.000",,,,,,,,,,,,,,,,,,,,,,,,,,,,"https://opendata.rdw.nl/resource/3huj-srit.json","https://opendata.rdw.nl/resource/8ys7-d773.json","https://opendata.rdw.nl/resource/vezc-m2t6.json","https://opendata.rdw.nl/resource/jhie-znh9.json","https://opendata.rdw.nl/resource/kmfi-hrps.json"
