"kenteken","voertuigsoort","merk","handelsbenaming","vervaldatum_apk","datum_tenaamstelling","bruto_bpm","inrichting","aantal_zitplaatsen","eerste_kleur","tweede_kleur","aantal_cilinders","cilinderinhoud","massa_ledig_voertuig","toegestane_maximum_massa_voertuig","massa_rijklaar","maximum_massa_trekken_ongeremd","maximum_trekken_massa_geremd","datum_eerste_toelating","datum_eerste_tenaamstelling_in_nederland","wacht_op_keuren","catalogusprijs","wam_verzekerd","maximale_constructiesnelheid","laadvermogen","oplegger_geremd","aanhangwagen_autonoom_geremd","aanhangwagen_middenas_geremd","aantal_staanplaatsen","aantal_deuren","aantal_wielen","afstand_hart_koppeling_tot_achterzijde_voertuig","afstand_voorzijde_voertuig_tot_hart_koppeling","afwijkende_maximum_snelheid","lengte","breedte","europese_voertuigcategorie","europese_voertuigcategorie_toevoeging","europese_uitvoeringcategorie_toevoeging","plaats_chassisnummer","technische_max_massa_voertuig","type","type_gasinstallatie","typegoedkeuringsnummer","variant","uitvoering","volgnummer_wijziging_eu_typegoedkeuring","vermogen_massarijklaar","wielbasis","export_indicator","openstaande_terugroepactie_indicator","vervaldatum_tachograaf","taxi_indicator","maximum_massa_samenstelling","aantal_rolstoelplaatsen","maximum_ondersteunende_snelheid","jaar_laatste_registratie_tellerstand","tellerstandoordeel","code_toelichting_tellerstandoordeel","tenaamstellen_mogelijk","vervaldatum_apk_dt","datum_tenaamstelling_dt","datum_eerste_toelating_dt","datum_eerste_tenaamstelling_in_nederland_dt","vervaldatum_tachograaf_dt","maximum_last_onder_de_vooras_sen_tezamen_koppeling","type_remsysteem_voertuig_code","rupsonderstelconfiguratiecode","wielbasis_voertuig_minimum","wielbasis_voertuig_maximum","lengte_voertuig_minimum","lengte_voertuig_maximum","breedte_voertuig_minimum","breedte_voertuig_maximum","hoogte_voertuig","hoogte_voertuig_minimum","hoogte_voertuig_maximum","massa_bedrijfsklaar_minimaal","massa_bedrijfsklaar_maximaal","technisch_toelaatbaar_massa_koppelpunt","maximum_massa_technisch_maximaal","maximum_massa_technisch_minimaal","subcategorie_nederland","verticale_belasting_koppelpunt_getrokken_voertuig","zuinigheidsclassificatie","registratie_datum_goedkeuring_afschrijvingsmoment_bpm","registratie_datum_goedkeuring_afschrijvingsmoment_bpm_dt","gem_lading_wrde","aerodyn_voorz","massa_alt_aandr","verl_cab_ind","api_gekentekende_voertuigen_assen","api_gekentekende_voertuigen_brandstof","api_gekentekende_voertuigen_carrosserie","api_gekentekende_voertuigen_carrosserie_specifiek","api_gekentekende_voertuigen_voertuigklasse"
"1XPZ91","Personenauto","BMW","X6 XDRIVE30D","20240918","20240426","5180","stationwagen","4","ZWART","Niet geregistreerd","6","2993","2050","2675","2150","750","2700","20100701","20140930","Geen verstrekking in Open Data","102984","Ja",,,,,,,"4","4","0","0",,"488","0","M1",,,"r. motorruimte","2675","X6",,"e1*2007/46*0412*00","FH61","5I","0","0.07","293","Nee","Ja",,"Nee","5495","0","0.00","2024","Geen oordeel","05","Ja","2024-09-18T00:00:00.000","2024-04-26T00:00:00.000","2010-07-01T00:00:00.000","2014-09-30T00:00:00.000",,"0",,,,,,,,,,,,,,,,,,,"C",,,,,,,"https://opendata.rdw.nl/resource/3huj-srit.json","https://opendata.rdw.nl/resource/8ys7-d773.json","https://opendata.rdw.nl/resource/vezc-m2t6.json","https://opendata.rdw.nl/resource/jhie-znh9.json","https://opendata.rdw.nl/resource/kmfi-hrps.json"
"1ZLR56","Personenauto","BMW","X6 XDRIVE30D","20250222","20190305","15741","sedan","5","GRIJS","Niet geregistreerd","6","2993","2040","2780","2140","750","2700","20150123","20150123","Geen verstrekking in Open Data","108267","Ja",,,,,,,"4","4","0","0",,"491","0","M1",,,"r. motorruimte","2780","X6",,"e1*2007/46*0412*08","KV21","6A250000","0","0.09","293","Nee","Ja",,"Nee","5620","0",,"2024","Logisch","00","Ja","2025-02-22T00:00:00.000","2019-03-05T00:00:00.000","2015-01-23T00:00:00.000","2015-01-23T00:00:00.000",,,,,,,,,,,,,,,,,,,,,"B",,,,,,,"https://opendata.rdw.nl/resource/3huj-srit.json","https://opendata.rdw.nl/resource/8ys7-d773.json","https://opendata.rdw.nl/resource/vezc-m2t6.json","https://opendata.rdw.nl/resource/jhie-znh9.json","https://opendata.rdw.nl/resource/kmfi-hrps.json"
"1ZLR83","Personenauto","BMW","X6 XDRIVE30D","20250102","20240516","15741","sedan","5","ZWART","Niet geregistreerd","6","2993","2040","2780","2140","750","2700","20150127","20150127","Geen verstrekking in Open Data","113227","Ja",,,,,,,"4","4","0","0",,"491","0","M1",,,"r. motorruimte","2780","X6",,"e1*2007/46*0412*09","KV21","6A250000","0","0.09","293","Nee","Ja",,"Nee","5620","0",,"2024","Logisch","00","Ja","2025-01-02T00:00:00.000","2024-05-16T00:00:00.000","2015-01-27T00:00:00.000","2015-01-27T00:00:00.000",,,,,,,,,,,,,,,,,,,,,"B",,,,,,,"https://opendata.rdw.nl/resource/3huj-srit.json","https://opendata.rdw.nl/resource/8ys7-d773.json","https://opendata.rdw.nl/resource/vezc-m2t6.json","https://opendata.rdw.nl/resource/jhie-znh9.json","https://opendata.rdw.nl/resource/kmfi-hrps.json"
"1ZPK43","Personenauto","BMW","X6 XDRIVE30D","20250302","20210118","15741","sedan","5","GRIJS","Niet geregistreerd","6","2993","2040","2780","2140","750","2700","20150302","20150302","Geen verstrekking in Open Data","102997","Ja",,,,,,,"4","4","0","0",,"491","0","M1",,,"r. motorruimte","2780","X6",,"e1*2007/46*0412*08","KV21","6A250000","0","0.09","293","Nee","Nee",,"Nee","5620","0",,"2024","Logisch","00","Ja","2025-03-02T00:00:00.000","2021-01-18T00:00:00.000","2015-03-02T00:00:00.000","2015-03-02T00:00:00.000",,,,,,,,,,,,,,,,,,,,,"B",,,,,,,"https://opendata.rdw.nl/resource/3huj-srit.json","https://opendata.rdw.nl/resource/8ys7-d773.json","https://opendata.rdw.nl/resource/vezc-m2t6.json","https://opendata.rdw.nl/resource/jhie-znh9.json","https://opendata.rdw.nl/resource/kmfi-hrps.json"
"1ZPK62","Personenauto","BMW","X6 XDRIVE30D","20240826","20150421","15741","sedan","5","GRIJS","Niet geregistreerd","6","2993","2040","2780","2140","750","2700","20150421","20150421","Geen verstrekking in Open Data","102997","Ja",,,,,,,"4","4","0","0",,"491","0","M1",,,"r. motorruimte","2780","X6",,"e1*2007/46*0412*08","KV21","6A250000","0","0.09","293","Nee","Ja",,"Nee","5620","0",,"2023","Logisch","00","Ja","2024-08-26T00:00:00.000","2015-04-21T00:00:00.000","2015-04-21T00:00:00.000","2015-04-21T00:00:00.000",,,,,,,,,,,,,,,,,,,,,"B",,,,,,,"https://opendata.rdw.nl/resource/3huj-srit.json","https://opendata.rdw.nl/resource/8ys7-d773.json","https://opendata.rdw.nl/resource/vezc-m2t6.json","https://opendata.rdw.nl/resource/jhie-znh9.json","https://opendata.rdw.nl/resource/kmfi-hrps.json"
"1ZPP15","Personenauto","BMW","X6 XDRIVE30D","20240705","20190709","15741","sedan","5","ZWART","Niet geregistreerd","6","2993","2040","2780","2140","750","2700","20150304","20150304","Geen verstrekking in Open Data","105912","Ja",,,,,,,"4","4","0","0",,"491","0","M1",,,"r. motorruimte","2780","X6",,"e1*2007/46*0412*09","KV21","6A250000","0","0.09","293","Nee","Nee",,"Nee","5620","0",,"2023","Logisch","00","Ja","2024-07-05T00:00:00.000","2019-07-09T00:00:00.000","2015-03-04T00:00:00.000","2015-03-04T00:00:00.000",,,,,,,,,,,,,,,,,,,,,"B",,,,,,,"https://opendata.rdw.nl/resource/3huj-srit.json","https://opendata.rdw.nl/resource/8ys7-d773.json","https://opendata.rdw.nl/resource/vezc-m2t6.json","https://opendata.rdw.nl/resource/jhie-znh9.json","https://opendata.rdw.nl/resource/kmfi-hrps.json"
"1ZSF08","Personenauto","BMW","X6 XDRIVE30D","20240905","20180915","15345","sedan","5","ZWART","Niet geregistreerd","6","2993","2040","2780","2140","750","3500","20150311","20150311","Geen verstrekking in Open Data","98292","Ja",,,,,,,"4","4","0","0",,"491","0","M1",,,"r. motorruimte","2780","X6",,"e1*2007/46*0412*09","KV21","6A15000A","0","0.09","293","Nee","Ja",,"Nee","6420","0",,"2023","Logisch","00","Ja","2024-09-05T00:00:00.000","2018-09-15T00:00:00.000","2015-03-11T00:00:00.000","2015-03-11T00:00:00.000",,,,,,,,,,,,,,,,,,,,,"B",,,,,,,"https://opendata.rdw.nl/resource/3huj-srit.json","https://opendata.rdw.nl/resource/8ys7-d773.json","https://opendata.rdw.nl/resource/vezc-m2t6.json","https://opendata.rdw.nl/resource/jhie-znh9.json","https://opendata.rdw.nl/resource/kmfi-hrps.json"
"29XFK9","Personenauto","BMW","X6 XDRIVE30D","20250421","20210422","16457","stationwagen","4","ZWART","Niet geregistreerd","6","2993","2050","2725","2150","750","3500","20110524","20120601","Geen verstrekking in Open Data","94904","Ja",,,,,,,"4","4","0","0",,"488","0","M1",,,"r. motorruimte","2725","X6",,"e1*2007/46*0412*03","FH61","5Z","0","0.08","293","Nee","Ja",,"Nee","6365","0","0.00","2024","Geen oordeel","05","Ja","2025-04-21T00:00:00.000","2021-04-22T00:00:00.000","2011-05-24T00:00:00.000","2012-06-01T00:00:00.000",,,,,,,,,,,,,,,,,,,,,"C",,,,,,,"https://opendata.rdw.nl/resource/3huj-srit.json","https://opendata.rdw.nl/resource/8ys7-d773.json","https://opendata.rdw.nl/resource/vezc-m2t6.json","https://opendata.rdw.nl/resource/jhie-znh9.json","https://opendata.rdw.nl/resource/kmfi-hrps.json"
"2XGS85","Personenauto","BMW","X6 XDRIVE30D","20241214","20150309","17548","stationwagen","5","WIT","Niet geregistreerd","6","2993","2050","2725","2150","750","3500","20121022","20140725","Geen verstrekking in Open Data","112850","Ja",,,,,,,"4","4","0","0",,"488","0","M1",,,"r. motorruimte","2725","X6",,"e1*2007/46*0412*03","FH61","DZ","0","0.08","293","Nee","Ja",,"Nee","6365","0","0.00","2023","Geen oordeel","05","Ja","2024-12-14T00:00:00.000","2015-03-09T00:00:00.000","2012-10-22T00:00:00.000","2014-07-25T00:00:00.000",,"0",,,,,,,,,,,,,,,,,,,"C",,,,,,,"https://opendata.rdw.nl/resource/3huj-srit.json","https://opendata.rdw.nl/resource/8ys7-d773.json","https://opendata.rdw.nl/resource/vezc-m2t6.json","https://opendata.rdw.nl/resource/jhie-znh9.json","https://opendata.rdw.nl/resource/kmfi-hrps.json"
"2ZPF29","Personenauto","BMW","X6 XDRIVE30D","20250213","20150310","15741","sedan","5","ROOD","Niet geregistreerd","6","2993","2040","2780","2140","750","3500","20150213","20150213","Geen verstrekking in Open Data","107860","Ja",,,,,,,"4","4","0","0",,"491","0","M1",,,"r. motorruimte","2780","X6",,"e1*2007/46*0412*08","KV21","6A25000A","0","0.09","293","Nee","Nee",,"Nee","6420","0",,"2024","Logisch","00","Ja","2025-02-13T00:00:00.000","2015-03-10T00:00:00.000","2015-02-13T00:00:00.000","2015-02-13T00:00:00.000",,,,,,,,,,,,,,,,,,,,,"B",,,,,,,"https://opendata.rdw.nl/resource/3huj-srit.json","https://opendata.rdw.nl/resource/8ys7-d773.json","https://opendata.rdw.nl/resource/vezc-m2t6.json","https://opendata.rdw.nl/resource/jhie-znh9.json","https://opendata.rdw.nl/resource/kmfi-hrps.json"
"3ZGF74","Personenauto","BMW","X6 XDRIVE30D","20250304","20231031","15079","sedan","5","ZWART","Niet geregistreerd","6","2993","2040","2780","2140","750","2700","20150107","20150107","Geen verstrekking in Open Data","109602","Ja",,,,,,,"4","4","0","0",,"491","0","M1",,,"r. motorruimte","2780","X6",,"e1*2007/46*0412*08","KV21","6A250000","0","0.09","293","Nee","Ja",,"Nee","5620","0",,"2024","Logisch","00","Ja","2025-03-04T00:00:00.000","2023-10-31T00:00:00.000","2015-01-07T00:00:00.000","2015-01-07T00:00:00.000",,,,,,,,,,,,,,,,,,,,,"B",,,,,,,"https://opendata.rdw.nl/resource/3huj-srit.json","https://opendata.rdw.nl/resource/8ys7-d773.json","https://opendata.rdw.nl/resource/vezc-m2t6.json","https://opendata.rdw.nl/resource/jhie-znh9.json","https://opendata.rdw.nl/resource/kmfi-hrps.json"
"3ZPF00","Personenauto","BMW","X6 XDRIVE30D","20250313","20230703","15741","sedan","5","ZWART","Niet geregistreerd","6","2993","2040","2780","2140","750","3500","20150213","20150213","Geen verstrekking in Open Data","113840","Ja",,,,,,,"4","4","0","0",,"491","0","M1",,,"r. motorruimte","2780","X6",,"e1*2007/46*0412*09","KV21","6A25000A","0","0.09","293","Nee","Ja",,"Nee","6420","0",,"2024","Logisch","00","Nee","2025-03-13T00:00:00.000","2023-07-03T00:00:00.000","2015-02-13T00:00:00.000","2015-02-13T00:00:00.000",,,,,,,,,,,,,,,,,,,,,"B",,,,,,,"https://opendata.rdw.nl/resource/3huj-srit.json","https://opendata.rdw.nl/resource/8ys7-d773.json","https://opendata.rdw.nl/resource/vezc-m2t6.json","https://opendata.rdw.nl/resource/jhie-znh9.json","https://opendata.rdw.nl/resource/kmfi-hrps.json"
"46KNT3","Personenauto","BMW","X6 XDRIVE30D","20250212","20211203","26874","stationwagen","4","ZWART","Niet geregistreerd","6","2993","2050","2725","2150","750","2700","20100111","20100111","Geen verstrekking in Open Data","97431","Ja",,,,,,,"4","4","0","0",,"488","0","M1",,,"op r. schroefveerkoker onder motorkap","2725","X70",,"e1*2001/116*0420*10","FG61","GA","0","0.08","293","Nee","Ja",,"Nee","5545","0",,"2024","Logisch","00","Ja","2025-02-12T00:00:00.000","2021-12-03T00:00:00.000","2010-01-11T00:00:00.000","2010-01-11T00:00:00.000",,,,,,,,,,,,,,,,,,,,,"D",,,,,,,"https://opendata.rdw.nl/resource/3huj-srit.json","https://opendata.rdw.nl/resource/8ys7-d773.json","https://opendata.rdw.nl/resource/vezc-m2t6.json","https://opendata.rdw.nl/resource/jhie-znh9.json","https://opendata.rdw.nl/resource/kmfi-hrps.json"
"49RBF3","Personenauto","BMW","X6 XDRIVE30D","20240809","20211103","17902","stationwagen","4","ZWART","Niet geregistreerd","6","2993","2050","2725","2150","750","2700","20110329","20110420","Geen verstrekking in Open Data","100396","Ja",,,,,,,"4","4","0","0",,"488","0","M1",,,"r. motorruimte","2725","X6",,"e1*2007/46*0412*01","FH61","5O","0","0.08","293","Nee","Ja",,"Nee","5545","0","0.00","2023","Logisch","00","Ja","2024-08-09T00:00:00.000","2021-11-03T00:00:00.000","2011-03-29T00:00:00.000","2011-04-20T00:00:00.000",,,,,,,,,,,,,,,,,,,,,"C",,,,,,,"https://opendata.rdw.nl/resource/3huj-srit.json","https://opendata.rdw.nl/resource/8ys7-d773.json","https://opendata.rdw.nl/resource/vezc-m2t6.json","https://opendata.rdw.nl/resource/jhie-znh9.json","https://opendata.rdw.nl/resource/kmfi-hrps.json"
"4ZBG46","Personenauto","BMW","X6 XDRIVE30D","20240629","20141201","16375","stationwagen","4","WIT","Niet geregistreerd","6","2993","2050","2675","2150","750","2700","20110407","20141201","Geen verstrekking in Open Data","100488","Ja",,,,,,,"4","4",,,,,,"M1",,,"r. motorruimte","2675",,,,,,,"0.08","293","Nee","Ja",,"Nee","5375",,,"2023","Geen oordeel","05","Ja","2024-06-29T00:00:00.000","2014-12-01T00:00:00.000","2011-04-07T00:00:00.000","2014-12-01T00:00:00.000",,"0",,,,,,,,,,,,,,,,,,,,,,,,,,"https://opendata.rdw.nl/resource/3huj-srit.json","https://opendata.rdw.nl/resource/8ys7-d773.json","https://opendata.rdw.nl/resource/vezc-m2t6.json","https://opendata.rdw.nl/resource/jhie-znh9.json","https://opendata.rdw.nl/resource/kmfi-hrps.json"
"4ZGR83","Personenauto","BMW","X6 XDRIVE30D","20240217","20210107","15079","sedan","5","WIT","Niet geregistreerd","6","2993","2040","2780","2140","750","2700","20150115","20150115","Geen verstrekking in Open Data","119843","Nee",,,,,,,"4","4","0","0",,"491","0","M1",,,"r. motorruimte","2780","X6",,"e1*2007/46*0412*08","KV21","6A250000","0","0.09","293","Nee","Nee",,"Nee","5620","0",,"2023","Logisch","00","Ja","2024-02-17T00:00:00.000","2021-01-07T00:00:00.000","2015-01-15T00:00:00.000","2015-01-15T00:00:00.000",,,,,,,,,,,,,,,,,,,,,"B",,,,,,,"https://opendata.rdw.nl/resource/3huj-srit.json","https://opendata.rdw.nl/resource/8ys7-d773.json","https://opendata.rdw.nl/resource/vezc-m2t6.json","https://opendata.rdw.nl/resource/jhie-znh9.json","https://opendata.rdw.nl/resource/kmfi-hrps.json"
"4ZLN17","Personenauto","BMW","X6 XDRIVE30D","20250118","20240113","15741","sedan","5","ZWART","Niet geregistreerd","6","2993","2040","2780","2140","750","2700","20150126","20150126","Geen verstrekking in Open Data","102997","Ja",,,,,,,"4","4","0","0",,"491","0","M1",,,"r. motorruimte","2780","X6",,"e1*2007/46*0412*08","KV21","6A250000","0","0.09","293","Nee","Ja",,"Nee","5620","0",,"2024","Logisch","00","Ja","2025-01-18T00:00:00.000","2024-01-13T00:00:00.000","2015-01-26T00:00:00.000","2015-01-26T00:00:00.000",,,,,,,,,,,,,,,,,,,,,"B",,,,,,,"https://opendata.rdw.nl/resource/3huj-srit.json","https://opendata.rdw.nl/resource/8ys7-d773.json","https://opendata.rdw.nl/resource/vezc-m2t6.json","https://opendata.rdw.nl/resource/jhie-znh9.json","https://opendata.rdw.nl/resource/kmfi-hrps.json"
"5TZJ05","Personenauto","BMW","X6 XDRIVE30D","20250109","20230107","17266","stationwagen","5","ZWART","Niet geregistreerd","6","2993","2050","2725","2150","750","2700","20130327","20140606","Geen verstrekking in Open Data","117583","Nee",,,,,,,"4","4","0","0",,"488","0","M1",,,"r. motorruimte","2725","X6",,"e1*2007/46*0412*06","FH61","5A05B","0","0.08","293","Nee","Ja",,"Nee","5545","0","0.00","2024","Geen oordeel","05","Ja","2025-01-09T00:00:00.000","2023-01-07T00:00:00.000","2013-03-27T00:00:00.000","2014-06-06T00:00:00.000",,"0",,,,,,,,,,,,,,,,,,,"C",,,,,,,"https://opendata.rdw.nl/resource/3huj-srit.json","https://opendata.rdw.nl/resource/8ys7-d773.json","https://opendata.rdw.nl/resource/vezc-m2t6.json","https://opendata.rdw.nl/resource/jhie-znh9.json","https://opendata.rdw.nl/resource/kmfi-hrps.json"
"61ZGH9","Personenauto","BMW","X6 XDRIVE30D","20240803","20211019","19097","stationwagen","4","ZWART","Niet geregistreerd","6","2993","2050","2675","2150","750","2700","20110301","20121101","Geen verstrekking in Open Data","105357","Ja",,,,,,,"4","4","0","0",,"488","0","M1",,,"r. motorruimte","2675","X6",,"e1*2007/46*0412*01","FH61","5S","0","0.08","293","Nee","Ja",,"Nee","5495","0","0.00","2023","Geen oordeel","05","Ja","2024-08-03T00:00:00.000","2021-10-19T00:00:00.000","2011-03-01T00:00:00.000","2012-11-01T00:00:00.000",,"0",,,,,,,,,,,,,,,,,,,"C",,,,,,,"https://opendata.rdw.nl/resource/3huj-srit.json","https://opendata.rdw.nl/resource/8ys7-d773.json","https://opendata.rdw.nl/resource/vezc-m2t6.json","https://opendata.rdw.nl/resource/jhie-znh9.json","https://opendata.rdw.nl/resource/kmfi-hrps.json"
"62RHK2","Personenauto","BMW","X6 XDRIVE30D","20241121","20180127","25560","stationwagen","4","WIT","Niet geregistreerd","6","2993","2050","2725","2150","750","2700","20110528","20110528","Geen verstrekking in Open Data","102561","Ja",,,,,,,"4","4","0","0",,"488","0","M1",,,"r. motorruimte","2725","X6",,"e1*2007/46*0412*01","FH61","5C","0","0.08","293","Nee","Ja",,"Nee","5545","0","0.00","2023","Logisch","00","Ja","2024-11-21T00:00:00.000","2018-01-27T00:00:00.000","2011-05-28T00:00:00.000","2011-05-28T00:00:00.000",,,,,,,,,,,,,,,,,,,,,"C",,,,,,,"https://opendata.rdw.nl/resource/3huj-srit.json","https://opendata.rdw.nl/resource/8ys7-d773.json","https://opendata.rdw.nl/resource/vezc-m2t6.json","https://opendata.rdw.nl/resource/jhie-znh9.json","https://opendata.rdw.nl/resource/kmfi-hrps.json"
"64ZHH2","Personenauto","BMW","X6 XDRIVE30D","20230401","20210326","15194","stationwagen","4","ZWART","Niet geregistreerd","6","2993","2050","2725","2150","750","3500","20100331","20121112","Geen verstrekking in Open Data","106619","Nee",,,,,,,"4","4","0","0",,"488","0","M1",,,"op r. schroefveerkoker onder motorkap","2725","X70",,"e1*2001/116*0420*10","FG61","GD","0","0.07","293","Nee","Ja",,"Nee","6365","0",,"2022","Geen oordeel","05","Nee","2023-04-01T00:00:00.000","2021-03-26T00:00:00.000","2010-03-31T00:00:00.000","2012-11-12T00:00:00.000",,"0",,,,,,,,,,,,,,,,,,,"D",,,,,,,"https://opendata.rdw.nl/resource/3huj-srit.json","https://opendata.rdw.nl/resource/8ys7-d773.json","https://opendata.rdw.nl/resource/vezc-m2t6.json","https://opendata.rdw.nl/resource/jhie-znh9.json","https://opendata.rdw.nl/resource/kmfi-hrps.json"
"65XGD4","Personenauto","BMW","X6 XDRIVE30D","20241025","20151223","21144","stationwagen","4","ZWART","Niet geregistreerd","6","2993","2050","2675","2150","750","2700","20110221","20120718","Geen verstrekking in Open Data","109199","Ja",,,,,,,"4","4","0","0",,"488","0","M1",,,"r. motorruimte","2675","X6",,"e1*2007/46*0412*01","FH61","5I","0","0.07","293","Nee","Nee",,"Nee","5495","0","0.00","2023","Onlogisch","04","Ja","2024-10-25T00:00:00.000","2015-12-23T00:00:00.000","2011-02-21T00:00:00.000","2012-07-18T00:00:00.000",,,,,,,,,,,,,,,,,,,,,"C",,,,,,,"https://opendata.rdw.nl/resource/3huj-srit.json","https://opendata.rdw.nl/resource/8ys7-d773.json","https://opendata.rdw.nl/resource/vezc-m2t6.json","https://opendata.rdw.nl/resource/jhie-znh9.json","https://opendata.rdw.nl/resource/kmfi-hrps.json"
"66NVF9","Personenauto","BMW","X6 XDRIVE30D","20240717","20210709","24519","stationwagen","4","ZWART","Niet geregistreerd","6","2993","2050","2725","2150","750","2700","20101203","20101203","Geen verstrekking in Open Data","96891","Nee",,,,,,,"4","4","0","0",,"488","0","M1",,,"r. motorruimte","2725","X6",,"e1*2007/46*0412*01","FH61","5C","0","0.08","293","Nee","Nee",,"Nee","5545","0","0.00","2023","Logisch","00","Ja","2024-07-17T00:00:00.000","2021-07-09T00:00:00.000","2010-12-03T00:00:00.000","2010-12-03T00:00:00.000",,,,,,,,,,,,,,,,,,,,,"C",,,,,,,"https://opendata.rdw.nl/resource/3huj-srit.json","https://opendata.rdw.nl/resource/8ys7-d773.json","https://opendata.rdw.nl/resource/vezc-m2t6.json","https://opendata.rdw.nl/resource/jhie-znh9.json","https://opendata.rdw.nl/resource/kmfi-hrps.json"
"6KLN28","Personenauto","BMW","X6 XDRIVE30D","20240509","20230809","22247","stationwagen","4","GRIJS","Niet geregistreerd","6","2993","2050","2725","2150","750","2700","20130823","20130823","Geen verstrekking in Open Data","98967","Ja",,,,,,,"4","4","0","0",,"488","0","M1",,,"r. motorruimte","2725","X6",,"e1*2007/46*0412*01","FH61","5O","0","0.08","293","Nee","Ja",,"Nee","5545","0","0.00","2023","Logisch","00","Ja","2024-05-09T00:00:00.000","2023-08-09T00:00:00.000","2013-08-23T00:00:00.000","2013-08-23T00:00:00.000",,,,,,,,,,,,,,,,,,,,,"C",,,,,,,"https://opendata.rdw.nl/resource/3huj-srit.json","https://opendata.rdw.nl/resource/8ys7-d773.json","https://opendata.rdw.nl/resource/vezc-m2t6.json","https://opendata.rdw.nl/resource/jhie-znh9.json","https://opendata.rdw.nl/resource/kmfi-hrps.json"
"6ZFK12","Personenauto","BMW","X6 XDRIVE30D","20240123","20221209","15079","sedan","5","GRIJS","Niet geregistreerd","6","2993","2040","2780","2140","750","3500","20150102","20150102","Geen verstrekking in Open Data","117915","Nee",,,,,,,"4","4","0","0",,"491","0","M1",,,"r. motorruimte","2780","X6",,"e1*2007/46*0412*08","KV21","6A25000A","0","0.09","293","Nee","Ja",,"Nee","6420","0",,"2023","Logisch","00","Ja","2024-01-23T00:00:00.000","2022-12-09T00:00:00.000","2015-01-02T00:00:00.000","2015-01-02T00:00:00.000",,,,,,,,,,,,,,,,,,,,,"B",,,,,,,"https://opendata.rdw.nl/resource/3huj-srit.json","https://opendata.rdw.nl/resource/8ys7-d773.json","https://opendata.rdw.nl/resource/vezc-m2t6.json","https://opendata.rdw.nl/resource/jhie-znh9.json","https://opendata.rdw.nl/resource/kmfi-hrps.json"
"6ZNT62","Personenauto","BMW","X6 XDRIVE30D","20240715","20231024","15741","sedan","5","WIT","Niet geregistreerd","6","2993","2040","2780","2140","750","2700","20150214","20150214","Geen verstrekking in Open Data","107877","Ja",,,,,,,"4","4","0","0",,"491","0","M1",,,"r. motorruimte","2780","X6",,"e1*2007/46*0412*08","KV21","6A250000","0","0.09","293","Nee","Ja",,"Nee","5620","0",,"2023","Logisch","00","Ja","2024-07-15T00:00:00.000","2023-10-24T00:00:00.000","2015-02-14T00:00:00.000","2015-02-14T00:00:00.000",,,,,,,,,,,,,,,,,,,,,"B","20220715","2022-07-15T00:00:00.000",,,,,"https://opendata.rdw.nl/resource/3huj-srit.json","https://opendata.rdw.nl/resource/8ys7-d773.json","https://opendata.rdw.nl/resource/vezc-m2t6.json","https://opendata.rdw.nl/resource/jhie-znh9.json","https://opendata.rdw.nl/resource/kmfi-hrps.json"