"kenteken","voertuigsoort","merk","handelsbenaming","vervaldatum_apk","datum_tenaamstelling","bruto_bpm","inrichting","aantal_zitplaatsen","eerste_kleur","tweede_kleur","aantal_cilinders","cilinderinhoud","massa_ledig_voertuig","toegestane_maximum_massa_voertuig","massa_rijklaar","maximum_massa_trekken_ongeremd","maximum_trekken_massa_geremd","datum_eerste_toelating","datum_eerste_tenaamstelling_in_nederland","wacht_op_keuren","catalogusprijs","wam_verzekerd","maximale_constructiesnelheid","laadvermogen","oplegger_geremd","aanhangwagen_autonoom_geremd","aanhangwagen_middenas_geremd","aantal_staanplaatsen","aantal_deuren","aantal_wielen","afstand_hart_koppeling_tot_achterzijde_voertuig","afstand_voorzijde_voertuig_tot_hart_koppeling","afwijkende_maximum_snelheid","lengte","breedte","europese_voertuigcategorie","europese_voertuigcategorie_toevoeging","europese_uitvoeringcategorie_toevoeging","plaats_chassisnummer","technische_max_massa_voertuig","type","type_gasinstallatie","typegoedkeuringsnummer","variant","uitvoering","volgnummer_wijziging_eu_typegoedkeuring","vermogen_massarijklaar","wielbasis","export_indicator","openstaande_terugroepactie_indicator","vervaldatum_tachograaf","taxi_indicator","maximum_massa_samenstelling","aantal_rolstoelplaatsen","maximum_ondersteunende_snelheid","jaar_laatste_registratie_tellerstand","tellerstandoordeel","code_toelichting_tellerstandoordeel","tenaamstellen_mogelijk","vervaldatum_apk_dt","datum_tenaamstelling_dt","datum_eerste_toelating_dt","datum_eerste_tenaamstelling_in_nederland_dt","vervaldatum_tachograaf_dt","maximum_last_onder_de_vooras_sen_tezamen_koppeling","type_remsysteem_voertuig_code","rupsonderstelconfiguratiecode","wielbasis_voertuig_minimum","wielbasis_voertuig_maximum","lengte_voertuig_minimum","lengte_voertuig_maximum","breedte_voertuig_minimum","breedte_voertuig_maximum","hoogte_voertuig","hoogte_voertuig_minimum","hoogte_voertuig_maximum","massa_bedrijfsklaar_minimaal","massa_bedrijfsklaar_maximaal","technisch_toelaatbaar_massa_koppelpunt","maximum_massa_technisch_maximaal","maximum_massa_technisch_minimaal","subcategorie_nederland","verticale_belasting_koppelpunt_getrokken_voertuig","zuinigheidsclassificatie","registratie_datum_goedkeuring_afschrijvingsmoment_bpm","registratie_datum_goedkeuring_afschrijvingsmoment_bpm_dt","gem_lading_wrde","aerodyn_voorz","massa_alt_aandr","verl_cab_ind","api_gekentekende_voertuigen_assen","api_gekentekende_voertuigen_brandstof","api_gekentekende_voertuigen_carrosserie","api_gekentekende_voertuigen_carrosserie_specifiek","api_gekentekende_voertuigen_voertuigklasse"
"G628HJ","Personenauto","BMW","X RHEIHE","20250125","20231227","11123","stationwagen","5","ZWART","Niet geregistreerd","8","4395","2165","2870","2265","750","2700","20110729","20190924","Geen verstrekking in Open Data","155071","Ja","250",,,,,,"4","4","0","0",,"486","193","M1",,,,"2870","X5",,"e1*2007/46*0421*03","ZV81","5S","0","0.13","293","Nee","Ja",,"Nee","5690","0","0.00","2024","Geen oordeel","05","Ja","2025-01-25T00:00:00.000","2023-12-27T00:00:00.000","2011-07-29T00:00:00.000","2019-09-24T00:00:00.000",,,,,,,,,,,"178",,,,,,,,,,"G",,,,,,,"https://opendata.rdw.nl/resource/3huj-srit.json","https://opendata.rdw.nl/resource/8ys7-d773.json","https://opendata.rdw.nl/resource/vezc-m2t6.json","https://opendata.rdw.nl/resource/jhie-znh9.json","https://opendata.rdw.nl/resource/kmfi-hrps.json"
"HF293N","Personenauto","BMW","X RHEIHE","20241021","20190228","22247","stationwagen","5","ZWART","Niet geregistreerd","6","2993","2050","2755","2150","750","2700","20110526","20151021","Geen verstrekking in Open Data","87682","Ja",,,,,,,"4","4","0","0",,"486","0","M1",,,"r. motorruimte","2755","X5",,"e1*2007/46*0421*03","ZW41","5I","0","0.07","293","Nee","Ja",,"Nee","5575","0","0.00","2024","Geen oordeel","05","Ja","2024-10-21T00:00:00.000","2019-02-28T00:00:00.000","2011-05-26T00:00:00.000","2015-10-21T00:00:00.000",,,,,,,,,,,,,,,,,,,,,"D",,,,,,,"https://opendata.rdw.nl/resource/3huj-srit.json","https://opendata.rdw.nl/resource/8ys7-d773.json","https://opendata.rdw.nl/resource/vezc-m2t6.json","https://opendata.rdw.nl/resource/jhie-znh9.json","https://opendata.rdw.nl/resource/kmfi-hrps.json"
"HP011F","Personenauto","BMW","X RHEIHE","20240731","20151209","18759","stationwagen","5","GRIJS","Niet geregistreerd","6","2993","2050","2755","2150","750","2700","20110714","20151209","Geen verstrekking in Open Data","102020","Ja",,,,,,,"4","4","0","0",,"486","0","M1",,,"r. motorruimte","2755","X5",,"e1*2007/46*0421*03","ZW41","5S","0","0.08","293","Nee","Nee",,"Nee","5575","0","0.00","2024","Geen oordeel","05","Ja","2024-07-31T00:00:00.000","2015-12-09T00:00:00.000","2011-07-14T00:00:00.000","2015-12-09T00:00:00.000",,,,,,,,,,,,,,,,,,,,,"D",,,,,,,"https://opendata.rdw.nl/resource/3huj-srit.json","https://opendata.rdw.nl/resource/8ys7-d773.json","https://opendata.rdw.nl/resource/vezc-m2t6.json","https://opendata.rdw.nl/resource/jhie-znh9.json","https://opendata.rdw.nl/resource/kmfi-hrps.json"
"HZ016P","Personenauto","BMW","X RHEIHE","20240817","20200818","21086","stationwagen","5","WIT","Niet geregistreerd","6","2993","2050","2755","2150","750","2700","20110721","20160316","Geen verstrekking in Open Data","103428","Ja",,,,,,,"4","4","0","0",,"486","0","M1",,,"r. motorruimte","2755","X5",,"e1*2007/46*0421*03","ZW41","5S","0","0.08","293","Nee","Ja",,"Nee","5575","0","0.00","2023","Geen oordeel","05","Ja","2024-08-17T00:00:00.000","2020-08-18T00:00:00.000","2011-07-21T00:00:00.000","2016-03-16T00:00:00.000",,,,,,,,,,,,,,,,,,,,,"D",,,,,,,"https://opendata.rdw.nl/resource/3huj-srit.json","https://opendata.rdw.nl/resource/8ys7-d773.json","https://opendata.rdw.nl/resource/vezc-m2t6.json","https://opendata.rdw.nl/resource/jhie-znh9.json","https://opendata.rdw.nl/resource/kmfi-hrps.json"
"J239LN","Personenauto","BMW","X RHEIHE","20250123","20200906","14979","stationwagen","7","GRIJS","Niet geregistreerd","6","2993","2050","2965","2150","750","2700","20110914","20200906","Geen verstrekking in Open Data","107131","Ja","222",,,,,,"4","4",,,,"486","193","M1",,,,"2965","X5",,"e1*2007/46*0421*03","ZW41","5Q","0","0.08","293","Nee","Ja",,"Nee","5785",,,"2024","Geen oordeel","05","Ja","2025-01-23T00:00:00.000","2020-09-06T00:00:00.000","2011-09-14T00:00:00.000","2020-09-06T00:00:00.000",,,,,,,,,,,"178",,,,,,,,,,"D",,,,,,,"https://opendata.rdw.nl/resource/3huj-srit.json","https://opendata.rdw.nl/resource/8ys7-d773.json","https://opendata.rdw.nl/resource/vezc-m2t6.json","https://opendata.rdw.nl/resource/jhie-znh9.json","https://opendata.rdw.nl/resource/kmfi-hrps.json"
"JL755J","Personenauto","BMW","X RHEIHE","20240829","20160808","19237","stationwagen","5","BRUIN","Niet geregistreerd","6","2993","2050","2755","2150","750","2700","20110518","20160720","Geen verstrekking in Open Data","66033","Ja",,,,,,,"4","4","0","0",,"486","0","M1",,,"r. motorruimte","2755","X5",,"e1*2007/46*0421*03","ZW41","5I","0","0.07","293","Nee","Ja",,"Nee","5575","0","0.00","2023","Geen oordeel","05","Ja","2024-08-29T00:00:00.000","2016-08-08T00:00:00.000","2011-05-18T00:00:00.000","2016-07-20T00:00:00.000",,,,,,,,,,,,,,,,,,,,,"D",,,,,,,"https://opendata.rdw.nl/resource/3huj-srit.json","https://opendata.rdw.nl/resource/8ys7-d773.json","https://opendata.rdw.nl/resource/vezc-m2t6.json","https://opendata.rdw.nl/resource/jhie-znh9.json","https://opendata.rdw.nl/resource/kmfi-hrps.json"
"L488TN","Personenauto","BMW","X RHEIHE","20240812","20231103",,"stationwagen","5","ZWART","Niet geregistreerd","6","2979","2045","2750","2145","750","2700","20110512","20210728","Geen verstrekking in Open Data",,"Ja","235",,,,,,"4","4",,,,"486","193","M1",,,,"2750","X5",,"e1*2007/46*0421*03","ZV41","5B","0","0.10","293","Nee","Nee",,"Nee","5570",,,"2024","Geen oordeel","05","Ja","2024-08-12T00:00:00.000","2023-11-03T00:00:00.000","2011-05-12T00:00:00.000","2021-07-28T00:00:00.000",,,,,,,,,,,"178",,,,,,,,,,,,,,,,,"https://opendata.rdw.nl/resource/3huj-srit.json","https://opendata.rdw.nl/resource/8ys7-d773.json","https://opendata.rdw.nl/resource/vezc-m2t6.json","https://opendata.rdw.nl/resource/jhie-znh9.json","https://opendata.rdw.nl/resource/kmfi-hrps.json"
"L910RF","Personenauto","BMW","X RHEIHE","20240516","20230701","6545","stationwagen","5","ZWART","Niet geregistreerd","6","2993","2050","2840","2150","750","3500","20110712","20210707","Geen verstrekking in Open Data","101489","Nee","222",,,,,,"4","4","0","0",,"486","193","M1",,,,"2840","X5",,"e1*2007/46*0421*03","ZW41","5L","0","0.08","293","Nee","Ja",,"Nee","6480","0","0.00","2023","Geen oordeel","05","Ja","2024-05-16T00:00:00.000","2023-07-01T00:00:00.000","2011-07-12T00:00:00.000","2021-07-07T00:00:00.000",,,,,,,,,,,"178",,,,,,,,,,,,,,,,,"https://opendata.rdw.nl/resource/3huj-srit.json","https://opendata.rdw.nl/resource/8ys7-d773.json","https://opendata.rdw.nl/resource/vezc-m2t6.json","https://opendata.rdw.nl/resource/jhie-znh9.json","https://opendata.rdw.nl/resource/kmfi-hrps.json"
"NV875B","Personenauto","BMW","X RHEIHE","20241004","20240413","22247","stationwagen","5","GRIJS","Niet geregistreerd","6","2993","2050","2755","2150","750","2700","20110715","20170424","Geen verstrekking in Open Data","85315","Ja",,,,,,,"4","4","0","0",,"486","0","M1",,,"r. motorruimte","2755","X5",,"e1*2007/46*0421*03","ZW41","5S","0","0.08","293","Nee","Ja",,"Nee","5575","0","0.00","2024","Geen oordeel","05","Ja","2024-10-04T00:00:00.000","2024-04-13T00:00:00.000","2011-07-15T00:00:00.000","2017-04-24T00:00:00.000",,,,,,,,,,,,,,,,,,,,,"D",,,,,,,"https://opendata.rdw.nl/resource/3huj-srit.json","https://opendata.rdw.nl/resource/8ys7-d773.json","https://opendata.rdw.nl/resource/vezc-m2t6.json","https://opendata.rdw.nl/resource/jhie-znh9.json","https://opendata.rdw.nl/resource/kmfi-hrps.json"
"PF994F","Personenauto","BMW","X RHEIHE","20240715","20190810","3183","stationwagen","5","ZWART","Niet geregistreerd","6","2993","2050","2755","2150","750","2700","20110712","20170607","Geen verstrekking in Open Data","93835","Ja",,,,,,,"4","4","0","0",,"486","0","M1",,,"r. motorruimte","2755","X5",,"e1*2007/46*0421*03","ZW41","5S","0","0.08","293","Nee","Ja",,"Nee","5575","0","0.00","2023","Geen oordeel","05","Ja","2024-07-15T00:00:00.000","2019-08-10T00:00:00.000","2011-07-12T00:00:00.000","2017-06-07T00:00:00.000",,,,,,,,,,,,,,,,,,,,,"D",,,,,,,"https://opendata.rdw.nl/resource/3huj-srit.json","https://opendata.rdw.nl/resource/8ys7-d773.json","https://opendata.rdw.nl/resource/vezc-m2t6.json","https://opendata.rdw.nl/resource/jhie-znh9.json","https://opendata.rdw.nl/resource/kmfi-hrps.json"
"PJ286Z","Personenauto","BMW","X RHEIHE","20180719","20230121","12052","stationwagen","5","ZWART","Niet geregistreerd","6","2993","2085","2875","2185","750","3500","20110826","20170713","Geen verstrekking in Open Data","115909","Nee",,,,,,,"4","4","0","0",,"486","0","M1",,,"r. motorruimte","2875","X5",,"e1*2007/46*0421*03","ZW61","5A","0","0.10","293","Nee","Ja",,"Nee","6515","0","0.00","2023","Geen oordeel","05","Ja","2018-07-19T00:00:00.000","2023-01-21T00:00:00.000","2011-08-26T00:00:00.000","2017-07-13T00:00:00.000",,,,,,,,,,,,,,,,,,,,,"D",,,,,,,"https://opendata.rdw.nl/resource/3huj-srit.json","https://opendata.rdw.nl/resource/8ys7-d773.json","https://opendata.rdw.nl/resource/vezc-m2t6.json","https://opendata.rdw.nl/resource/jhie-znh9.json","https://opendata.rdw.nl/resource/kmfi-hrps.json"
"PP723L","Personenauto","BMW","X RHEIHE","20250316","20210320","9972","stationwagen","5","ZWART","Niet geregistreerd","8","4395","2165","2870","2265","750","2700","20110520","20170814","Geen verstrekking in Open Data","140184","Ja",,,,,,,"4","4","0","0",,"486","0","M1",,,"r. motorruimte","2870","X5",,"e1*2007/46*0421*03","ZV81","5S","0","0.13","293","Nee","Ja",,"Nee","5690","0","0.00","2024","Geen oordeel","05","Ja","2025-03-16T00:00:00.000","2021-03-20T00:00:00.000","2011-05-20T00:00:00.000","2017-08-14T00:00:00.000",,,,,,,,,,,,,,,,,,,,,"G",,,,,,,"https://opendata.rdw.nl/resource/3huj-srit.json","https://opendata.rdw.nl/resource/8ys7-d773.json","https://opendata.rdw.nl/resource/vezc-m2t6.json","https://opendata.rdw.nl/resource/jhie-znh9.json","https://opendata.rdw.nl/resource/kmfi-hrps.json"
"PZ934G","Personenauto","BMW","X RHEIHE","20240930","20171005","22247","stationwagen","7","BLAUW","Niet geregistreerd","6","2993","2050","2965","2150","750","2700","20111005","20171005","Geen verstrekking in Open Data","91149","Ja",,,,,,,"4","4","0","0",,"486","0","M1",,,"r. motorruimte","2965","X5",,"e1*2007/46*0421*03","ZW41","5R","0","0.07","293","Nee","Nee",,"Nee","5785","0","0.00","2023","Geen oordeel","05","Ja","2024-09-30T00:00:00.000","2017-10-05T00:00:00.000","2011-10-05T00:00:00.000","2017-10-05T00:00:00.000",,,,,,,,,,,,,,,,,,,,,"D",,,,,,,"https://opendata.rdw.nl/resource/3huj-srit.json","https://opendata.rdw.nl/resource/8ys7-d773.json","https://opendata.rdw.nl/resource/vezc-m2t6.json","https://opendata.rdw.nl/resource/jhie-znh9.json","https://opendata.rdw.nl/resource/kmfi-hrps.json"
"R192NG","Personenauto","BMW","X RHEIHE","20250308","20221011","3756","stationwagen","7","ZWART","Niet geregistreerd","6","2993","2050","2965","2150","750","3500","20110802","20221011","Geen verstrekking in Open Data","93279","Ja","210",,,,,,"4","4",,,,"486","193","M1",,,,"2965","X5",,"e1*2007/46*0421*03","ZW41","5M","0","0.07","293","Nee","Ja",,"Nee","6605",,,"2024","Geen oordeel","05","Ja","2025-03-08T00:00:00.000","2022-10-11T00:00:00.000","2011-08-02T00:00:00.000","2022-10-11T00:00:00.000",,,,,,,,,,,"178",,,,,,,,,,,"20221005","2022-10-05T00:00:00.000",,,,,"https://opendata.rdw.nl/resource/3huj-srit.json","https://opendata.rdw.nl/resource/8ys7-d773.json","https://opendata.rdw.nl/resource/vezc-m2t6.json","https://opendata.rdw.nl/resource/jhie-znh9.json","https://opendata.rdw.nl/resource/kmfi-hrps.json"
"S408VL","Personenauto","BMW","X RHEIHE","20250131","20230413","43671","stationwagen","7","GRIJS","Niet geregistreerd","8","4395","2165","3025","2265","750","3500","20110809","20230413","Geen verstrekking in Open Data","116904","Ja","250",,,,,,"4","4",,,,"486","193","M1",,,"r. motorruimte","3025","X5",,"e1*2007/46*0421*03","ZV81","5Y","0","0.13","293","Nee","Nee",,"Nee","6665",,,"2023","Geen oordeel","05","Ja","2025-01-31T00:00:00.000","2023-04-13T00:00:00.000","2011-08-09T00:00:00.000","2023-04-13T00:00:00.000",,,,,,,,,,,"178",,,,,,,,,,,"20230412","2023-04-12T00:00:00.000",,,,,"https://opendata.rdw.nl/resource/3huj-srit.json","https://opendata.rdw.nl/resource/8ys7-d773.json","https://opendata.rdw.nl/resource/vezc-m2t6.json","https://opendata.rdw.nl/resource/jhie-znh9.json","https://opendata.rdw.nl/resource/kmfi-hrps.json"
"SL008X","Personenauto","BMW","X RHEIHE","20240503","20240312","13125","stationwagen","5","GRIJS","Niet geregistreerd","6","2993","2085","2875","2185","750","3500","20110728","20180426","Geen verstrekking in Open Data","119684","Nee",,,,,,,"4","4","0","0",,"486","0","M1",,,"r. motorruimte","2875","X5",,"e1*2007/46*0421*03","ZW61","5A","0","0.10","293","Nee","Ja",,"Nee","6515","0","0.00","2023","Geen oordeel","05","Ja","2024-05-03T00:00:00.000","2024-03-12T00:00:00.000","2011-07-28T00:00:00.000","2018-04-26T00:00:00.000",,,,,,,,,,,,,,,,,,,,,"D",,,,,,,"https://opendata.rdw.nl/resource/3huj-srit.json","https://opendata.rdw.nl/resource/8ys7-d773.json","https://opendata.rdw.nl/resource/vezc-m2t6.json","https://opendata.rdw.nl/resource/jhie-znh9.json","https://opendata.rdw.nl/resource/kmfi-hrps.json"
"SN094G","Personenauto","BMW","X RHEIHE","20250507","20180505","19587","stationwagen","5","ZWART","Niet geregistreerd","6","2993","2050","2755","2150","750","2700","20110830","20180505","Geen verstrekking in Open Data","110350","Ja",,,,,,,"4","4",,,,,,"M1",,,"r. motorruimte","2755","X5",,,,,,"0.08","293","Nee","Ja",,"Nee","5575",,,"2024","Geen oordeel","05","Ja","2025-05-07T00:00:00.000","2018-05-05T00:00:00.000","2011-08-30T00:00:00.000","2018-05-05T00:00:00.000",,,,,,,,,,,,,,,,,,,,,"D",,,,,,,"https://opendata.rdw.nl/resource/3huj-srit.json","https://opendata.rdw.nl/resource/8ys7-d773.json","https://opendata.rdw.nl/resource/vezc-m2t6.json","https://opendata.rdw.nl/resource/jhie-znh9.json","https://opendata.rdw.nl/resource/kmfi-hrps.json"
"TD846G","Personenauto","BMW","X RHEIHE","20250423","20230916","11152","stationwagen","7","GRIJS","Niet geregistreerd","6","2979","2045","2960","2145","750","3500","20110614","20180704","Geen verstrekking in Open Data","108798","Ja",,,,,,,"4","4","0","0",,"486","0","M1",,,"r. motorruimte","2960","X5",,"e1*2007/46*0421*03","ZV41","5X","0","0.10","293","Nee","Ja",,"Nee","6600","0","0.00","2024","Geen oordeel","05","Ja","2025-04-23T00:00:00.000","2023-09-16T00:00:00.000","2011-06-14T00:00:00.000","2018-07-04T00:00:00.000",,,,,,,,,,,,,,,,,,,,,"D",,,,,,,"https://opendata.rdw.nl/resource/3huj-srit.json","https://opendata.rdw.nl/resource/8ys7-d773.json","https://opendata.rdw.nl/resource/vezc-m2t6.json","https://opendata.rdw.nl/resource/jhie-znh9.json","https://opendata.rdw.nl/resource/kmfi-hrps.json"
"TL742D","Personenauto","BMW","X RHEIHE","20240531","20200530","1646","stationwagen","5","ROOD","Niet geregistreerd","6","2979","2045","2835","2145","750","3500","20110706","20180824","Geen verstrekking in Open Data","114044","Ja",,,,,,,"4","4","0","0",,"486","0","M1",,,"r. motorruimte","2835","X5",,"e1*2007/46*0421*03","ZV41","5A","0","0.10","293","Nee","Ja",,"Nee","6475","0","0.00","2023","Geen oordeel","05","Ja","2024-05-31T00:00:00.000","2020-05-30T00:00:00.000","2011-07-06T00:00:00.000","2018-08-24T00:00:00.000",,,,,,,,,,,,,,,,,,,,,"D",,,,,,,"https://opendata.rdw.nl/resource/3huj-srit.json","https://opendata.rdw.nl/resource/8ys7-d773.json","https://opendata.rdw.nl/resource/vezc-m2t6.json","https://opendata.rdw.nl/resource/jhie-znh9.json","https://opendata.rdw.nl/resource/kmfi-hrps.json"
"TL785T","Personenauto","BMW","X RHEIHE","20240721","20220405","13816","stationwagen","5","ZWART","Niet geregistreerd","6","2993","2050","2755","2150","750","2700","20110623","20180906","Geen verstrekking in Open Data","106400","Ja",,,,,,,"4","4","0","0",,"486","0","M1",,,"r. motorruimte","2755","X5",,"e1*2007/46*0421*03","ZW41","5S","0","0.08","293","Nee","Ja",,"Nee","5575","0","0.00","2023","Geen oordeel","05","Ja","2024-07-21T00:00:00.000","2022-04-05T00:00:00.000","2011-06-23T00:00:00.000","2018-09-06T00:00:00.000",,,,,,,,,,,,,,,,,,,,,"D",,,,,,,"https://opendata.rdw.nl/resource/3huj-srit.json","https://opendata.rdw.nl/resource/8ys7-d773.json","https://opendata.rdw.nl/resource/vezc-m2t6.json","https://opendata.rdw.nl/resource/jhie-znh9.json","https://opendata.rdw.nl/resource/kmfi-hrps.json"
"TN032Z","Personenauto","BMW","X RHEIHE","20240922","20180913","6292","stationwagen","5","BRUIN","Niet geregistreerd","6","2993","2050","2840","2150","750","3500","20110630","20180913","Geen verstrekking in Open Data","109209","Nee",,,,,,,"4","4","0","0",,"486","0","M1",,,"r. motorruimte","2840","X5",,"e1*2007/46*0421*03","ZW41","5L","0","0.08","293","Nee","Ja",,"Nee","6480","0","0.00","2023","Geen oordeel","05","Ja","2024-09-22T00:00:00.000","2018-09-13T00:00:00.000","2011-06-30T00:00:00.000","2018-09-13T00:00:00.000",,,,,,,,,,,,,,,,,,,,,"D",,,,,,,"https://opendata.rdw.nl/resource/3huj-srit.json","https://opendata.rdw.nl/resource/8ys7-d773.json","https://opendata.rdw.nl/resource/vezc-m2t6.json","https://opendata.rdw.nl/resource/jhie-znh9.json","https://opendata.rdw.nl/resource/kmfi-hrps.json"
"TN100F","Personenauto","BMW","X RHEIHE","20240914","20200912","8334","stationwagen","5","ZWART","Niet geregistreerd","6","2993","2085","2875","2185","750","3500","20110929","20180904","Geen verstrekking in Open Data","106493","Ja",,,,,,,"4","4","0","0",,"486","0","M1",,,"r. motorruimte","2875","X5",,"e1*2007/46*0421*03","ZW61","5A","0","0.10","293","Nee","Ja",,"Nee","6515","0","0.00","2023","Geen oordeel","05","Ja","2024-09-14T00:00:00.000","2020-09-12T00:00:00.000","2011-09-29T00:00:00.000","2018-09-04T00:00:00.000",,,,,,,,,,,,,,,,,,,,,"D",,,,,,,"https://opendata.rdw.nl/resource/3huj-srit.json","https://opendata.rdw.nl/resource/8ys7-d773.json","https://opendata.rdw.nl/resource/vezc-m2t6.json","https://opendata.rdw.nl/resource/jhie-znh9.json","https://opendata.rdw.nl/resource/kmfi-hrps.json"
"V029VR","Bedrijfsauto","BMW","X RHEIHE","20241231","20190501","32437","gesloten opbouw","2","N.v.t.","N.v.t.","6","2993","2240","2875","2340","750",,"20110826","20190209","Geen verstrekking in Open Data","133963","Ja",,"635",,"3500","3500",,,"4",,,,,"193","N1",,,"r. motorruimte","2875","X5",,,,,,"0.10","293","Nee","Ja",,"Nee","6515",,,"2023","Geen oordeel","05","Ja","2024-12-31T00:00:00.000","2019-05-01T00:00:00.000","2011-08-26T00:00:00.000","2019-02-09T00:00:00.000",,"0",,,,,,,,,,,,,,,,,,,,,,,,,,"https://opendata.rdw.nl/resource/3huj-srit.json","https://opendata.rdw.nl/resource/8ys7-d773.json","https://opendata.rdw.nl/resource/vezc-m2t6.json","https://opendata.rdw.nl/resource/jhie-znh9.json","https://opendata.rdw.nl/resource/kmfi-hrps.json"
"V077PJ","Bedrijfsauto","BMW","X RHEIHE","20240605","20201030","30845","gesloten opbouw","2","N.v.t.","N.v.t.","6","2993","2145","2875","2245","750",,"20110607","20180524","Geen verstrekking in Open Data","127346","Ja",,"730",,,"3500",,,"4",,,,,"193","N1",,,"r. motorruimte","2875","X5",,,,,,"0.10","293","Nee","Ja",,"Nee","6515",,,"2023","Geen oordeel","05","Ja","2024-06-05T00:00:00.000","2020-10-30T00:00:00.000","2011-06-07T00:00:00.000","2018-05-24T00:00:00.000",,"0",,,,,,,,,,,,,,,,,,,,,,,,,,"https://opendata.rdw.nl/resource/3huj-srit.json","https://opendata.rdw.nl/resource/8ys7-d773.json","https://opendata.rdw.nl/resource/vezc-m2t6.json","https://opendata.rdw.nl/resource/jhie-znh9.json","https://opendata.rdw.nl/resource/kmfi-hrps.json"
"V366VZ","Bedrijfsauto","BMW","X RHEIHE","20241031","20190213","23105","gesloten opbouw","2","N.v.t.","N.v.t.","6","2993","2244","2875","2344","750",,"20110812","20190213","Geen verstrekking in Open Data","95176","Ja",,"631",,"3500","3500",,,"4",,,,,"193","N1",,,"r. motorruimte","2875","X5",,,,,,"0.10","293","Nee","Ja",,"Nee","6515",,,"2023","Geen oordeel","05","Ja","2024-10-31T00:00:00.000","2019-02-13T00:00:00.000","2011-08-12T00:00:00.000","2019-02-13T00:00:00.000",,"0",,,,,,,,,,,,,,,,,,,,,,,,,,"https://opendata.rdw.nl/resource/3huj-srit.json","https://opendata.rdw.nl/resource/8ys7-d773.json","https://opendata.rdw.nl/resource/vezc-m2t6.json","https://opendata.rdw.nl/resource/jhie-znh9.json","https://opendata.rdw.nl/resource/kmfi-hrps.json"
"V521FK","Bedrijfsauto","BMW","X RHEIHE","20241215","20240203","26892","gesloten opbouw","2","N.v.t.","N.v.t.","6","2993","2215","2755","2315","750",,"20110912","20170315","Geen verstrekking in Open Data","110918","Ja",,"540",,,"2700",,,"4",,,,,"193","N1",,,"r. motorruimte","2755","X5",,,,,,"0.07","293","Nee","Nee",,"Nee","5575",,,"2024","Geen oordeel","05","Nee","2024-12-15T00:00:00.000","2024-02-03T00:00:00.000","2011-09-12T00:00:00.000","2017-03-15T00:00:00.000",,"0",,,,,,,,,,,,,,,,,,,,,,,,,,"https://opendata.rdw.nl/resource/3huj-srit.json","https://opendata.rdw.nl/resource/8ys7-d773.json","https://opendata.rdw.nl/resource/vezc-m2t6.json","https://opendata.rdw.nl/resource/jhie-znh9.json","https://opendata.rdw.nl/resource/kmfi-hrps.json"
"V783DR","Bedrijfsauto","BMW","X RHEIHE","20250228","20220212","29799","gesloten opbouw","2","N.v.t.","N.v.t.","6","2993","2170","2755","2270","750",,"20121204","20170206","Geen verstrekking in Open Data","124566","Ja",,"585",,"2700","2700",,,"4",,,,,"193","N1",,,"r. motorruimte","2755","X5",,,,,,"0.07","293","Nee","Ja",,"Nee","5575",,,"2024","Geen oordeel","05","Ja","2025-02-28T00:00:00.000","2022-02-12T00:00:00.000","2012-12-04T00:00:00.000","2017-02-06T00:00:00.000",,"0",,,,,,,,,,,,,,,,,,,,,,,,,,"https://opendata.rdw.nl/resource/3huj-srit.json","https://opendata.rdw.nl/resource/8ys7-d773.json","https://opendata.rdw.nl/resource/vezc-m2t6.json","https://opendata.rdw.nl/resource/jhie-znh9.json","https://opendata.rdw.nl/resource/kmfi-hrps.json"