"kenteken","voertuigsoort","merk","handelsbenaming","vervaldatum_apk","datum_tenaamstelling","bruto_bpm","inrichting","aantal_zitplaatsen","eerste_kleur","tweede_kleur","aantal_cilinders","cilinderinhoud","massa_ledig_voertuig","toegestane_maximum_massa_voertuig","massa_rijklaar","maximum_massa_trekken_ongeremd","maximum_trekken_massa_geremd","datum_eerste_toelating","datum_eerste_tenaamstelling_in_nederland","wacht_op_keuren","catalogusprijs","wam_verzekerd","maximale_constructiesnelheid","laadvermogen","oplegger_geremd","aanhangwagen_autonoom_geremd","aanhangwagen_middenas_geremd","aantal_staanplaatsen","aantal_deuren","aantal_wielen","afstand_hart_koppeling_tot_achterzijde_voertuig","afstand_voorzijde_voertuig_tot_hart_koppeling","afwijkende_maximum_snelheid","lengte","breedte","europese_voertuigcategorie","europese_voertuigcategorie_toevoeging","europese_uitvoeringcategorie_toevoeging","plaats_chassisnummer","technische_max_massa_voertuig","type","type_gasinstallatie","typegoedkeuringsnummer","variant","uitvoering","volgnummer_wijziging_eu_typegoedkeuring","vermogen_massarijklaar","wielbasis","export_indicator","openstaande_terugroepactie_indicator","vervaldatum_tachograaf","taxi_indicator","maximum_massa_samenstelling","aantal_rolstoelplaatsen","maximum_ondersteunende_snelheid","jaar_laatste_registratie_tellerstand","tellerstandoordeel","code_toelichting_tellerstandoordeel","tenaamstellen_mogelijk","vervaldatum_apk_dt","datum_tenaamstelling_dt","datum_eerste_toelating_dt","datum_eerste_tenaamstelling_in_nederland_dt","vervaldatum_tachograaf_dt","maximum_last_onder_de_vooras_sen_tezamen_koppeling","type_remsysteem_voertuig_code","rupsonderstelconfiguratiecode","wielbasis_voertuig_minimum","wielbasis_voertuig_maximum","lengte_voertuig_minimum","lengte_voertuig_maximum","breedte_voertuig_minimum","breedte_voertuig_maximum","hoogte_voertuig","hoogte_voertuig_minimum","hoogte_voertuig_maximum","massa_bedrijfsklaar_minimaal","massa_bedrijfsklaar_maximaal","technisch_toelaatbaar_massa_koppelpunt","maximum_massa_technisch_maximaal","maximum_massa_technisch_minimaal","subcategorie_nederland","verticale_belasting_koppelpunt_getrokken_voertuig","zuinigheidsclassificatie","registratie_datum_goedkeuring_afschrijvingsmoment_bpm","registratie_datum_goedkeuring_afschrijvingsmoment_bpm_dt","gem_lading_wrde","aerodyn_voorz","massa_alt_aandr","verl_cab_ind","api_gekentekende_voertuigen_assen","api_gekentekende_voertuigen_brandstof","api_gekentekende_voertuigen_carrosserie","api_gekentekende_voertuigen_carrosserie_specifiek","api_gekentekende_voertuigen_voertuigklasse"
"G037NF","Personenauto","BMW","320D EFFICIENT DYNAMICS","20241211","20231209","6918","stationwagen","5","ZWART","Niet geregistreerd","4","1995","1545","2130","1645","745","1800","20181204","20191104","Geen verstrekking in Open Data","64625","Ja","222",,,,,,"4","4","0","0",,"463","181","M1",,,,"2130","3K",,"e1*2007/46*0315*22","8J91","6AW50000","0","0.07","281","Nee","Nee",,"Nee","3930","0","0.00","2023","Geen oordeel","05","Ja","2024-12-11T00:00:00.000","2023-12-09T00:00:00.000","2018-12-04T00:00:00.000","2019-11-04T00:00:00.000",,,,,,,,,,,"142",,,,,,,,,,,,,,,,,"https://opendata.rdw.nl/resource/3huj-srit.json","https://opendata.rdw.nl/resource/8ys7-d773.json","https://opendata.rdw.nl/resource/vezc-m2t6.json","https://opendata.rdw.nl/resource/jhie-znh9.json","https://opendata.rdw.nl/resource/kmfi-hrps.json"
"G163GD","Personenauto","BMW","320D EFFICIENT DYNAMICS","20240920","20191128","893","stationwagen","5","GRIJS","Niet geregistreerd","4","1995","1475","2050","1575",,,"20151013","20191128","Geen verstrekking in Open Data","49899","Ja","222",,,,,,"4","4","0","0",,"463","181","M1",,,,"2050","3K",,"e1*2007/46*0315*15","8J91","6H150000","0","0.08","281","Nee","Nee",,"Nee","0","0",,"2024","Geen oordeel","05","Ja","2024-09-20T00:00:00.000","2019-11-28T00:00:00.000","2015-10-13T00:00:00.000","2019-11-28T00:00:00.000",,,,,,,,,,,"142",,,,,,,,,,"B",,,,,,,"https://opendata.rdw.nl/resource/3huj-srit.json","https://opendata.rdw.nl/resource/8ys7-d773.json","https://opendata.rdw.nl/resource/vezc-m2t6.json","https://opendata.rdw.nl/resource/jhie-znh9.json","https://opendata.rdw.nl/resource/kmfi-hrps.json"
"G238KT","Personenauto","BMW","320D EFFICIENT DYNAMICS","20241018","20230914","3600","stationwagen","5","ZWART","Niet geregistreerd","4","1995","1485","2060","1585","745","1800","20151009","20191120","Geen verstrekking in Open Data","54703","Ja","222",,,,,,"4","4","0","0",,"463","181","M1",,,,"2060","3K",,"e1*2007/46*0315*15","8J91","6A150000","0","0.08","281","Nee","Nee",,"Nee","3935","0",,"2023","Geen oordeel","05","Ja","2024-10-18T00:00:00.000","2023-09-14T00:00:00.000","2015-10-09T00:00:00.000","2019-11-20T00:00:00.000",,,,,,,,,,,"142",,,,,,,,,,"B",,,,,,,"https://opendata.rdw.nl/resource/3huj-srit.json","https://opendata.rdw.nl/resource/8ys7-d773.json","https://opendata.rdw.nl/resource/vezc-m2t6.json","https://opendata.rdw.nl/resource/jhie-znh9.json","https://opendata.rdw.nl/resource/kmfi-hrps.json"
"G304KD","Personenauto","BMW","320D EFFICIENT DYNAMICS","20241020","20200508","322","stationwagen","5","WIT","Niet geregistreerd","4","1995","1485","2060","1585","745","1800","20150902","20191008","Geen verstrekking in Open Data","48852","Ja","222",,,,,,"4","4","0","0",,"463","181","M1",,,,"2060","3K",,"e1*2007/46*0315*15","8J91","6A150000","0","0.08","281","Nee","Nee",,"Nee","3935","0",,"2024","Geen oordeel","05","Ja","2024-10-20T00:00:00.000","2020-05-08T00:00:00.000","2015-09-02T00:00:00.000","2019-10-08T00:00:00.000",,,,,,,,,,,"142",,,,,,,,,,"B",,,,,,,"https://opendata.rdw.nl/resource/3huj-srit.json","https://opendata.rdw.nl/resource/8ys7-d773.json","https://opendata.rdw.nl/resource/vezc-m2t6.json","https://opendata.rdw.nl/resource/jhie-znh9.json","https://opendata.rdw.nl/resource/kmfi-hrps.json"
"G367BR","Personenauto","BMW","320D EFFICIENT DYNAMICS","20240622","20220628","2150","sedan","5","GRIJS","Niet geregistreerd","4","1995","1405","1980","1505","745","1800","20161107","20191102","Geen verstrekking in Open Data","48269","Ja","225",,,,,,"4","4","0","0",,"463","181","M1",,,,"1980","3L",,"e1*2007/46*0314*20","8D11","6A150000","0","0.08","281","Nee","Nee",,"Nee","3855","0","0.00","2023","Geen oordeel","05","Ja","2024-06-22T00:00:00.000","2022-06-28T00:00:00.000","2016-11-07T00:00:00.000","2019-11-02T00:00:00.000",,,,,,,,,,,"142",,,,,,,,,,"C",,,,,,,"https://opendata.rdw.nl/resource/3huj-srit.json","https://opendata.rdw.nl/resource/8ys7-d773.json","https://opendata.rdw.nl/resource/vezc-m2t6.json","https://opendata.rdw.nl/resource/jhie-znh9.json","https://opendata.rdw.nl/resource/kmfi-hrps.json"
"G427TF","Personenauto","BMW","320D EFFICIENT DYNAMICS","20241212","20221214","1632","stationwagen","5","GRIJS","Niet geregistreerd","4","1995","1485","2060","1585","745","1800","20151001","20191214","Geen verstrekking in Open Data","51150","Ja","222",,,,,,"4","4","0","0",,"463","181","M1",,,,"2060","3K",,"e1*2007/46*0315*15","8J91","6A250000","0","0.08","281","Nee","Nee",,"Nee","3935","0",,"2023","Geen oordeel","05","Ja","2024-12-12T00:00:00.000","2022-12-14T00:00:00.000","2015-10-01T00:00:00.000","2019-12-14T00:00:00.000",,,,,,,,,,,"142",,,,,,,,,,"C",,,,,,,"https://opendata.rdw.nl/resource/3huj-srit.json","https://opendata.rdw.nl/resource/8ys7-d773.json","https://opendata.rdw.nl/resource/vezc-m2t6.json","https://opendata.rdw.nl/resource/jhie-znh9.json","https://opendata.rdw.nl/resource/kmfi-hrps.json"
"G538LX","Personenauto","BMW","320D EFFICIENT DYNAMICS","20250301","20191024","5154","stationwagen","5","ZWART","Niet geregistreerd","4","1995","1475","2050","1575",,,"20170301","20191024","Geen verstrekking in Open Data","50032","Ja","222",,,,,,"4","4","0","0",,"463","181","M1",,,,"2050","3K",,"e1*2007/46*0315*18","8J91","6H150000","0","0.08","281","Nee","Nee",,"Nee","0","0","0.00","2024","Geen oordeel","05","Ja","2025-03-01T00:00:00.000","2019-10-24T00:00:00.000","2017-03-01T00:00:00.000","2019-10-24T00:00:00.000",,,,,,,,,,,"142",,,,,,,,,,"D",,,,,,,"https://opendata.rdw.nl/resource/3huj-srit.json","https://opendata.rdw.nl/resource/8ys7-d773.json","https://opendata.rdw.nl/resource/vezc-m2t6.json","https://opendata.rdw.nl/resource/jhie-znh9.json","https://opendata.rdw.nl/resource/kmfi-hrps.json"
"G548KS","Personenauto","BMW","320D EFFICIENT DYNAMICS","20241025","20191224","600","stationwagen","5","BRUIN","Niet geregistreerd","4","1995","1475","2050","1575",,,"20150914","20191224","Geen verstrekking in Open Data","51309","Ja","222",,,,,,"4","4","0","0",,"463","181","M1",,,,"2050","3K",,"e1*2007/46*0315*15","8J91","6H150000","0","0.08","281","Nee","Nee",,"Nee","0","0",,"2024","Geen oordeel","05","Ja","2024-10-25T00:00:00.000","2019-12-24T00:00:00.000","2015-09-14T00:00:00.000","2019-12-24T00:00:00.000",,,,,,,,,,,"142",,,,,,,,,,"B",,,,,,,"https://opendata.rdw.nl/resource/3huj-srit.json","https://opendata.rdw.nl/resource/8ys7-d773.json","https://opendata.rdw.nl/resource/vezc-m2t6.json","https://opendata.rdw.nl/resource/jhie-znh9.json","https://opendata.rdw.nl/resource/kmfi-hrps.json"
"G637KR","Personenauto","BMW","320D EFFICIENT DYNAMICS","20241205","20191014","1726","stationwagen","5","GRIJS","Niet geregistreerd","4","1995","1485","2060","1585","745","1800","20151111","20191014","Geen verstrekking in Open Data","49044","Ja","222",,,,,,"4","4","0","0",,"463","181","M1",,,,"2060","3K",,"e1*2007/46*0315*15","8J91","6A250000","0","0.08","281","Nee","Ja",,"Nee","3935","0",,"2023","Geen oordeel","05","Ja","2024-12-05T00:00:00.000","2019-10-14T00:00:00.000","2015-11-11T00:00:00.000","2019-10-14T00:00:00.000",,,,,,,,,,,"142",,,,,,,,,,"C",,,,,,,"https://opendata.rdw.nl/resource/3huj-srit.json","https://opendata.rdw.nl/resource/8ys7-d773.json","https://opendata.rdw.nl/resource/vezc-m2t6.json","https://opendata.rdw.nl/resource/jhie-znh9.json","https://opendata.rdw.nl/resource/kmfi-hrps.json"
"G825PV","Personenauto","BMW","320D EFFICIENT DYNAMICS","20241112","20191107","3151","stationwagen","5","BRUIN","Niet geregistreerd","4","1995","1485","2060","1585","745","1800","20160727","20191107","Geen verstrekking in Open Data","57968","Ja","222",,,,,,"4","4","0","0",,"463","181","M1",,,,"2060","3K",,"e1*2007/46*0315*18","8J91","6A150000","0","0.08","281","Nee","Nee",,"Nee","3935","0","0.00","2023","Geen oordeel","05","Ja","2024-11-12T00:00:00.000","2019-11-07T00:00:00.000","2016-07-27T00:00:00.000","2019-11-07T00:00:00.000",,,,,,,,,,,"142",,,,,,,,,,"D",,,,,,,"https://opendata.rdw.nl/resource/3huj-srit.json","https://opendata.rdw.nl/resource/8ys7-d773.json","https://opendata.rdw.nl/resource/vezc-m2t6.json","https://opendata.rdw.nl/resource/jhie-znh9.json","https://opendata.rdw.nl/resource/kmfi-hrps.json"
"G951HL","Personenauto","BMW","320D EFFICIENT DYNAMICS","20241009","20231221","10434","sedan","5","ZWART","Niet geregistreerd","4","1995","1485","2060","1585","745","1800","20191009","20191009","Geen verstrekking in Open Data","50740","Ja","225",,,,,,"4","4","0","0",,"463","181","M1",,,,"2060","3L",,"e1*2007/46*0314*24","8D11","6AW50000","0","0.08","281","Nee","Nee",,"Nee","3860","0","0.00","2024","Logisch","00","Ja","2024-10-09T00:00:00.000","2023-12-21T00:00:00.000","2019-10-09T00:00:00.000","2019-10-09T00:00:00.000",,,,,,,,,,,"142",,,,,,,,,,,,,,,,,"https://opendata.rdw.nl/resource/3huj-srit.json","https://opendata.rdw.nl/resource/8ys7-d773.json","https://opendata.rdw.nl/resource/vezc-m2t6.json","https://opendata.rdw.nl/resource/jhie-znh9.json","https://opendata.rdw.nl/resource/kmfi-hrps.json"
"GR074L","Personenauto","BMW","320D EFFICIENT DYNAMICS","20240730","20200815","5109","stationwagen","5","BLAUW","Niet geregistreerd","4","1995","1485","2060","1585","745","1800","20150730","20150730","Geen verstrekking in Open Data","47155","Ja",,,,,,,"4","4","0","0",,"463","0","M1",,,"r. motorruimte","2060","3K",,"e1*2007/46*0315*15","8J91","6A150000","0","0.08","281","Nee","Nee",,"Nee","3935","0",,"2023","Logisch","00","Ja","2024-07-30T00:00:00.000","2020-08-15T00:00:00.000","2015-07-30T00:00:00.000","2015-07-30T00:00:00.000",,,,,,,,,,,,,,,,,,,,,"B",,,,,,,"https://opendata.rdw.nl/resource/3huj-srit.json","https://opendata.rdw.nl/resource/8ys7-d773.json","https://opendata.rdw.nl/resource/vezc-m2t6.json","https://opendata.rdw.nl/resource/jhie-znh9.json","https://opendata.rdw.nl/resource/kmfi-hrps.json"
"GR082L","Personenauto","BMW","320D EFFICIENT DYNAMICS","20240724","20191206","5109","stationwagen","5","WIT","Niet geregistreerd","4","1995","1485","2060","1585","745","1800","20150724","20150724","Geen verstrekking in Open Data","56481","Ja",,,,,,,"4","4",,,,"463",,"M1",,,"r. motorruimte","2060","3K",,,,,,"0.08","281","Nee","Ja",,"Nee","3935",,,"2023","Logisch","00","Ja","2024-07-24T00:00:00.000","2019-12-06T00:00:00.000","2015-07-24T00:00:00.000","2015-07-24T00:00:00.000",,,,,,,,,,,,,,,,,,,,,"B",,,,,,,"https://opendata.rdw.nl/resource/3huj-srit.json","https://opendata.rdw.nl/resource/8ys7-d773.json","https://opendata.rdw.nl/resource/vezc-m2t6.json","https://opendata.rdw.nl/resource/jhie-znh9.json","https://opendata.rdw.nl/resource/kmfi-hrps.json"
"GR269G","Personenauto","BMW","320D EFFICIENT DYNAMICS","20240807","20180809","5109","stationwagen","5","ZWART","Niet geregistreerd","4","1995","1485","2060","1585","745","1800","20151023","20151023","Geen verstrekking in Open Data","53534","Ja",,,,,,,"4","4","0","0",,"463","0","M1",,,"r. motorruimte","2060","3K",,"e1*2007/46*0315*15","8J91","6A150000","0","0.08","281","Nee","Nee",,"Nee","3935","0",,"2024","Logisch","00","Ja","2024-08-07T00:00:00.000","2018-08-09T00:00:00.000","2015-10-23T00:00:00.000","2015-10-23T00:00:00.000",,,,,,,,,,,,,,,,,,,,,"B",,,,,,,"https://opendata.rdw.nl/resource/3huj-srit.json","https://opendata.rdw.nl/resource/8ys7-d773.json","https://opendata.rdw.nl/resource/vezc-m2t6.json","https://opendata.rdw.nl/resource/jhie-znh9.json","https://opendata.rdw.nl/resource/kmfi-hrps.json"
"GR571R","Personenauto","BMW","320D EFFICIENT DYNAMICS","20240727","20160429","5884","sedan","5","BLAUW","Niet geregistreerd","4","1995","1405","1980","1505","745","1800","20150727","20150727","Geen verstrekking in Open Data","51935","Ja",,,,,,,"4","4","0","0",,"463","0","M1",,,"r. motorruimte","1980","3L",,"e1*2007/46*0314*17","8D11","6A350000","0","0.08","281","Nee","Nee",,"Nee","3855","0",,"2024","Logisch","00","Ja","2024-07-27T00:00:00.000","2016-04-29T00:00:00.000","2015-07-27T00:00:00.000","2015-07-27T00:00:00.000",,,,,,,,,,,,,,,,,,,,,"C",,,,,,,"https://opendata.rdw.nl/resource/3huj-srit.json","https://opendata.rdw.nl/resource/8ys7-d773.json","https://opendata.rdw.nl/resource/vezc-m2t6.json","https://opendata.rdw.nl/resource/jhie-znh9.json","https://opendata.rdw.nl/resource/kmfi-hrps.json"
"GR588R","Personenauto","BMW","320D EFFICIENT DYNAMICS","20240728","20160722","5109","stationwagen","5","ZWART","Niet geregistreerd","4","1995","1485","2060","1585","745","1800","20150728","20150728","Geen verstrekking in Open Data","51195","Ja",,,,,,,"4","4","0","0",,"463","0","M1",,,"r. motorruimte","2060","3K",,"e1*2007/46*0315*15","8J91","6A150000","0","0.08","281","Nee","Ja",,"Nee","3935","0",,"2023","Logisch","00","Ja","2024-07-28T00:00:00.000","2016-07-22T00:00:00.000","2015-07-28T00:00:00.000","2015-07-28T00:00:00.000",,,,,,,,,,,,,,,,,,,,,"B",,,,,,,"https://opendata.rdw.nl/resource/3huj-srit.json","https://opendata.rdw.nl/resource/8ys7-d773.json","https://opendata.rdw.nl/resource/vezc-m2t6.json","https://opendata.rdw.nl/resource/jhie-znh9.json","https://opendata.rdw.nl/resource/kmfi-hrps.json"
"GR604R","Personenauto","BMW","320D EFFICIENT DYNAMICS","20240807","20191016","5109","stationwagen","5","WIT","Niet geregistreerd","4","1995","1485","2060","1585","745","1800","20150807","20150807","Geen verstrekking in Open Data","46973","Ja",,,,,,,"4","4","0","0",,"463","0","M1",,,"r. motorruimte","2060","3K",,"e1*2007/46*0315*15","8J91","6A150000","0","0.08","281","Nee","Nee",,"Nee","3935","0",,"2023","Logisch","00","Ja","2024-08-07T00:00:00.000","2019-10-16T00:00:00.000","2015-08-07T00:00:00.000","2015-08-07T00:00:00.000",,,,,,,,,,,,,,,,,,,,,"B",,,,,,,"https://opendata.rdw.nl/resource/3huj-srit.json","https://opendata.rdw.nl/resource/8ys7-d773.json","https://opendata.rdw.nl/resource/vezc-m2t6.json","https://opendata.rdw.nl/resource/jhie-znh9.json","https://opendata.rdw.nl/resource/kmfi-hrps.json"
"GR704T","Personenauto","BMW","320D EFFICIENT DYNAMICS","20240808","20151120","5109","stationwagen","5","ZWART","Niet geregistreerd","4","1995","1485","2060","1585","745","1800","20150805","20150805","Geen verstrekking in Open Data","46916","Ja",,,,,,,"4","4","0","0",,"463","0","M1",,,"r. motorruimte","2060","3K",,"e1*2007/46*0315*15","8J91","6A150000","0","0.08","281","Nee","Nee",,"Nee","3935","0",,"2024","Logisch","00","Ja","2024-08-08T00:00:00.000","2015-11-20T00:00:00.000","2015-08-05T00:00:00.000","2015-08-05T00:00:00.000",,,,,,,,,,,,,,,,,,,,,"B",,,,,,,"https://opendata.rdw.nl/resource/3huj-srit.json","https://opendata.rdw.nl/resource/8ys7-d773.json","https://opendata.rdw.nl/resource/vezc-m2t6.json","https://opendata.rdw.nl/resource/jhie-znh9.json","https://opendata.rdw.nl/resource/kmfi-hrps.json"
"GR875N","Personenauto","BMW","320D EFFICIENT DYNAMICS","20240730","20180628","5109","stationwagen","5","BRUIN","Niet geregistreerd","4","1995","1485","2060","1585","745","1800","20150730","20150730","Geen verstrekking in Open Data","55126","Ja",,,,,,,"4","4","0","0",,"463","0","M1",,,"r. motorruimte","2060","3K",,"e1*2007/46*0315*15","8J91","6A150000","0","0.08","281","Nee","Nee",,"Nee","3935","0",,"2023","Logisch","00","Ja","2024-07-30T00:00:00.000","2018-06-28T00:00:00.000","2015-07-30T00:00:00.000","2015-07-30T00:00:00.000",,,,,,,,,,,,,,,,,,,,,"B",,,,,,,"https://opendata.rdw.nl/resource/3huj-srit.json","https://opendata.rdw.nl/resource/8ys7-d773.json","https://opendata.rdw.nl/resource/vezc-m2t6.json","https://opendata.rdw.nl/resource/jhie-znh9.json","https://opendata.rdw.nl/resource/kmfi-hrps.json"
"GS215V","Personenauto","BMW","320D EFFICIENT DYNAMICS","20240812","20191130","5109","stationwagen","5","ZWART","Niet geregistreerd","4","1995","1485","2060","1585","745","1800","20150811","20150811","Geen verstrekking in Open Data","48843","Ja",,,,,,,"4","4","0","0",,"463","0","M1",,,"r. motorruimte","2060","3K",,"e1*2007/46*0315*15","8J91","6A150000","0","0.08","281","Nee","Nee",,"Nee","3935","0",,"2023","Logisch","00","Ja","2024-08-12T00:00:00.000","2019-11-30T00:00:00.000","2015-08-11T00:00:00.000","2015-08-11T00:00:00.000",,,,,,,,,,,,,,,,,,,,,"B",,,,,,,"https://opendata.rdw.nl/resource/3huj-srit.json","https://opendata.rdw.nl/resource/8ys7-d773.json","https://opendata.rdw.nl/resource/vezc-m2t6.json","https://opendata.rdw.nl/resource/jhie-znh9.json","https://opendata.rdw.nl/resource/kmfi-hrps.json"
"GS261N","Personenauto","BMW","320D EFFICIENT DYNAMICS","20240809","20191019","5109","stationwagen","5","ZWART","Niet geregistreerd","4","1995","1485","2060","1585","745","1800","20150804","20150804","Geen verstrekking in Open Data","51867","Ja",,,,,,,"4","4","0","0",,"463","0","M1",,,"r. motorruimte","2060","3K",,"e1*2007/46*0315*15","8J91","6A150000","0","0.08","281","Nee","Nee",,"Nee","3935","0",,"2024","Logisch","00","Ja","2024-08-09T00:00:00.000","2019-10-19T00:00:00.000","2015-08-04T00:00:00.000","2015-08-04T00:00:00.000",,,,,,,,,,,,,,,,,,,,,"B",,,,,,,"https://opendata.rdw.nl/resource/3huj-srit.json","https://opendata.rdw.nl/resource/8ys7-d773.json","https://opendata.rdw.nl/resource/vezc-m2t6.json","https://opendata.rdw.nl/resource/jhie-znh9.json","https://opendata.rdw.nl/resource/kmfi-hrps.json"
"GS290N","Personenauto","BMW","320D EFFICIENT DYNAMICS","20240814","20190815","5109","stationwagen","5","BRUIN","Niet geregistreerd","4","1995","1485","2060","1585","745","1800","20150805","20150805","Geen verstrekking in Open Data","47229","Ja",,,,,,,"4","4","0","0",,"463","0","M1",,,"r. motorruimte","2060","3K",,"e1*2007/46*0315*15","8J91","6A150000","0","0.08","281","Nee","Ja",,"Nee","3935","0",,"2023","Logisch","00","Ja","2024-08-14T00:00:00.000","2019-08-15T00:00:00.000","2015-08-05T00:00:00.000","2015-08-05T00:00:00.000",,,,,,,,,,,,,,,,,,,,,"B",,,,,,,"https://opendata.rdw.nl/resource/3huj-srit.json","https://opendata.rdw.nl/resource/8ys7-d773.json","https://opendata.rdw.nl/resource/vezc-m2t6.json","https://opendata.rdw.nl/resource/jhie-znh9.json","https://opendata.rdw.nl/resource/kmfi-hrps.json"
"GS430J","Personenauto","BMW","320D EFFICIENT DYNAMICS","20240805","20150805","5109","stationwagen","5","ZWART","Niet geregistreerd","4","1995","1485","2060","1585","745","1800","20150805","20150805","Geen verstrekking in Open Data","51295","Ja",,,,,,,"4","4","0","0",,"463","0","M1",,,"r. motorruimte","2060","3K",,"e1*2007/46*0315*15","8J91","6A150000","0","0.08","281","Nee","Nee",,"Nee","3935","0",,"2023","Logisch","00","Ja","2024-08-05T00:00:00.000","2015-08-05T00:00:00.000","2015-08-05T00:00:00.000","2015-08-05T00:00:00.000",,,,,,,,,,,,,,,,,,,,,"B",,,,,,,"https://opendata.rdw.nl/resource/3huj-srit.json","https://opendata.rdw.nl/resource/8ys7-d773.json","https://opendata.rdw.nl/resource/vezc-m2t6.json","https://opendata.rdw.nl/resource/jhie-znh9.json","https://opendata.rdw.nl/resource/kmfi-hrps.json"
"GS460J","Personenauto","BMW","320D EFFICIENT DYNAMICS","20240806","20191104","5109","stationwagen","5","WIT","Niet geregistreerd","4","1995","1485","2060","1585","745","1800","20150806","20150806","Geen verstrekking in Open Data","45333","Ja",,,,,,,"4","4","0","0",,"463","0","M1",,,"r. motorruimte","2060","3K",,"e1*2007/46*0315*15","8J91","6A150000","0","0.08","281","Nee","Ja",,"Nee","3935","0",,"2023","Logisch","00","Ja","2024-08-06T00:00:00.000","2019-11-04T00:00:00.000","2015-08-06T00:00:00.000","2015-08-06T00:00:00.000",,,,,,,,,,,,,,,,,,,,,"B",,,,,,,"https://opendata.rdw.nl/resource/3huj-srit.json","https://opendata.rdw.nl/resource/8ys7-d773.json","https://opendata.rdw.nl/resource/vezc-m2t6.json","https://opendata.rdw.nl/resource/jhie-znh9.json","https://opendata.rdw.nl/resource/kmfi-hrps.json"
"GS461J","Personenauto","BMW","320D EFFICIENT DYNAMICS","20250110","20200120","5574","stationwagen","5","ZWART","Niet geregistreerd","4","1995","1475","2050","1575",,,"20150803","20150803","Geen verstrekking in Open Data","46438","Ja",,,,,,,"4","4","0","0",,"463","0","M1",,,"r. motorruimte","2050","3K",,"e1*2007/46*0315*15","8J91","6H150000","0","0.08","281","Nee","Ja",,"Nee","0","0",,"2023","Logisch","00","Ja","2025-01-10T00:00:00.000","2020-01-20T00:00:00.000","2015-08-03T00:00:00.000","2015-08-03T00:00:00.000",,,,,,,,,,,,,,,,,,,,,"B",,,,,,,"https://opendata.rdw.nl/resource/3huj-srit.json","https://opendata.rdw.nl/resource/8ys7-d773.json","https://opendata.rdw.nl/resource/vezc-m2t6.json","https://opendata.rdw.nl/resource/jhie-znh9.json","https://opendata.rdw.nl/resource/kmfi-hrps.json"
"GS564X","Personenauto","BMW","320D EFFICIENT DYNAMICS","20241014","20221202","4334","sedan","5","WIT","Niet geregistreerd","4","1995","1405","1980","1505","745","1800","20150812","20150812","Geen verstrekking in Open Data","49811","Ja",,,,,,,"4","4","0","0",,"463","0","M1",,,"r. motorruimte","1980","3L",,"e1*2007/46*0314*17","8D11","6A150000","0","0.08","281","Nee","Nee",,"Nee","3855","0",,"2023","Logisch","00","Ja","2024-10-14T00:00:00.000","2022-12-02T00:00:00.000","2015-08-12T00:00:00.000","2015-08-12T00:00:00.000",,,,,,,,,,,,,,,,,,,,,"B",,,,,,,"https://opendata.rdw.nl/resource/3huj-srit.json","https://opendata.rdw.nl/resource/8ys7-d773.json","https://opendata.rdw.nl/resource/vezc-m2t6.json","https://opendata.rdw.nl/resource/jhie-znh9.json","https://opendata.rdw.nl/resource/kmfi-hrps.json"