"kenteken","voertuigsoort","merk","handelsbenaming","vervaldatum_apk","datum_tenaamstelling","bruto_bpm","inrichting","aantal_zitplaatsen","eerste_kleur","tweede_kleur","aantal_cilinders","cilinderinhoud","massa_ledig_voertuig","toegestane_maximum_massa_voertuig","massa_rijklaar","maximum_massa_trekken_ongeremd","maximum_trekken_massa_geremd","datum_eerste_toelating","datum_eerste_tenaamstelling_in_nederland","wacht_op_keuren","catalogusprijs","wam_verzekerd","maximale_constructiesnelheid","laadvermogen","oplegger_geremd","aanhangwagen_autonoom_geremd","aanhangwagen_middenas_geremd","aantal_staanplaatsen","aantal_deuren","aantal_wielen","afstand_hart_koppeling_tot_achterzijde_voertuig","afstand_voorzijde_voertuig_tot_hart_koppeling","afwijkende_maximum_snelheid","lengte","breedte","europese_voertuigcategorie","europese_voertuigcategorie_toevoeging","europese_uitvoeringcategorie_toevoeging","plaats_chassisnummer","technische_max_massa_voertuig","type","type_gasinstallatie","typegoedkeuringsnummer","variant","uitvoering","volgnummer_wijziging_eu_typegoedkeuring","vermogen_massarijklaar","wielbasis","export_indicator","openstaande_terugroepactie_indicator","vervaldatum_tachograaf","taxi_indicator","maximum_massa_samenstelling","aantal_rolstoelplaatsen","maximum_ondersteunende_snelheid","jaar_laatste_registratie_tellerstand","tellerstandoordeel","code_toelichting_tellerstandoordeel","tenaamstellen_mogelijk","vervaldatum_apk_dt","datum_tenaamstelling_dt","datum_eerste_toelating_dt","datum_eerste_tenaamstelling_in_nederland_dt","vervaldatum_tachograaf_dt","maximum_last_onder_de_vooras_sen_tezamen_koppeling","type_remsysteem_voertuig_code","rupsonderstelconfiguratiecode","wielbasis_voertuig_minimum","wielbasis_voertuig_maximum","lengte_voertuig_minimum","lengte_voertuig_maximum","breedte_voertuig_minimum","breedte_voertuig_maximum","hoogte_voertuig","hoogte_voertuig_minimum","hoogte_voertuig_maximum","massa_bedrijfsklaar_minimaal","massa_bedrijfsklaar_maximaal","technisch_toelaatbaar_massa_koppelpunt","maximum_massa_technisch_maximaal","maximum_massa_technisch_minimaal","subcategorie_nederland","verticale_belasting_koppelpunt_getrokken_voertuig","zuinigheidsclassificatie","registratie_datum_goedkeuring_afschrijvingsmoment_bpm","registratie_datum_goedkeuring_afschrijvingsmoment_bpm_dt","gem_lading_wrde","aerodyn_voorz","massa_alt_aandr","verl_cab_ind","api_gekentekende_voertuigen_assen","api_gekentekende_voertuigen_brandstof","api_gekentekende_voertuigen_carrosserie","api_gekentekende_voertuigen_carrosserie_specifiek","api_gekentekende_voertuigen_voertuigklasse"
"1XGD13","Personenauto","BENTLEY","BENTLEY CONTINENTAL GT V8 S CONVERTIBLE","20250409","20190727","42135","cabriolet","4","GRIJS","Niet geregistreerd","8","3993","2445","2900","2545",,,"20140716","20140716","Geen verstrekking in Open Data","277537","Ja",,,,,,,"2","4","0","0",,"482","0","M1",,,"r. schutbord","2900","3W",,"e11*2001/116*0221*20","GK4","1","0","0.15","275","Nee","Nee",,"Nee","0","0",,"2024","Logisch","00","Ja","2025-04-09T00:00:00.000","2019-07-27T00:00:00.000","2014-07-16T00:00:00.000","2014-07-16T00:00:00.000",,,,,,,,,,,,,,,,,,,,,"G",,,,,,,"https://opendata.rdw.nl/resource/3huj-srit.json","https://opendata.rdw.nl/resource/8ys7-d773.json","https://opendata.rdw.nl/resource/vezc-m2t6.json","https://opendata.rdw.nl/resource/jhie-znh9.json","https://opendata.rdw.nl/resource/kmfi-hrps.json"
"2ZKB79","Personenauto","BENTLEY","BENTLEY CONTINENTAL GT V8 S CONVERTIBLE","20241017","20221028","42135","cabriolet","4","GRIJS","Niet geregistreerd","8","3993","2445","2900","2545",,,"20150109","20150109","Geen verstrekking in Open Data","279788","Ja",,,,,,,"2","4","0","0",,"482","0","M1",,,"r. schutbord","2900","3W",,"e11*2001/116*0221*20","GK4","1","0","0.15","275","Nee","Nee",,"Nee","0","0",,"2023","Logisch","00","Ja","2024-10-17T00:00:00.000","2022-10-28T00:00:00.000","2015-01-09T00:00:00.000","2015-01-09T00:00:00.000",,,,,,,,,,,,,,,,,,,,,"G",,,,,,,"https://opendata.rdw.nl/resource/3huj-srit.json","https://opendata.rdw.nl/resource/8ys7-d773.json","https://opendata.rdw.nl/resource/vezc-m2t6.json","https://opendata.rdw.nl/resource/jhie-znh9.json","https://opendata.rdw.nl/resource/kmfi-hrps.json"
"3TKS91","Personenauto","BENTLEY","BENTLEY CONTINENTAL GT V8 S CONVERTIBLE","20250325","20140320","40239","cabriolet","4","ZWART","Niet geregistreerd","8","3993","2445","2900","2545",,,"20140320","20140320","Geen verstrekking in Open Data","273868","Ja",,,,,,,"2","4","0","0",,"481","0","M1",,,"r. schutbord","2900","3W",,"e11*2001/116*0221*19","GK4","1","0","0.15","275","Nee","Nee",,"Nee","0","0",,"2024","Logisch","00","Ja","2025-03-25T00:00:00.000","2014-03-20T00:00:00.000","2014-03-20T00:00:00.000","2014-03-20T00:00:00.000",,,,,,,,,,,,,,,,,,,,,"G",,,,,,,"https://opendata.rdw.nl/resource/3huj-srit.json","https://opendata.rdw.nl/resource/8ys7-d773.json","https://opendata.rdw.nl/resource/vezc-m2t6.json","https://opendata.rdw.nl/resource/jhie-znh9.json","https://opendata.rdw.nl/resource/kmfi-hrps.json"
"9ZHX30","Personenauto","BENTLEY","BENTLEY CONTINENTAL GT V8 S CONVERTIBLE","20240519","20230520","42135","cabriolet","4","WIT","Niet geregistreerd","8","3993","2445","2900","2545",,,"20150130","20150130","Geen verstrekking in Open Data","277192","Ja",,,,,,,"2","4","0","0",,"482","0","M1",,,"r. schutbord","2900","3W",,"e11*2001/116*0221*20","GK4","1","0","0.15","275","Nee","Nee",,"Nee","0","0",,"2023","Logisch","00","Ja","2024-05-19T00:00:00.000","2023-05-20T00:00:00.000","2015-01-30T00:00:00.000","2015-01-30T00:00:00.000",,,,,,,,,,,,,,,,,,,,,"G",,,,,,,"https://opendata.rdw.nl/resource/3huj-srit.json","https://opendata.rdw.nl/resource/8ys7-d773.json","https://opendata.rdw.nl/resource/vezc-m2t6.json","https://opendata.rdw.nl/resource/jhie-znh9.json","https://opendata.rdw.nl/resource/kmfi-hrps.json"
"9ZTL47","Personenauto","BENTLEY","BENTLEY CONTINENTAL GT V8 S CONVERTIBLE","20240921","20220921","46391","cabriolet","4","GRIJS","Niet geregistreerd","8","3993","2445","2900","2545",,,"20150326","20150326","Geen verstrekking in Open Data","294571","Ja",,,,,,,"2","4","0","0",,"0","0","M1",,,"r. schutbord","2900","3W",,"e11*2001/116*0221*21","GK4Z","1","0","0.15","275","Nee","Nee",,"Nee","0","0",,"2023","Logisch","00","Ja","2024-09-21T00:00:00.000","2022-09-21T00:00:00.000","2015-03-26T00:00:00.000","2015-03-26T00:00:00.000",,,,,,,,,,,,,,,,,,,,,"G",,,,,,,"https://opendata.rdw.nl/resource/3huj-srit.json","https://opendata.rdw.nl/resource/8ys7-d773.json","https://opendata.rdw.nl/resource/vezc-m2t6.json","https://opendata.rdw.nl/resource/jhie-znh9.json","https://opendata.rdw.nl/resource/kmfi-hrps.json"
"G017LK","Personenauto","BENTLEY","CONTINENTAL GT V8 S CONVERTIBLE","20240727","20191021","46386","cabriolet","4","BLAUW","Niet geregistreerd","8","3993","2445","2900","2545",,,"20150101","20191021","Geen verstrekking in Open Data","259302","Ja","308",,,,,,"2","4","0","0",,"482","195","M1",,,"r. tegen schutbord onder motorkap","2900","3W",,"e11*2001/116*0221*22","GK4Z","1","0","0.15","275","Nee","Nee",,"Nee","0","0","0.00","2023","Geen oordeel","05","Ja","2024-07-27T00:00:00.000","2019-10-21T00:00:00.000","2015-01-01T00:00:00.000","2019-10-21T00:00:00.000",,,,,,,,,,,,,,,,,,,,,"G",,,,,,,"https://opendata.rdw.nl/resource/3huj-srit.json","https://opendata.rdw.nl/resource/8ys7-d773.json","https://opendata.rdw.nl/resource/vezc-m2t6.json","https://opendata.rdw.nl/resource/jhie-znh9.json","https://opendata.rdw.nl/resource/kmfi-hrps.json"
"GB756T","Personenauto","BENTLEY","BENTLEY CONTINENTAL GT V8 S CONVERTIBLE","20250308","20240425","25146","cabriolet","4","GEEL","Niet geregistreerd","8","3993","2445","2900","2545",,,"20140224","20150413","Geen verstrekking in Open Data","287201","Ja",,,,,,,"2","4","0","0",,"481","0","M1",,,"r. tegen schutbord onder motorkap","2900","3W",,"e11*2001/116*0221*19","GK4","1","0","0.15","275","Nee","Nee",,"Nee","0","0",,"2024","Geen oordeel","05","Ja","2025-03-08T00:00:00.000","2024-04-25T00:00:00.000","2014-02-24T00:00:00.000","2015-04-13T00:00:00.000",,,,,,,,,,,,,,,,,,,,,"G",,,,,,,"https://opendata.rdw.nl/resource/3huj-srit.json","https://opendata.rdw.nl/resource/8ys7-d773.json","https://opendata.rdw.nl/resource/vezc-m2t6.json","https://opendata.rdw.nl/resource/jhie-znh9.json","https://opendata.rdw.nl/resource/kmfi-hrps.json"
"GP965R","Personenauto","BENTLEY","CONTINENTAL GT V8 S CONVERTIBLE","20240728","20150717","46391","cabriolet","4","WIT","Niet geregistreerd","8","3993","2445","2900","2545",,,"20150717","20150717","Geen verstrekking in Open Data","294704","Ja",,,,,,,"2","4","0","0",,"482","0","M1",,,"r. schutbord","2900","3W",,"e11*2001/116*0221*22","GK4Z","1","0","0.15","275","Nee","Nee",,"Nee","0","0","0.00","2023","Logisch","00","Ja","2024-07-28T00:00:00.000","2015-07-17T00:00:00.000","2015-07-17T00:00:00.000","2015-07-17T00:00:00.000",,,,,,,,,,,,,,,,,,,,,"G",,,,,,,"https://opendata.rdw.nl/resource/3huj-srit.json","https://opendata.rdw.nl/resource/8ys7-d773.json","https://opendata.rdw.nl/resource/vezc-m2t6.json","https://opendata.rdw.nl/resource/jhie-znh9.json","https://opendata.rdw.nl/resource/kmfi-hrps.json"
"GX885J","Personenauto","BENTLEY","BENTLEY CONTINENTAL GT V8 S CONVERTIBLE","20250301","20230621","46391","cabriolet","4","ZWART","Niet geregistreerd","8","3993","2445","2900","2545",,,"20150921","20150921","Geen verstrekking in Open Data","284534","Ja",,,,,,,"2","4","0","0",,"0","0","M1",,,"r. schutbord","2900","3W",,"e11*2001/116*0221*21","GK4Z","1","0","0.15","275","Nee","Nee",,"Nee","0","0",,"2024","Logisch","00","Ja","2025-03-01T00:00:00.000","2023-06-21T00:00:00.000","2015-09-21T00:00:00.000","2015-09-21T00:00:00.000",,,,,,,,,,,,,,,,,,,,,"G",,,,,,,"https://opendata.rdw.nl/resource/3huj-srit.json","https://opendata.rdw.nl/resource/8ys7-d773.json","https://opendata.rdw.nl/resource/vezc-m2t6.json","https://opendata.rdw.nl/resource/jhie-znh9.json","https://opendata.rdw.nl/resource/kmfi-hrps.json"
"HG721D","Personenauto","BENTLEY","CONTINENTAL GT V8 S CONVERTIBLE","20241115","20220304","46391","cabriolet","4","ZWART","Niet geregistreerd","8","3993","2445","2900","2545",,,"20151022","20151022","Geen verstrekking in Open Data","291056","Ja",,,,,,,"2","4","0","0",,"482","195","M1",,,"in motorruimte r.","2900","3W",,"e11*2001/116*0221*22","GK4Z","1","0","0.15","275","Nee","Nee",,"Nee","0","0","0.00","2023","Logisch","00","Ja","2024-11-15T00:00:00.000","2022-03-04T00:00:00.000","2015-10-22T00:00:00.000","2015-10-22T00:00:00.000",,,,,,,,,,,"139",,,,,,,,,,"G",,,,,,,"https://opendata.rdw.nl/resource/3huj-srit.json","https://opendata.rdw.nl/resource/8ys7-d773.json","https://opendata.rdw.nl/resource/vezc-m2t6.json","https://opendata.rdw.nl/resource/jhie-znh9.json","https://opendata.rdw.nl/resource/kmfi-hrps.json"
"HP121J","Personenauto","BENTLEY","BENTLEY CONTINENTAL GT V8 S CONVERTIBLE","20250418","20240422","33036","cabriolet","4","ZWART","Niet geregistreerd","8","3993","2445","2900","2545",,,"20150603","20151211","Geen verstrekking in Open Data","282346","Ja",,,,,,,"2","4","0","0",,"482","0","M1",,,"r. schutbord","2900","3W",,"e11*2001/116*0221*20","GK4","1","0","0.15","275","Nee","Nee",,"Nee","0","0",,"2024","Geen oordeel","05","Ja","2025-04-18T00:00:00.000","2024-04-22T00:00:00.000","2015-06-03T00:00:00.000","2015-12-11T00:00:00.000",,,,,,,,,,,,,,,,,,,,,"G",,,,,,,"https://opendata.rdw.nl/resource/3huj-srit.json","https://opendata.rdw.nl/resource/8ys7-d773.json","https://opendata.rdw.nl/resource/vezc-m2t6.json","https://opendata.rdw.nl/resource/jhie-znh9.json","https://opendata.rdw.nl/resource/kmfi-hrps.json"
"HT780P","Personenauto","BENTLEY","CONTINENTAL GT V8 S CONVERTIBLE","20250224","20180528","46391","cabriolet","4","GRIJS","Niet geregistreerd","8","3993","2445","2900","2545",,,"20160224","20160224","Geen verstrekking in Open Data","279918","Ja",,,,,,,"2","4",,,,"482","195","M1",,,"in motorruimte r.","2900","3W",,"e11*2001/116*0221*21","GK4Z","1","0","0.15","275","Nee","Nee",,"Nee",,,,"2024","Logisch","00","Ja","2025-02-24T00:00:00.000","2018-05-28T00:00:00.000","2016-02-24T00:00:00.000","2016-02-24T00:00:00.000",,,,,,,,,,,"139",,,,,,,,,,"G",,,,,,,"https://opendata.rdw.nl/resource/3huj-srit.json","https://opendata.rdw.nl/resource/8ys7-d773.json","https://opendata.rdw.nl/resource/vezc-m2t6.json","https://opendata.rdw.nl/resource/jhie-znh9.json","https://opendata.rdw.nl/resource/kmfi-hrps.json"
"HX744B","Personenauto","BENTLEY","CONTINENTAL GT V8 S CONVERTIBLE","20250126","20170904","46391","cabriolet","4","GRIJS","Niet geregistreerd","8","3993","2445","2900","2545",,,"20160112","20160112","Geen verstrekking in Open Data","290941","Ja",,,,,,,"2","4","0","0",,"482","195","M1",,,"in motorruimte r.","2900","3W",,"e11*2001/116*0221*22","GK4Z","1","0","0.15","275","Nee","Nee",,"Nee","0","0","0.00","2024","Logisch","00","Ja","2025-01-26T00:00:00.000","2017-09-04T00:00:00.000","2016-01-12T00:00:00.000","2016-01-12T00:00:00.000",,,,,,,,,,,"139",,,,,,,,,,"G",,,,,,,"https://opendata.rdw.nl/resource/3huj-srit.json","https://opendata.rdw.nl/resource/8ys7-d773.json","https://opendata.rdw.nl/resource/vezc-m2t6.json","https://opendata.rdw.nl/resource/jhie-znh9.json","https://opendata.rdw.nl/resource/kmfi-hrps.json"
"J175PP","Personenauto","BENTLEY","BENTLEY CONTINENTAL GT V8 S CONVERTIBLE","20240924","20210809","46377","cabriolet","4","ZWART","Niet geregistreerd","8","3993","2445","2900","2545",,,"20150305","20201117","Geen verstrekking in Open Data","271408","Ja","308",,,,,,"2","4","0","0",,"482","195","M1",,,,"2900","3W",,"e11*2001/116*0221*20","GK4","1","0","0.15","275","Nee","Nee",,"Nee","2545","0",,"2023","Geen oordeel","05","Ja","2024-09-24T00:00:00.000","2021-08-09T00:00:00.000","2015-03-05T00:00:00.000","2020-11-17T00:00:00.000",,,,,,,,,,,"139",,,,,,,,,,"G",,,,,,,"https://opendata.rdw.nl/resource/3huj-srit.json","https://opendata.rdw.nl/resource/8ys7-d773.json","https://opendata.rdw.nl/resource/vezc-m2t6.json","https://opendata.rdw.nl/resource/jhie-znh9.json","https://opendata.rdw.nl/resource/kmfi-hrps.json"
"JP864J","Personenauto","BENTLEY","BENTLEY CONTINENTAL GT V8 S CONVERTIBLE","20240812","20210810","34703","cabriolet","4","ZWART","Niet geregistreerd","8","3993","2445","2900","2545",,,"20150630","20160526","Geen verstrekking in Open Data","276667","Ja",,,,,,,"2","4","0","0",,"0","0","M1",,,"r. schutbord","2900","3W",,"e11*2001/116*0221*21","GK4Z","1","0","0.15","275","Nee","Nee",,"Nee","0","0",,"2023","Geen oordeel","05","Ja","2024-08-12T00:00:00.000","2021-08-10T00:00:00.000","2015-06-30T00:00:00.000","2016-05-26T00:00:00.000",,,,,,,,,,,,,,,,,,,,,"G",,,,,,,"https://opendata.rdw.nl/resource/3huj-srit.json","https://opendata.rdw.nl/resource/8ys7-d773.json","https://opendata.rdw.nl/resource/vezc-m2t6.json","https://opendata.rdw.nl/resource/jhie-znh9.json","https://opendata.rdw.nl/resource/kmfi-hrps.json"
"JT255Z","Personenauto","BENTLEY","CONTINENTAL GT V8 S CONVERTIBLE","20250412","20160706","53281","cabriolet","4","ZWART","Niet geregistreerd","8","3993","2445","2900","2545",,,"20160706","20160706","Geen verstrekking in Open Data","296403","Ja",,,,,,,"2","4","0","0",,"482","195","M1",,,"in motorruimte r.","2900","3W",,"e11*2001/116*0221*22","GK4Z","1","0","0.15","275","Nee","Nee",,"Nee","0","0","0.00","2024","Logisch","00","Ja","2025-04-12T00:00:00.000","2016-07-06T00:00:00.000","2016-07-06T00:00:00.000","2016-07-06T00:00:00.000",,,,,,,,,,,"139",,,,,,,,,,"G",,,,,,,"https://opendata.rdw.nl/resource/3huj-srit.json","https://opendata.rdw.nl/resource/8ys7-d773.json","https://opendata.rdw.nl/resource/vezc-m2t6.json","https://opendata.rdw.nl/resource/jhie-znh9.json","https://opendata.rdw.nl/resource/kmfi-hrps.json"
"K090ZG","Personenauto","BENTLEY","BENTLEY CONTINENTAL GT V8 S CONVERTIBLE","20250401","20211101","41410","cabriolet","4","GRIJS","Niet geregistreerd","8","3993","2370","2900","2470",,,"20140806","20210402","Geen verstrekking in Open Data","384377","Ja","308",,,,,,"2","4",,,,"482","195","M1",,,,"2900","3W",,,,,,"0.16","275","Nee","Nee",,"Nee",,,,"2024","Geen oordeel","05","Ja","2025-04-01T00:00:00.000","2021-11-01T00:00:00.000","2014-08-06T00:00:00.000","2021-04-02T00:00:00.000",,,,,,,,,,,"139",,,,,,,,,,,,,,,,,"https://opendata.rdw.nl/resource/3huj-srit.json","https://opendata.rdw.nl/resource/8ys7-d773.json","https://opendata.rdw.nl/resource/vezc-m2t6.json","https://opendata.rdw.nl/resource/jhie-znh9.json","https://opendata.rdw.nl/resource/kmfi-hrps.json"
"K334GX","Personenauto","BENTLEY","BENTLEY CONTINENTAL GT V8 S CONVERTIBLE","20250203","20201217","46391","cabriolet","4","BRUIN","Niet geregistreerd","8","3993","2445","2900","2545",,,"20150327","20201217","Geen verstrekking in Open Data","287338","Ja","308",,,,,,"2","4","0","0",,"482","195","M1",,,,"2900","3W",,"e11*2001/116*0221*20","GK4","1","0","0.15","275","Nee","Nee",,"Nee","0","0",,"2024","Geen oordeel","05","Ja","2025-02-03T00:00:00.000","2020-12-17T00:00:00.000","2015-03-27T00:00:00.000","2020-12-17T00:00:00.000",,,,,,,,,,,"139",,,,,,,,,,"G",,,,,,,"https://opendata.rdw.nl/resource/3huj-srit.json","https://opendata.rdw.nl/resource/8ys7-d773.json","https://opendata.rdw.nl/resource/vezc-m2t6.json","https://opendata.rdw.nl/resource/jhie-znh9.json","https://opendata.rdw.nl/resource/kmfi-hrps.json"
"K856GK","Personenauto","BENTLEY","CONTINENTAL GT V8 S CONVERTIBLE","20240628","20201222","51092","cabriolet","4","GRIJS","Niet geregistreerd","8","3993","2445","2900","2545",,,"20180628","20201222","Geen verstrekking in Open Data","290628","Ja","308",,,,,,"2","4",,,,"482","195","M1",,,,"2900","3W",,"e11*2001/116*0221*24","GK4Z","1","1","0.15","275","Nee","Nee",,"Nee",,,,"2022","Geen oordeel","05","Ja","2024-06-28T00:00:00.000","2020-12-22T00:00:00.000","2018-06-28T00:00:00.000","2020-12-22T00:00:00.000",,,,,,,,,,,,,,,,,,,,,"G",,,,,,,"https://opendata.rdw.nl/resource/3huj-srit.json","https://opendata.rdw.nl/resource/8ys7-d773.json","https://opendata.rdw.nl/resource/vezc-m2t6.json","https://opendata.rdw.nl/resource/jhie-znh9.json","https://opendata.rdw.nl/resource/kmfi-hrps.json"
"K997ST","Personenauto","BENTLEY","BENTLEY CONTINENTAL GT V8 S CONVERTIBLE","20250308","20220905","46388","cabriolet","4","GRIJS","Niet geregistreerd","8","3993","2445","2900","2545",,,"20150709","20210227","Geen verstrekking in Open Data","287338","Ja","308",,,,,,"2","4","0","0",,"0","195","M1",,,,"2900","3W",,"e11*2001/116*0221*21","GK4Z","1","0","0.15","275","Nee","Nee",,"Nee","0","0",,"2024","Geen oordeel","05","Ja","2025-03-08T00:00:00.000","2022-09-05T00:00:00.000","2015-07-09T00:00:00.000","2021-02-27T00:00:00.000",,,,,,,,,,,,,,,,,,,,,"G",,,,,,,"https://opendata.rdw.nl/resource/3huj-srit.json","https://opendata.rdw.nl/resource/8ys7-d773.json","https://opendata.rdw.nl/resource/vezc-m2t6.json","https://opendata.rdw.nl/resource/jhie-znh9.json","https://opendata.rdw.nl/resource/kmfi-hrps.json"
"KB066T","Personenauto","BENTLEY","CONTINENTAL GT V8 S CONVERTIBLE","20240804","20171130","53281","cabriolet","4","GRIJS","Niet geregistreerd","8","3993","2445","2900","2545",,,"20160804","20160804","Geen verstrekking in Open Data","291488","Ja",,,,,,,"2","4","0","0",,"482","195","M1",,,"in motorruimte r.","2900","3W",,"e11*2001/116*0221*22","GK4Z","1","0","0.15","275","Nee","Nee",,"Nee","0","0","0.00","2022","Logisch","00","Ja","2024-08-04T00:00:00.000","2017-11-30T00:00:00.000","2016-08-04T00:00:00.000","2016-08-04T00:00:00.000",,,,,,,,,,,"139",,,,,,,,,,"G",,,,,,,"https://opendata.rdw.nl/resource/3huj-srit.json","https://opendata.rdw.nl/resource/8ys7-d773.json","https://opendata.rdw.nl/resource/vezc-m2t6.json","https://opendata.rdw.nl/resource/jhie-znh9.json","https://opendata.rdw.nl/resource/kmfi-hrps.json"
"KX480F","Personenauto","BENTLEY","CONTINENTAL GT V8 S CONVERTIBLE","20250120","20230207","49361","cabriolet","4","BLAUW","Niet geregistreerd","8","3993","2482","2900","2582",,,"20160119","20170112","Geen verstrekking in Open Data","310819","Ja",,,,,,,"2","4",,,,,,"M1",,,"r. tegen schutbord onder motorkap","2900","3W",,,,,,"0.15","275","Nee","Nee",,"Nee",,,,"2024","Geen oordeel","05","Ja","2025-01-20T00:00:00.000","2023-02-07T00:00:00.000","2016-01-19T00:00:00.000","2017-01-12T00:00:00.000",,,,,,,,,,,,,,,,,,,,,,,,,,,,"https://opendata.rdw.nl/resource/3huj-srit.json","https://opendata.rdw.nl/resource/8ys7-d773.json","https://opendata.rdw.nl/resource/vezc-m2t6.json","https://opendata.rdw.nl/resource/jhie-znh9.json","https://opendata.rdw.nl/resource/kmfi-hrps.json"
"L955KV","Personenauto","BENTLEY","BENTLEY CONTINENTAL GT V8 S CONVERTIBLE","20250611","20210611","40237","cabriolet","4","ZWART","Niet geregistreerd","8","3993","2445","2900","2545",,,"20140509","20210611","Geen verstrekking in Open Data","253993","Ja","308",,,,,,"2","4",,,,"481","195","M1",,,"r. tegen schutbord onder motorkap","2900","3W",,,,,,"0.15","275","Nee","Nee",,"Nee",,,,"2024","Geen oordeel","05","Ja","2025-06-11T00:00:00.000","2021-06-11T00:00:00.000","2014-05-09T00:00:00.000","2021-06-11T00:00:00.000",,,,,,,,,,,"140",,,,,,,,,,,,,,,,,"https://opendata.rdw.nl/resource/3huj-srit.json","https://opendata.rdw.nl/resource/8ys7-d773.json","https://opendata.rdw.nl/resource/vezc-m2t6.json","https://opendata.rdw.nl/resource/jhie-znh9.json","https://opendata.rdw.nl/resource/kmfi-hrps.json"
"N542JN","Personenauto","BENTLEY","CONTINENTAL GT V8 S CONVERTIBLE","20241113","20211028","47515","cabriolet","4","GROEN","Niet geregistreerd","8","3993","2445","2900","2545",,,"20181113","20211028","Geen verstrekking in Open Data","277803","Ja","308",,,,,,"2","4",,,,"482","195","M1",,,,"2900","3W",,"e11*2001/116*0221*24","GK4Z","1","1","0.15","275","Nee","Nee",,"Nee",,,,"2022","Geen oordeel","05","Ja","2024-11-13T00:00:00.000","2021-10-28T00:00:00.000","2018-11-13T00:00:00.000","2021-10-28T00:00:00.000",,,,,,,,,,,,,,,,,,,,,,"20211025","2021-10-25T00:00:00.000",,,,,"https://opendata.rdw.nl/resource/3huj-srit.json","https://opendata.rdw.nl/resource/8ys7-d773.json","https://opendata.rdw.nl/resource/vezc-m2t6.json","https://opendata.rdw.nl/resource/jhie-znh9.json","https://opendata.rdw.nl/resource/kmfi-hrps.json"
"NB531G","Personenauto","BENTLEY","CONTINENTAL GT V8 S CONVERTIBLE","20250412","20220422","53281","cabriolet","4","BLAUW","Niet geregistreerd","8","3993","2445","2900","2545",,,"20170110","20170110","Geen verstrekking in Open Data","288584","Ja",,,,,,,"2","4","0","0",,"482","195","M1",,,"in motorruimte r.","2900","3W",,"e11*2001/116*0221*22","GK4Z","1","0","0.15","275","Nee","Nee",,"Nee","0","0","0.00","2024","Logisch","00","Ja","2025-04-12T00:00:00.000","2022-04-22T00:00:00.000","2017-01-10T00:00:00.000","2017-01-10T00:00:00.000",,,,,,,,,,,"139",,,,,,,,,,"G",,,,,,,"https://opendata.rdw.nl/resource/3huj-srit.json","https://opendata.rdw.nl/resource/8ys7-d773.json","https://opendata.rdw.nl/resource/vezc-m2t6.json","https://opendata.rdw.nl/resource/jhie-znh9.json","https://opendata.rdw.nl/resource/kmfi-hrps.json"
"NB532G","Personenauto","BENTLEY","CONTINENTAL GT V8 S CONVERTIBLE","20250114","20230331","53281","cabriolet","4","BLAUW","Niet geregistreerd","8","3993","2445","2900","2545",,,"20170106","20170106","Geen verstrekking in Open Data","301468","Ja",,,,,,,"2","4","0","0",,"482","195","M1",,,"in motorruimte r.","2900","3W",,"e11*2001/116*0221*23","GK4Z","1","0","0.15","275","Nee","Nee",,"Nee","0","0","0.00","2023","Logisch","00","Ja","2025-01-14T00:00:00.000","2023-03-31T00:00:00.000","2017-01-06T00:00:00.000","2017-01-06T00:00:00.000",,,,,,,,,,,"139",,,,,,,,,,"G",,,,,,,"https://opendata.rdw.nl/resource/3huj-srit.json","https://opendata.rdw.nl/resource/8ys7-d773.json","https://opendata.rdw.nl/resource/vezc-m2t6.json","https://opendata.rdw.nl/resource/jhie-znh9.json","https://opendata.rdw.nl/resource/kmfi-hrps.json"