"kenteken","voertuigsoort","merk","handelsbenaming","vervaldatum_apk","datum_tenaamstelling","bruto_bpm","inrichting","aantal_zitplaatsen","eerste_kleur","tweede_kleur","aantal_cilinders","cilinderinhoud","massa_ledig_voertuig","toegestane_maximum_massa_voertuig","massa_rijklaar","maximum_massa_trekken_ongeremd","maximum_trekken_massa_geremd","datum_eerste_toelating","datum_eerste_tenaamstelling_in_nederland","wacht_op_keuren","catalogusprijs","wam_verzekerd","maximale_constructiesnelheid","laadvermogen","oplegger_geremd","aanhangwagen_autonoom_geremd","aanhangwagen_middenas_geremd","aantal_staanplaatsen","aantal_deuren","aantal_wielen","afstand_hart_koppeling_tot_achterzijde_voertuig","afstand_voorzijde_voertuig_tot_hart_koppeling","afwijkende_maximum_snelheid","lengte","breedte","europese_voertuigcategorie","europese_voertuigcategorie_toevoeging","europese_uitvoeringcategorie_toevoeging","plaats_chassisnummer","technische_max_massa_voertuig","type","type_gasinstallatie","typegoedkeuringsnummer","variant","uitvoering","volgnummer_wijziging_eu_typegoedkeuring","vermogen_massarijklaar","wielbasis","export_indicator","openstaande_terugroepactie_indicator","vervaldatum_tachograaf","taxi_indicator","maximum_massa_samenstelling","aantal_rolstoelplaatsen","maximum_ondersteunende_snelheid","jaar_laatste_registratie_tellerstand","tellerstandoordeel","code_toelichting_tellerstandoordeel","tenaamstellen_mogelijk","vervaldatum_apk_dt","datum_tenaamstelling_dt","datum_eerste_toelating_dt","datum_eerste_tenaamstelling_in_nederland_dt","vervaldatum_tachograaf_dt","maximum_last_onder_de_vooras_sen_tezamen_koppeling","type_remsysteem_voertuig_code","rupsonderstelconfiguratiecode","wielbasis_voertuig_minimum","wielbasis_voertuig_maximum","lengte_voertuig_minimum","lengte_voertuig_maximum","breedte_voertuig_minimum","breedte_voertuig_maximum","hoogte_voertuig","hoogte_voertuig_minimum","hoogte_voertuig_maximum","massa_bedrijfsklaar_minimaal","massa_bedrijfsklaar_maximaal","technisch_toelaatbaar_massa_koppelpunt","maximum_massa_technisch_maximaal","maximum_massa_technisch_minimaal","subcategorie_nederland","verticale_belasting_koppelpunt_getrokken_voertuig","zuinigheidsclassificatie","registratie_datum_goedkeuring_afschrijvingsmoment_bpm","registratie_datum_goedkeuring_afschrijvingsmoment_bpm_dt","gem_lading_wrde","aerodyn_voorz","massa_alt_aandr","verl_cab_ind","api_gekentekende_voertuigen_assen","api_gekentekende_voertuigen_brandstof","api_gekentekende_voertuigen_carrosserie","api_gekentekende_voertuigen_carrosserie_specifiek","api_gekentekende_voertuigen_voertuigklasse"
"R187FV","Personenauto","AUDI","SQ7","20260905","20220905","60765","sedan","4","GRIJS","Niet geregistreerd","8","3996","2495","3260","2595",,,"20220905","20220905","Geen verstrekking in Open Data","185415","Ja","250",,,,,,"4","4",,,,"507","199","M1",,,,"3260","4L",,,,,,"0.14","300","Nee","Nee",,"Nee",,,,"2023","Logisch","00","Ja","2026-09-05T00:00:00.000","2022-09-05T00:00:00.000","2022-09-05T00:00:00.000","2022-09-05T00:00:00.000",,,,,,,,,,,"170",,,,,,,,,,"G","20230201","2023-02-01T00:00:00.000",,,,,"https://opendata.rdw.nl/resource/3huj-srit.json","https://opendata.rdw.nl/resource/8ys7-d773.json","https://opendata.rdw.nl/resource/vezc-m2t6.json","https://opendata.rdw.nl/resource/jhie-znh9.json","https://opendata.rdw.nl/resource/kmfi-hrps.json"
"R454GF","Personenauto","AUDI","SQ7","20260905","20220905","60765","sedan","4","ZWART","Niet geregistreerd","8","3996","2492","3260","2592",,,"20220905","20220905","Geen verstrekking in Open Data","185415","Ja","250",,,,,,"4","4",,,,"507","199","M1",,,,"3260","4L",,,,,,"0.14","300","Nee","Nee",,"Nee",,,,"2023","Logisch","00","Ja","2026-09-05T00:00:00.000","2022-09-05T00:00:00.000","2022-09-05T00:00:00.000","2022-09-05T00:00:00.000",,,,,,,,,,,"170",,,,,,,,,,"G","20230201","2023-02-01T00:00:00.000",,,,,"https://opendata.rdw.nl/resource/3huj-srit.json","https://opendata.rdw.nl/resource/8ys7-d773.json","https://opendata.rdw.nl/resource/vezc-m2t6.json","https://opendata.rdw.nl/resource/jhie-znh9.json","https://opendata.rdw.nl/resource/kmfi-hrps.json"
"TD219P","Personenauto","AUDI","SQ7","20250523","20180829","40877","sedan","5","GRIJS","Niet geregistreerd","8","3956","2600","3300","2700",,,"20180829","20180829","Geen verstrekking in Open Data","157427","Ja",,,,,,,"4","4",,,,"505","197","M1",,,,"3300","4L",,,,,,"0.12","300","Nee","Nee",,"Nee",,,,"2024","Logisch","00","Ja","2025-05-23T00:00:00.000","2018-08-29T00:00:00.000","2018-08-29T00:00:00.000","2018-08-29T00:00:00.000",,,,,,,,,,,"167",,,,,,,,,,"G","20220517","2022-05-17T00:00:00.000",,,,,"https://opendata.rdw.nl/resource/3huj-srit.json","https://opendata.rdw.nl/resource/8ys7-d773.json","https://opendata.rdw.nl/resource/vezc-m2t6.json","https://opendata.rdw.nl/resource/jhie-znh9.json","https://opendata.rdw.nl/resource/kmfi-hrps.json"
"TF302G","Personenauto","AUDI","SQ7","20240630","20180829","40877","sedan","5","ZWART","Niet geregistreerd","8","3956","2808","3300","2908",,,"20180829","20180829","Geen verstrekking in Open Data","157427","Ja",,,,,,,"4","4",,,,"505","197","M1",,,,"3300","4L",,,,,,"0.11","300","Nee","Nee",,"Nee",,,,"2024","Logisch","00","Ja","2024-06-30T00:00:00.000","2018-08-29T00:00:00.000","2018-08-29T00:00:00.000","2018-08-29T00:00:00.000",,,,,,,,,,,"167",,,,,,,,,,"G","20220224","2022-02-24T00:00:00.000",,,,,"https://opendata.rdw.nl/resource/3huj-srit.json","https://opendata.rdw.nl/resource/8ys7-d773.json","https://opendata.rdw.nl/resource/vezc-m2t6.json","https://opendata.rdw.nl/resource/jhie-znh9.json","https://opendata.rdw.nl/resource/kmfi-hrps.json"
"TF363Z","Personenauto","AUDI","SQ7","20250414","20180829","40877","sedan","5","ZWART","Niet geregistreerd","8","3956","2631","3300","2731","750",,"20180829","20180829","Geen verstrekking in Open Data","157427","Ja",,,,,,,"4","4",,,,"505","197","M1",,,,"3300","4L",,,,,,"0.12","300","Nee","Nee",,"Nee","6530",,,"2024","Logisch","00","Ja","2025-04-14T00:00:00.000","2018-08-29T00:00:00.000","2018-08-29T00:00:00.000","2018-08-29T00:00:00.000",,,,,,,,,,,"167",,,,,,,,,,"G","20220701","2022-07-01T00:00:00.000",,,,,"https://opendata.rdw.nl/resource/3huj-srit.json","https://opendata.rdw.nl/resource/8ys7-d773.json","https://opendata.rdw.nl/resource/vezc-m2t6.json","https://opendata.rdw.nl/resource/jhie-znh9.json","https://opendata.rdw.nl/resource/kmfi-hrps.json"
"TG087S","Personenauto","AUDI","SQ7","20250314","20180829","40877","sedan","5","GRIJS","Niet geregistreerd","8","3956","2808","3300","2908",,,"20180829","20180829","Geen verstrekking in Open Data","157427","Ja",,,,,,,"4","4",,,,"505","197","M1",,,,"3300","4L",,,,,,"0.11","300","Nee","Nee",,"Nee",,,,"2024","Logisch","00","Ja","2025-03-14T00:00:00.000","2018-08-29T00:00:00.000","2018-08-29T00:00:00.000","2018-08-29T00:00:00.000",,,,,,,,,,,"167",,,,,,,,,,"G","20220303","2022-03-03T00:00:00.000",,,,,"https://opendata.rdw.nl/resource/3huj-srit.json","https://opendata.rdw.nl/resource/8ys7-d773.json","https://opendata.rdw.nl/resource/vezc-m2t6.json","https://opendata.rdw.nl/resource/jhie-znh9.json","https://opendata.rdw.nl/resource/kmfi-hrps.json"
"TH938N","Personenauto","AUDI","SQ7","20250531","20180829","40877","sedan","5","GRIJS","Niet geregistreerd","8","3956","2630","3300","2730",,,"20180829","20180829","Geen verstrekking in Open Data","157427","Ja",,,,,,,"4","4",,,,"505","197","M1",,,,"3300","4L",,,,,,"0.12","300","Nee","Nee",,"Nee",,,,"2024","Logisch","00","Ja","2025-05-31T00:00:00.000","2018-08-29T00:00:00.000","2018-08-29T00:00:00.000","2018-08-29T00:00:00.000",,,,,,,,,,,"167",,,,,,,,,,,,,,,,,"https://opendata.rdw.nl/resource/3huj-srit.json","https://opendata.rdw.nl/resource/8ys7-d773.json","https://opendata.rdw.nl/resource/vezc-m2t6.json","https://opendata.rdw.nl/resource/jhie-znh9.json","https://opendata.rdw.nl/resource/kmfi-hrps.json"
"TS729T","Personenauto","AUDI","SQ7","20240809","20181030","40877","sedan","5","GRIJS","Niet geregistreerd","8","3956","2808","3300","2908",,,"20181030","20181030","Geen verstrekking in Open Data","157427","Ja",,,,,,,"4","4",,,,"505","197","M1",,,,"3300","4L",,,,,,"0.11","300","Nee","Nee",,"Nee",,,,"2024","Logisch","00","Ja","2024-08-09T00:00:00.000","2018-10-30T00:00:00.000","2018-10-30T00:00:00.000","2018-10-30T00:00:00.000",,,,,,,,,,,"167",,,,,,,,,,,,,,,,,"https://opendata.rdw.nl/resource/3huj-srit.json","https://opendata.rdw.nl/resource/8ys7-d773.json","https://opendata.rdw.nl/resource/vezc-m2t6.json","https://opendata.rdw.nl/resource/jhie-znh9.json","https://opendata.rdw.nl/resource/kmfi-hrps.json"
"TS889K","Personenauto","AUDI","SQ7","20240904","20181031","40877","sedan","5","GRIJS","Niet geregistreerd","8","3956","2817","3300","2917",,,"20181031","20181031","Geen verstrekking in Open Data","157427","Ja",,,,,,,"4","4",,,,"505","197","M1",,,,"3300","4L",,,,,,"0.11","300","Nee","Nee",,"Nee",,,,"2024","Logisch","00","Ja","2024-09-04T00:00:00.000","2018-10-31T00:00:00.000","2018-10-31T00:00:00.000","2018-10-31T00:00:00.000",,,,,,,,,,,"167",,,,,,,,,,,,,,,,,"https://opendata.rdw.nl/resource/3huj-srit.json","https://opendata.rdw.nl/resource/8ys7-d773.json","https://opendata.rdw.nl/resource/vezc-m2t6.json","https://opendata.rdw.nl/resource/jhie-znh9.json","https://opendata.rdw.nl/resource/kmfi-hrps.json"
"TT556S","Personenauto","AUDI","SQ7","20250405","20181031","40877","sedan","5","GRIJS","Niet geregistreerd","8","3956","2617","3300","2717",,,"20181031","20181031","Geen verstrekking in Open Data","157427","Ja",,,,,,,"4","4",,,,"505","197","M1",,,,"3300","4L",,,,,,"0.12","300","Nee","Nee",,"Nee",,,,"2024","Logisch","00","Ja","2025-04-05T00:00:00.000","2018-10-31T00:00:00.000","2018-10-31T00:00:00.000","2018-10-31T00:00:00.000",,,,,,,,,,,"167",,,,,,,,,,,,,,,,,"https://opendata.rdw.nl/resource/3huj-srit.json","https://opendata.rdw.nl/resource/8ys7-d773.json","https://opendata.rdw.nl/resource/vezc-m2t6.json","https://opendata.rdw.nl/resource/jhie-znh9.json","https://opendata.rdw.nl/resource/kmfi-hrps.json"
"TT831D","Personenauto","AUDI","SQ7","20241102","20181102","40877","sedan","5","GRIJS","Niet geregistreerd","8","3956","2808","3300","2908",,,"20181102","20181102","Geen verstrekking in Open Data","157427","Ja",,,,,,,"4","4",,,,"505","197","M1",,,,"3300","4L",,,,,,"0.11","300","Nee","Nee",,"Nee",,,,"2024","Logisch","00","Ja","2024-11-02T00:00:00.000","2018-11-02T00:00:00.000","2018-11-02T00:00:00.000","2018-11-02T00:00:00.000",,,,,,,,,,,"167",,,,,,,,,,,,,,,,,"https://opendata.rdw.nl/resource/3huj-srit.json","https://opendata.rdw.nl/resource/8ys7-d773.json","https://opendata.rdw.nl/resource/vezc-m2t6.json","https://opendata.rdw.nl/resource/jhie-znh9.json","https://opendata.rdw.nl/resource/kmfi-hrps.json"
"TT916K","Personenauto","AUDI","SQ7","20241031","20181031","40877","sedan","5","GRIJS","Niet geregistreerd","8","3956","2617","3300","2717",,,"20181031","20181031","Geen verstrekking in Open Data","157427","Ja",,,,,,,"4","4",,,,"505","197","M1",,,,"3300","4L",,,,,,"0.12","300","Nee","Nee",,"Nee",,,,"2024","Logisch","00","Ja","2024-10-31T00:00:00.000","2018-10-31T00:00:00.000","2018-10-31T00:00:00.000","2018-10-31T00:00:00.000",,,,,,,,,,,"167",,,,,,,,,,,,,,,,,"https://opendata.rdw.nl/resource/3huj-srit.json","https://opendata.rdw.nl/resource/8ys7-d773.json","https://opendata.rdw.nl/resource/vezc-m2t6.json","https://opendata.rdw.nl/resource/jhie-znh9.json","https://opendata.rdw.nl/resource/kmfi-hrps.json"
"TV150N","Personenauto","AUDI","SQ7","20241102","20181102","40877","sedan","5","ZWART","Niet geregistreerd","8","3956","2817","3300","2917",,,"20181102","20181102","Geen verstrekking in Open Data","157427","Ja",,,,,,,"4","4",,,,"505","197","M1",,,,"3300","4L",,,,,,"0.11","300","Nee","Nee",,"Nee",,,,"2024","Logisch","00","Ja","2024-11-02T00:00:00.000","2018-11-02T00:00:00.000","2018-11-02T00:00:00.000","2018-11-02T00:00:00.000",,,,,,,,,,,"167",,,,,,,,,,,,,,,,,"https://opendata.rdw.nl/resource/3huj-srit.json","https://opendata.rdw.nl/resource/8ys7-d773.json","https://opendata.rdw.nl/resource/vezc-m2t6.json","https://opendata.rdw.nl/resource/jhie-znh9.json","https://opendata.rdw.nl/resource/kmfi-hrps.json"
"TV172F","Personenauto","AUDI","SQ7","20241107","20181107","40877","sedan","5","GRIJS","Niet geregistreerd","8","3956","2817","3300","2917",,,"20181107","20181107","Geen verstrekking in Open Data","157427","Ja",,,,,,,"4","4",,,,"505","197","M1",,,,"3300","4L",,,,,,"0.11","300","Nee","Nee",,"Nee",,,,"2024","Logisch","00","Ja","2024-11-07T00:00:00.000","2018-11-07T00:00:00.000","2018-11-07T00:00:00.000","2018-11-07T00:00:00.000",,,,,,,,,,,"167",,,,,,,,,,,,,,,,,"https://opendata.rdw.nl/resource/3huj-srit.json","https://opendata.rdw.nl/resource/8ys7-d773.json","https://opendata.rdw.nl/resource/vezc-m2t6.json","https://opendata.rdw.nl/resource/jhie-znh9.json","https://opendata.rdw.nl/resource/kmfi-hrps.json"
"TX129J","Personenauto","AUDI","SQ7","20241129","20181116","40877","sedan","5","ZWART","Niet geregistreerd","8","3956","2808","3300","2908",,,"20181116","20181116","Geen verstrekking in Open Data","157427","Ja",,,,,,,"4","4",,,,"505","197","M1",,,,"3300","4L",,,,,,"0.11","300","Nee","Nee",,"Nee",,,,"2024","Logisch","00","Ja","2024-11-29T00:00:00.000","2018-11-16T00:00:00.000","2018-11-16T00:00:00.000","2018-11-16T00:00:00.000",,,,,,,,,,,"167",,,,,,,,,,,,,,,,,"https://opendata.rdw.nl/resource/3huj-srit.json","https://opendata.rdw.nl/resource/8ys7-d773.json","https://opendata.rdw.nl/resource/vezc-m2t6.json","https://opendata.rdw.nl/resource/jhie-znh9.json","https://opendata.rdw.nl/resource/kmfi-hrps.json"
"TX364D","Personenauto","AUDI","SQ7","20240816","20181107","40877","sedan","5","ZWART","Niet geregistreerd","8","3956","2817","3300","2917",,,"20181107","20181107","Geen verstrekking in Open Data","157427","Ja",,,,,,,"4","4",,,,"505","197","M1",,,,"3300","4L",,,,,,"0.11","300","Nee","Nee",,"Nee",,,,"2024","Logisch","00","Ja","2024-08-16T00:00:00.000","2018-11-07T00:00:00.000","2018-11-07T00:00:00.000","2018-11-07T00:00:00.000",,,,,,,,,,,"167",,,,,,,,,,,,,,,,,"https://opendata.rdw.nl/resource/3huj-srit.json","https://opendata.rdw.nl/resource/8ys7-d773.json","https://opendata.rdw.nl/resource/vezc-m2t6.json","https://opendata.rdw.nl/resource/jhie-znh9.json","https://opendata.rdw.nl/resource/kmfi-hrps.json"
"TX576V","Personenauto","AUDI","SQ7","20241128","20181128","40877","sedan","5","ZWART","Niet geregistreerd","8","3956","2808","3300","2908",,,"20181128","20181128","Geen verstrekking in Open Data","157427","Ja",,,,,,,"4","4",,,,"505","197","M1",,,,"3300","4L",,,,,,"0.11","300","Nee","Nee",,"Nee",,,,"2024","Logisch","00","Ja","2024-11-28T00:00:00.000","2018-11-28T00:00:00.000","2018-11-28T00:00:00.000","2018-11-28T00:00:00.000",,,,,,,,,,,"167",,,,,,,,,,,,,,,,,"https://opendata.rdw.nl/resource/3huj-srit.json","https://opendata.rdw.nl/resource/8ys7-d773.json","https://opendata.rdw.nl/resource/vezc-m2t6.json","https://opendata.rdw.nl/resource/jhie-znh9.json","https://opendata.rdw.nl/resource/kmfi-hrps.json"
"TZ254L","Personenauto","AUDI","SQ7","20241128","20181128","40877","sedan","5","ZWART","Niet geregistreerd","8","3956","2617","3300","2717",,,"20181128","20181128","Geen verstrekking in Open Data","157427","Ja",,,,,,,"4","4",,,,"505","197","M1",,,,"3300","4L",,,,,,"0.12","300","Nee","Nee",,"Nee",,,,"2024","Logisch","00","Ja","2024-11-28T00:00:00.000","2018-11-28T00:00:00.000","2018-11-28T00:00:00.000","2018-11-28T00:00:00.000",,,,,,,,,,,"167",,,,,,,,,,,,,,,,,"https://opendata.rdw.nl/resource/3huj-srit.json","https://opendata.rdw.nl/resource/8ys7-d773.json","https://opendata.rdw.nl/resource/vezc-m2t6.json","https://opendata.rdw.nl/resource/jhie-znh9.json","https://opendata.rdw.nl/resource/kmfi-hrps.json"
"TZ566R","Personenauto","AUDI","SQ7","20240828","20181128","40877","sedan","5","ZWART","Niet geregistreerd","8","3956","2617","3300","2717",,,"20181128","20181128","Geen verstrekking in Open Data","157427","Ja",,,,,,,"4","4",,,,"505","197","M1",,,,"3300","4L",,,,,,"0.12","300","Nee","Nee",,"Nee",,,,"2024","Logisch","00","Ja","2024-08-28T00:00:00.000","2018-11-28T00:00:00.000","2018-11-28T00:00:00.000","2018-11-28T00:00:00.000",,,,,,,,,,,"167",,,,,,,,,,,,,,,,,"https://opendata.rdw.nl/resource/3huj-srit.json","https://opendata.rdw.nl/resource/8ys7-d773.json","https://opendata.rdw.nl/resource/vezc-m2t6.json","https://opendata.rdw.nl/resource/jhie-znh9.json","https://opendata.rdw.nl/resource/kmfi-hrps.json"
"TZ764D","Personenauto","AUDI","SQ7","20241128","20181128","40877","sedan","5","ZWART","Niet geregistreerd","8","3956","2617","3300","2717",,,"20181128","20181128","Geen verstrekking in Open Data","157427","Ja",,,,,,,"4","4",,,,"505","197","M1",,,,"3300","4L",,,,,,"0.12","300","Nee","Nee",,"Nee",,,,"2024","Logisch","00","Ja","2024-11-28T00:00:00.000","2018-11-28T00:00:00.000","2018-11-28T00:00:00.000","2018-11-28T00:00:00.000",,,,,,,,,,,"167",,,,,,,,,,,,,,,,,"https://opendata.rdw.nl/resource/3huj-srit.json","https://opendata.rdw.nl/resource/8ys7-d773.json","https://opendata.rdw.nl/resource/vezc-m2t6.json","https://opendata.rdw.nl/resource/jhie-znh9.json","https://opendata.rdw.nl/resource/kmfi-hrps.json"
