"kenteken","voertuigsoort","merk","handelsbenaming","vervaldatum_apk","datum_tenaamstelling","bruto_bpm","inrichting","aantal_zitplaatsen","eerste_kleur","tweede_kleur","aantal_cilinders","cilinderinhoud","massa_ledig_voertuig","toegestane_maximum_massa_voertuig","massa_rijklaar","maximum_massa_trekken_ongeremd","maximum_trekken_massa_geremd","datum_eerste_toelating","datum_eerste_tenaamstelling_in_nederland","wacht_op_keuren","catalogusprijs","wam_verzekerd","maximale_constructiesnelheid","laadvermogen","oplegger_geremd","aanhangwagen_autonoom_geremd","aanhangwagen_middenas_geremd","aantal_staanplaatsen","aantal_deuren","aantal_wielen","afstand_hart_koppeling_tot_achterzijde_voertuig","afstand_voorzijde_voertuig_tot_hart_koppeling","afwijkende_maximum_snelheid","lengte","breedte","europese_voertuigcategorie","europese_voertuigcategorie_toevoeging","europese_uitvoeringcategorie_toevoeging","plaats_chassisnummer","technische_max_massa_voertuig","type","type_gasinstallatie","typegoedkeuringsnummer","variant","uitvoering","volgnummer_wijziging_eu_typegoedkeuring","vermogen_massarijklaar","wielbasis","export_indicator","openstaande_terugroepactie_indicator","vervaldatum_tachograaf","taxi_indicator","maximum_massa_samenstelling","aantal_rolstoelplaatsen","maximum_ondersteunende_snelheid","jaar_laatste_registratie_tellerstand","tellerstandoordeel","code_toelichting_tellerstandoordeel","tenaamstellen_mogelijk","vervaldatum_apk_dt","datum_tenaamstelling_dt","datum_eerste_toelating_dt","datum_eerste_tenaamstelling_in_nederland_dt","vervaldatum_tachograaf_dt","maximum_last_onder_de_vooras_sen_tezamen_koppeling","type_remsysteem_voertuig_code","rupsonderstelconfiguratiecode","wielbasis_voertuig_minimum","wielbasis_voertuig_maximum","lengte_voertuig_minimum","lengte_voertuig_maximum","breedte_voertuig_minimum","breedte_voertuig_maximum","hoogte_voertuig","hoogte_voertuig_minimum","hoogte_voertuig_maximum","massa_bedrijfsklaar_minimaal","massa_bedrijfsklaar_maximaal","technisch_toelaatbaar_massa_koppelpunt","maximum_massa_technisch_maximaal","maximum_massa_technisch_minimaal","subcategorie_nederland","verticale_belasting_koppelpunt_getrokken_voertuig","zuinigheidsclassificatie","registratie_datum_goedkeuring_afschrijvingsmoment_bpm","registratie_datum_goedkeuring_afschrijvingsmoment_bpm_dt","gem_lading_wrde","aerodyn_voorz","massa_alt_aandr","verl_cab_ind","api_gekentekende_voertuigen_assen","api_gekentekende_voertuigen_brandstof","api_gekentekende_voertuigen_carrosserie","api_gekentekende_voertuigen_carrosserie_specifiek","api_gekentekende_voertuigen_voertuigklasse"
"G187BD","Personenauto","AUDI","TTS ROADSTER","20250110","20240406","7310","cabriolet","2","WIT","Niet geregistreerd","4","1984","1445","1790","1545",,,"20150714","20190819","Geen verstrekking in Open Data","76144","Ja","250",,,,,,"2","4","0","0",,"0","183","M1",,,,"1790","8J",,"e1*2001/116*0369*20","RCJXGQ1","QD6D9020P8J067MMEM1","0","0.15","250","Nee","Nee",,"Nee","0","0","0.00","2024","Geen oordeel","05","Ja","2025-01-10T00:00:00.000","2024-04-06T00:00:00.000","2015-07-14T00:00:00.000","2019-08-19T00:00:00.000",,,,,,,,,,,,,,,,,,,,,"E",,,,,,,"https://opendata.rdw.nl/resource/3huj-srit.json","https://opendata.rdw.nl/resource/8ys7-d773.json","https://opendata.rdw.nl/resource/vezc-m2t6.json","https://opendata.rdw.nl/resource/jhie-znh9.json","https://opendata.rdw.nl/resource/kmfi-hrps.json"
"G211FV","Personenauto","AUDI","TTS ROADSTER","20250220","20240226","15651","cabriolet","2","GRIJS","Niet geregistreerd","4","1984","1470","1825","1570",,,"20190913","20190913","Geen verstrekking in Open Data","96487","Ja","250",,,,,,"2","4","0","0",,"418","183","M1",,,,"1825","8J",,"e1*2001/116*0369*34","RDNUFQ1","QD7AD7GC001RT21E20S24BFAEM1","0","0.14","250","Nee","Nee",,"Nee","0","0","0.00","2024","Logisch","00","Ja","2025-02-20T00:00:00.000","2024-02-26T00:00:00.000","2019-09-13T00:00:00.000","2019-09-13T00:00:00.000",,,,,,,,,,,"133",,,,,,,,,,,,,,,,,"https://opendata.rdw.nl/resource/3huj-srit.json","https://opendata.rdw.nl/resource/8ys7-d773.json","https://opendata.rdw.nl/resource/vezc-m2t6.json","https://opendata.rdw.nl/resource/jhie-znh9.json","https://opendata.rdw.nl/resource/kmfi-hrps.json"
"G479FB","Personenauto","AUDI","TTS ROADSTER","20250428","20220505","7655","cabriolet","2","GRIJS","Niet geregistreerd","4","1984","1445","1790","1545",,,"20151210","20190906","Geen verstrekking in Open Data","90093","Ja","250",,,,,,"2","4","0","0",,"0","183","M1",,,,"1790","8J",,"e1*2001/116*0369*20","RCJXGQ1","QD6D9020P8J067MMEM1","0","0.15","250","Nee","Nee",,"Nee","0","0","0.00","2024","Geen oordeel","05","Ja","2025-04-28T00:00:00.000","2022-05-05T00:00:00.000","2015-12-10T00:00:00.000","2019-09-06T00:00:00.000",,,,,,,,,,,,,,,,,,,,,"E",,,,,,,"https://opendata.rdw.nl/resource/3huj-srit.json","https://opendata.rdw.nl/resource/8ys7-d773.json","https://opendata.rdw.nl/resource/vezc-m2t6.json","https://opendata.rdw.nl/resource/jhie-znh9.json","https://opendata.rdw.nl/resource/kmfi-hrps.json"
"G490NN","Personenauto","AUDI","TTS ROADSTER","20240817","20191029","13050","cabriolet","2","ROOD","Niet geregistreerd","4","1984","1445","1790","1545",,,"20180817","20191029","Geen verstrekking in Open Data","93099","Ja","250",,,,,,"2","4",,,,,,"M1",,,,"1790","8J",,"e1*2001/116*0369*30","RCJXGQ1","QD6QD6D9020P8J06S27MM0EM1","0","0.15","250","Nee","Nee",,"Nee",,,,"2023","Geen oordeel","05","Ja","2024-08-17T00:00:00.000","2019-10-29T00:00:00.000","2018-08-17T00:00:00.000","2019-10-29T00:00:00.000",,,,,,,,,,,,,,,,,,,,,"G",,,,,,,"https://opendata.rdw.nl/resource/3huj-srit.json","https://opendata.rdw.nl/resource/8ys7-d773.json","https://opendata.rdw.nl/resource/vezc-m2t6.json","https://opendata.rdw.nl/resource/jhie-znh9.json","https://opendata.rdw.nl/resource/kmfi-hrps.json"
"G926PS","Personenauto","AUDI","TTS ROADSTER","20250131","20191109","9983","cabriolet","2","ZWART","Niet geregistreerd","4","1984","1445","1790","1545",,,"20160122","20191109","Geen verstrekking in Open Data","90011","Ja","250",,,,,,"2","4",,,,,"183","M1",,,"r. voorwielscherm motorruimte","1790","8J",,,,,,"0.15","250","Nee","Nee",,"Nee",,,,"2024","Geen oordeel","05","Ja","2025-01-31T00:00:00.000","2019-11-09T00:00:00.000","2016-01-22T00:00:00.000","2019-11-09T00:00:00.000",,,,,,,,,,,,,,,,,,,,,,,,,,,,"https://opendata.rdw.nl/resource/3huj-srit.json","https://opendata.rdw.nl/resource/8ys7-d773.json","https://opendata.rdw.nl/resource/vezc-m2t6.json","https://opendata.rdw.nl/resource/jhie-znh9.json","https://opendata.rdw.nl/resource/kmfi-hrps.json"
"G948VR","Personenauto","AUDI","TTS ROADSTER","20240713","20220713","9849","cabriolet","2","ZWART","Niet geregistreerd","4","1984","1445","1790","1545",,,"20170307","20191209","Geen verstrekking in Open Data","87612","Ja","250",,,,,,"2","4","0","0",,"0","0","M1",,,,"1790","8J",,"e1*2001/116*0369*25","RCJXGQ1","QD6QD6D9020P8J067MMEM1","0","0.15","250","Nee","Nee",,"Nee","0","0","0.00","2022","Geen oordeel","05","Ja","2024-07-13T00:00:00.000","2022-07-13T00:00:00.000","2017-03-07T00:00:00.000","2019-12-09T00:00:00.000",,,,,,,,,,,,,,,,,,,,,"F",,,,,,,"https://opendata.rdw.nl/resource/3huj-srit.json","https://opendata.rdw.nl/resource/8ys7-d773.json","https://opendata.rdw.nl/resource/vezc-m2t6.json","https://opendata.rdw.nl/resource/jhie-znh9.json","https://opendata.rdw.nl/resource/kmfi-hrps.json"
"GD335L","Personenauto","AUDI","TTS ROADSTER","20250425","20210130","8087","cabriolet","2","WIT","Niet geregistreerd","4","1984","1445","1790","1545",,,"20150424","20150424","Geen verstrekking in Open Data","82262","Ja",,,,,,,"2","4","0","0",,"0","0","M1",,,"by schutbord","1790","8J",,"e1*2001/116*0369*19","RCJXGQ1","QD6D9020R8J027MMEM1","0","0.15","250","Nee","Nee",,"Nee","0","0",,"2024","Logisch","00","Ja","2025-04-25T00:00:00.000","2021-01-30T00:00:00.000","2015-04-24T00:00:00.000","2015-04-24T00:00:00.000",,,,,,,,,,,,,,,,,,,,,"D",,,,,,,"https://opendata.rdw.nl/resource/3huj-srit.json","https://opendata.rdw.nl/resource/8ys7-d773.json","https://opendata.rdw.nl/resource/vezc-m2t6.json","https://opendata.rdw.nl/resource/jhie-znh9.json","https://opendata.rdw.nl/resource/kmfi-hrps.json"
"GG655F","Personenauto","AUDI","TTS ROADSTER","20240707","20230701","8087","cabriolet","2","GRIJS","Niet geregistreerd","4","1984","1445","1790","1545",,,"20150519","20150519","Geen verstrekking in Open Data","82998","Ja",,,,,,,"2","4","0","0",,"0","0","M1",,,"by schutbord","1790","8J",,"e1*2001/116*0369*19","RCJXGQ1","QD6D9020R8J027MMEM1","0","0.15","250","Nee","Nee",,"Nee","0","0",,"2023","Logisch","00","Ja","2024-07-07T00:00:00.000","2023-07-01T00:00:00.000","2015-05-19T00:00:00.000","2015-05-19T00:00:00.000",,,,,,,,,,,,,,,,,,,,,"D",,,,,,,"https://opendata.rdw.nl/resource/3huj-srit.json","https://opendata.rdw.nl/resource/8ys7-d773.json","https://opendata.rdw.nl/resource/vezc-m2t6.json","https://opendata.rdw.nl/resource/jhie-znh9.json","https://opendata.rdw.nl/resource/kmfi-hrps.json"
"GH213Z","Personenauto","AUDI","TTS ROADSTER","20240605","20191204","8087","cabriolet","2","WIT","Niet geregistreerd","4","1984","1445","1790","1545",,,"20150605","20150605","Geen verstrekking in Open Data","79328","Ja",,,,,,,"2","4","0","0",,"0","0","M1",,,"by schutbord","1790","8J",,"e1*2001/116*0369*19","RCJXGQ1","QD6D9020R8J027MMEM1","0","0.15","250","Nee","Ja",,"Nee","0","0",,"2023","Logisch","00","Ja","2024-06-05T00:00:00.000","2019-12-04T00:00:00.000","2015-06-05T00:00:00.000","2015-06-05T00:00:00.000",,,,,,,,,,,,,,,,,,,,,"D",,,,,,,"https://opendata.rdw.nl/resource/3huj-srit.json","https://opendata.rdw.nl/resource/8ys7-d773.json","https://opendata.rdw.nl/resource/vezc-m2t6.json","https://opendata.rdw.nl/resource/jhie-znh9.json","https://opendata.rdw.nl/resource/kmfi-hrps.json"
"GH622P","Personenauto","AUDI","TTS ROADSTER","20250217","20240504","8087","cabriolet","2","ROOD","Niet geregistreerd","4","1984","1445","1790","1545",,,"20150529","20150529","Geen verstrekking in Open Data","83248","Ja",,,,,,,"2","4","0","0",,"0","0","M1",,,"by schutbord","1790","8J",,"e1*2001/116*0369*19","RCJXGQ1","QD6D9020R8J027MMEM1","0","0.15","250","Nee","Nee",,"Nee","0","0",,"2024","Logisch","00","Ja","2025-02-17T00:00:00.000","2024-05-04T00:00:00.000","2015-05-29T00:00:00.000","2015-05-29T00:00:00.000",,,,,,,,,,,,,,,,,,,,,"D",,,,,,,"https://opendata.rdw.nl/resource/3huj-srit.json","https://opendata.rdw.nl/resource/8ys7-d773.json","https://opendata.rdw.nl/resource/vezc-m2t6.json","https://opendata.rdw.nl/resource/jhie-znh9.json","https://opendata.rdw.nl/resource/kmfi-hrps.json"
"H007TH","Personenauto","AUDI","TTS ROADSTER","20250516","20200515","8281","cabriolet","2","GRIJS","Niet geregistreerd","4","1984","1445","1790","1545",,,"20170516","20200515","Geen verstrekking in Open Data","94809","Ja","250",,,,,,"2","4","0","0",,"0","0","M1",,,,"1790","8J",,"e1*2001/116*0369*26","RCJXGQ1","QD6QD6D9020P8J067MMEM1","0","0.15","250","Nee","Nee",,"Nee","0","0","0.00","2024","Geen oordeel","05","Ja","2025-05-16T00:00:00.000","2020-05-15T00:00:00.000","2017-05-16T00:00:00.000","2020-05-15T00:00:00.000",,,,,,,,,,,,,,,,,,,,,"F",,,,,,,"https://opendata.rdw.nl/resource/3huj-srit.json","https://opendata.rdw.nl/resource/8ys7-d773.json","https://opendata.rdw.nl/resource/vezc-m2t6.json","https://opendata.rdw.nl/resource/jhie-znh9.json","https://opendata.rdw.nl/resource/kmfi-hrps.json"
"H303ZX","Personenauto","AUDI","TTS ROADSTER","20250214","20200625","11005","cabriolet","2","GRIJS","Niet geregistreerd","4","1984","1470","1825","1570",,,"20190214","20200625","Geen verstrekking in Open Data","88371","Ja","250",,,,,,"2","4","0","0",,"0","0","M1",,,,"1825","8J",,"e1*2001/116*0369*33","RDNUFQ1","QD7AD7GC001RT21E19S27CSAEM1","0","0.14","250","Nee","Nee",,"Nee","0","0","0.00","2024","Geen oordeel","05","Ja","2025-02-14T00:00:00.000","2020-06-25T00:00:00.000","2019-02-14T00:00:00.000","2020-06-25T00:00:00.000",,,,,,,,,,,,,,,,,,,,,,,,,,,,"https://opendata.rdw.nl/resource/3huj-srit.json","https://opendata.rdw.nl/resource/8ys7-d773.json","https://opendata.rdw.nl/resource/vezc-m2t6.json","https://opendata.rdw.nl/resource/jhie-znh9.json","https://opendata.rdw.nl/resource/kmfi-hrps.json"
"H383RP","Personenauto","AUDI","TTS ROADSTER","20240927","20230929","7015","cabriolet","2","ZWART","Niet geregistreerd","4","1984","1445","1790","1545",,,"20150422","20200415","Geen verstrekking in Open Data","83384","Ja",,,,,,,"2","4",,,,,"183","M1",,,"midden tegen schutbord onder motorkap","1790","8J",,"e1*2001/116*0369*19","RCJXGQ1","QD6D9020R8J047MMEM2","0","0.15","250","Nee","Nee",,"Nee",,,,"2023","Geen oordeel","05","Ja","2024-09-27T00:00:00.000","2023-09-29T00:00:00.000","2015-04-22T00:00:00.000","2020-04-15T00:00:00.000",,,,,,,,,,,,,,,,,,,,,"E",,,,,,,"https://opendata.rdw.nl/resource/3huj-srit.json","https://opendata.rdw.nl/resource/8ys7-d773.json","https://opendata.rdw.nl/resource/vezc-m2t6.json","https://opendata.rdw.nl/resource/jhie-znh9.json","https://opendata.rdw.nl/resource/kmfi-hrps.json"
"H518RR","Personenauto","AUDI","TTS ROADSTER","20250312","20200605","8882","cabriolet","2","BLAUW","Niet geregistreerd","4","1984","1445","1790","1545",,,"20160525","20200605","Geen verstrekking in Open Data","86652","Ja",,,,,,,"2","4","0","0",,"0","183","M1",,,"midden tegen schutbord onder motorkap","1790","8J",,"e1*2001/116*0369*22","RCJXGQ1","QD6D9020P8J067MMEM1","0","0.15","250","Nee","Nee",,"Nee","0","0","0.00","2023","Geen oordeel","05","Ja","2025-03-12T00:00:00.000","2020-06-05T00:00:00.000","2016-05-25T00:00:00.000","2020-06-05T00:00:00.000",,,,,,,,,,,,,,,,,,,,,"F",,,,,,,"https://opendata.rdw.nl/resource/3huj-srit.json","https://opendata.rdw.nl/resource/8ys7-d773.json","https://opendata.rdw.nl/resource/vezc-m2t6.json","https://opendata.rdw.nl/resource/jhie-znh9.json","https://opendata.rdw.nl/resource/kmfi-hrps.json"
"H590FN","Personenauto","AUDI","TTS ROADSTER","20241007","20221012","5547","cabriolet","2","ZWART","Niet geregistreerd","4","1984","1445","1790","1545",,,"20151201","20200122","Geen verstrekking in Open Data","75505","Ja","250",,,,,,"2","4","0","0",,"0","183","M1",,,,"1790","8J",,"e1*2001/116*0369*22","RCJXGQ1","QD6D9020P8J067MMEM1","0","0.15","250","Nee","Nee",,"Nee","0","0","0.00","2022","Geen oordeel","05","Ja","2024-10-07T00:00:00.000","2022-10-12T00:00:00.000","2015-12-01T00:00:00.000","2020-01-22T00:00:00.000",,,,,,,,,,,,,,,,,,,,,"E",,,,,,,"https://opendata.rdw.nl/resource/3huj-srit.json","https://opendata.rdw.nl/resource/8ys7-d773.json","https://opendata.rdw.nl/resource/vezc-m2t6.json","https://opendata.rdw.nl/resource/jhie-znh9.json","https://opendata.rdw.nl/resource/kmfi-hrps.json"
"HB442P","Personenauto","AUDI","TTS ROADSTER","20240928","20210818","8850","cabriolet","2","ZWART","Niet geregistreerd","4","1984","1445","1790","1545",,,"20150928","20150928","Geen verstrekking in Open Data","84800","Ja",,,,,,,"2","4","0","0",,"0","0","M1",,,"by schutbord","1790","8J",,"e1*2001/116*0369*21","RCJXGQ1","QD6D9020P8J067MMEM1","0","0.15","250","Nee","Nee",,"Nee","0","0",,"2023","Logisch","00","Ja","2024-09-28T00:00:00.000","2021-08-18T00:00:00.000","2015-09-28T00:00:00.000","2015-09-28T00:00:00.000",,,,,,,,,,,,,,,,,,,,,"E",,,,,,,"https://opendata.rdw.nl/resource/3huj-srit.json","https://opendata.rdw.nl/resource/8ys7-d773.json","https://opendata.rdw.nl/resource/vezc-m2t6.json","https://opendata.rdw.nl/resource/jhie-znh9.json","https://opendata.rdw.nl/resource/kmfi-hrps.json"
"HD517R","Personenauto","AUDI","TTS ROADSTER","20250218","20200221","8850","cabriolet","2","ZWART","Niet geregistreerd","4","1984","1445","1790","1545",,,"20151009","20151009","Geen verstrekking in Open Data","87387","Ja",,,,,,,"2","4","0","0",,"418","183","M1",,,"in motorruimte r.","1790","8J",,"e1*2001/116*0369*21","RCJXGQ1","QD6D9020P8J067MMEM1","0","0.15","250","Nee","Nee",,"Nee","0","0",,"2024","Logisch","00","Ja","2025-02-18T00:00:00.000","2020-02-21T00:00:00.000","2015-10-09T00:00:00.000","2015-10-09T00:00:00.000",,,,,,,,,,,"134",,,,,,,,,,"E",,,,,,,"https://opendata.rdw.nl/resource/3huj-srit.json","https://opendata.rdw.nl/resource/8ys7-d773.json","https://opendata.rdw.nl/resource/vezc-m2t6.json","https://opendata.rdw.nl/resource/jhie-znh9.json","https://opendata.rdw.nl/resource/kmfi-hrps.json"
"HF165R","Personenauto","AUDI","TTS ROADSTER","20241020","20151020","8850","cabriolet","2","ROOD","Niet geregistreerd","4","1984","1445","1790","1545",,,"20151020","20151020","Geen verstrekking in Open Data","88985","Ja",,,,,,,"2","4","0","0",,"418","183","M1",,,"in motorruimte r.","1790","8J",,"e1*2001/116*0369*21","RCJXGQ1","QD6D9020P8J067MMEM1","0","0.15","250","Nee","Nee",,"Nee","0","0",,"2023","Logisch","00","Ja","2024-10-20T00:00:00.000","2015-10-20T00:00:00.000","2015-10-20T00:00:00.000","2015-10-20T00:00:00.000",,,,,,,,,,,"134",,,,,,,,,,"E",,,,,,,"https://opendata.rdw.nl/resource/3huj-srit.json","https://opendata.rdw.nl/resource/8ys7-d773.json","https://opendata.rdw.nl/resource/vezc-m2t6.json","https://opendata.rdw.nl/resource/jhie-znh9.json","https://opendata.rdw.nl/resource/kmfi-hrps.json"
"HJ002K","Personenauto","AUDI","TTS ROADSTER","20241109","20151109","8850","cabriolet","2","GRIJS","Niet geregistreerd","4","1984","1445","1790","1545",,,"20151109","20151109","Geen verstrekking in Open Data","84406","Ja",,,,,,,"2","4","0","0",,"418","183","M1",,,"in motorruimte r.","1790","8J",,"e1*2001/116*0369*21","RCJXGQ1","QD6D9020P8J067MMEM1","0","0.15","250","Nee","Nee",,"Nee","0","0",,"2024","Logisch","00","Ja","2024-11-09T00:00:00.000","2015-11-09T00:00:00.000","2015-11-09T00:00:00.000","2015-11-09T00:00:00.000",,,,,,,,,,,"134",,,,,,,,,,"E",,,,,,,"https://opendata.rdw.nl/resource/3huj-srit.json","https://opendata.rdw.nl/resource/8ys7-d773.json","https://opendata.rdw.nl/resource/vezc-m2t6.json","https://opendata.rdw.nl/resource/jhie-znh9.json","https://opendata.rdw.nl/resource/kmfi-hrps.json"
"HL507D","Personenauto","AUDI","TTS ROADSTER","20250210","20230211","8850","cabriolet","2","GRIJS","Niet geregistreerd","4","1984","1445","1790","1545",,,"20151130","20151130","Geen verstrekking in Open Data","81085","Ja",,,,,,,"2","4","0","0",,"418","183","M1",,,"in motorruimte r.","1790","8J",,"e1*2001/116*0369*22","RCJXGQ1","QD6D9020P8J067MMEM1","0","0.15","250","Nee","Nee",,"Nee","0","0","0.00","2024","Logisch","00","Ja","2025-02-10T00:00:00.000","2023-02-11T00:00:00.000","2015-11-30T00:00:00.000","2015-11-30T00:00:00.000",,,,,,,,,,,"134",,,,,,,,,,"E",,,,,,,"https://opendata.rdw.nl/resource/3huj-srit.json","https://opendata.rdw.nl/resource/8ys7-d773.json","https://opendata.rdw.nl/resource/vezc-m2t6.json","https://opendata.rdw.nl/resource/jhie-znh9.json","https://opendata.rdw.nl/resource/kmfi-hrps.json"
"J008SK","Personenauto","AUDI","TTS ROADSTER","20240904","20230904","5811","cabriolet","2","WIT","Niet geregistreerd","4","1984","1445","1790","1545",,,"20160422","20201010","Geen verstrekking in Open Data","75698","Ja","250",,,,,,"2","4","0","0",,"0","183","M1",,,,"1790","8J",,"e1*2001/116*0369*22","RCJXGQ1","QD6D9020P8J067MMEM1","0","0.15","250","Nee","Nee",,"Nee","0","0","0.00","2023","Geen oordeel","05","Ja","2024-09-04T00:00:00.000","2023-09-04T00:00:00.000","2016-04-22T00:00:00.000","2020-10-10T00:00:00.000",,,,,,,,,,,,,,,,,,,,,"F",,,,,,,"https://opendata.rdw.nl/resource/3huj-srit.json","https://opendata.rdw.nl/resource/8ys7-d773.json","https://opendata.rdw.nl/resource/vezc-m2t6.json","https://opendata.rdw.nl/resource/jhie-znh9.json","https://opendata.rdw.nl/resource/kmfi-hrps.json"
"J420PX","Personenauto","AUDI","TTS ROADSTER","20250509","20220514","9548","cabriolet","2","ZWART","Niet geregistreerd","4","1984","1445","1790","1545",,,"20160601","20201003","Geen verstrekking in Open Data","84917","Ja",,,,,,,"2","4","0","0",,"0","183","M1",,,"midden tegen schutbord onder motorkap","1790","8J",,"e1*2001/116*0369*22","RCJXGQ1","QD6D9020P8J067MMEM1","0","0.15","250","Nee","Nee",,"Nee","0","0","0.00","2024","Geen oordeel","05","Ja","2025-05-09T00:00:00.000","2022-05-14T00:00:00.000","2016-06-01T00:00:00.000","2020-10-03T00:00:00.000",,,,,,,,,,,,,,,,,,,,,"F",,,,,,,"https://opendata.rdw.nl/resource/3huj-srit.json","https://opendata.rdw.nl/resource/8ys7-d773.json","https://opendata.rdw.nl/resource/vezc-m2t6.json","https://opendata.rdw.nl/resource/jhie-znh9.json","https://opendata.rdw.nl/resource/kmfi-hrps.json"
"J454JB","Personenauto","AUDI","TTS ROADSTER","20250524","20230527","12984","cabriolet","2","GRIJS","Niet geregistreerd","4","1984","1450","1798","1550",,,"20080709","20200811","Geen verstrekking in Open Data",,"Ja",,,,,,,"2","4",,,,,,"M1",,,,"1798","8J",,,,,,"0.13","246","Nee","Nee",,"Nee",,,,"2024","Geen oordeel","05","Ja","2025-05-24T00:00:00.000","2023-05-27T00:00:00.000","2008-07-09T00:00:00.000","2020-08-11T00:00:00.000",,,,,,,,,,,,,,,,,,,,,,,,,,,,"https://opendata.rdw.nl/resource/3huj-srit.json","https://opendata.rdw.nl/resource/8ys7-d773.json","https://opendata.rdw.nl/resource/vezc-m2t6.json","https://opendata.rdw.nl/resource/jhie-znh9.json","https://opendata.rdw.nl/resource/kmfi-hrps.json"
"J918DG","Personenauto","AUDI","TTS ROADSTER","20240830","20200703","11557","cabriolet","2","ROOD","Niet geregistreerd","4","1984","1470","1815","1570",,,"20121019","20200703","Geen verstrekking in Open Data","84513","Ja","250",,,,,,"2","4",,,,,,"M1",,,,"1815","8J",,"e1*2001/116*0369*15","RCDLBQ1","QD62E073R8J807MQEM1","0","0.13","246","Nee","Nee",,"Nee",,,,"2023","Onlogisch","04","Ja","2024-08-30T00:00:00.000","2020-07-03T00:00:00.000","2012-10-19T00:00:00.000","2020-07-03T00:00:00.000",,,,,,,,,,,,,,,,,,,,,"E",,,,,,,"https://opendata.rdw.nl/resource/3huj-srit.json","https://opendata.rdw.nl/resource/8ys7-d773.json","https://opendata.rdw.nl/resource/vezc-m2t6.json","https://opendata.rdw.nl/resource/jhie-znh9.json","https://opendata.rdw.nl/resource/kmfi-hrps.json"
"JR621D","Personenauto","AUDI","TTS ROADSTER","20240929","20231002","9544","cabriolet","2","ROOD","Niet geregistreerd","4","1984","1445","1790","1545",,,"20160530","20160530","Geen verstrekking in Open Data","85025","Ja",,,,,,,"2","4","0","0",,"418","183","M1",,,"in motorruimte r.","1790","8J",,"e1*2001/116*0369*22","RCJXGQ1","QD6D9020P8J057MMEM1","0","0.15","250","Nee","Nee",,"Nee","0","0","0.00","2023","Logisch","00","Ja","2024-09-29T00:00:00.000","2023-10-02T00:00:00.000","2016-05-30T00:00:00.000","2016-05-30T00:00:00.000",,,,,,,,,,,"134",,,,,,,,,,"F",,,,,,,"https://opendata.rdw.nl/resource/3huj-srit.json","https://opendata.rdw.nl/resource/8ys7-d773.json","https://opendata.rdw.nl/resource/vezc-m2t6.json","https://opendata.rdw.nl/resource/jhie-znh9.json","https://opendata.rdw.nl/resource/kmfi-hrps.json"
"JZ993Z","Personenauto","AUDI","TTS ROADSTER","20250416","20240419","8337","cabriolet","2","ZWART","Niet geregistreerd","4","1984","1445","1790","1545",,,"20160412","20160718","Geen verstrekking in Open Data","89252","Ja",,,,,,,"2","4","0","0",,"0","0","M1",,,"by schutbord","1790","8J",,"e1*2001/116*0369*22","RCJXGQ1","QD6D9020P8J067MMEM1","0","0.15","250","Nee","Nee",,"Nee","0","0","0.00","2024","Geen oordeel","05","Ja","2025-04-16T00:00:00.000","2024-04-19T00:00:00.000","2016-04-12T00:00:00.000","2016-07-18T00:00:00.000",,,,,,,,,,,,,,,,,,,,,"F",,,,,,,"https://opendata.rdw.nl/resource/3huj-srit.json","https://opendata.rdw.nl/resource/8ys7-d773.json","https://opendata.rdw.nl/resource/vezc-m2t6.json","https://opendata.rdw.nl/resource/jhie-znh9.json","https://opendata.rdw.nl/resource/kmfi-hrps.json"