"kenteken","voertuigsoort","merk","handelsbenaming","vervaldatum_apk","datum_tenaamstelling","bruto_bpm","inrichting","aantal_zitplaatsen","eerste_kleur","tweede_kleur","aantal_cilinders","cilinderinhoud","massa_ledig_voertuig","toegestane_maximum_massa_voertuig","massa_rijklaar","maximum_massa_trekken_ongeremd","maximum_trekken_massa_geremd","datum_eerste_toelating","datum_eerste_tenaamstelling_in_nederland","wacht_op_keuren","catalogusprijs","wam_verzekerd","maximale_constructiesnelheid","laadvermogen","oplegger_geremd","aanhangwagen_autonoom_geremd","aanhangwagen_middenas_geremd","aantal_staanplaatsen","aantal_deuren","aantal_wielen","afstand_hart_koppeling_tot_achterzijde_voertuig","afstand_voorzijde_voertuig_tot_hart_koppeling","afwijkende_maximum_snelheid","lengte","breedte","europese_voertuigcategorie","europese_voertuigcategorie_toevoeging","europese_uitvoeringcategorie_toevoeging","plaats_chassisnummer","technische_max_massa_voertuig","type","type_gasinstallatie","typegoedkeuringsnummer","variant","uitvoering","volgnummer_wijziging_eu_typegoedkeuring","vermogen_massarijklaar","wielbasis","export_indicator","openstaande_terugroepactie_indicator","vervaldatum_tachograaf","taxi_indicator","maximum_massa_samenstelling","aantal_rolstoelplaatsen","maximum_ondersteunende_snelheid","jaar_laatste_registratie_tellerstand","tellerstandoordeel","code_toelichting_tellerstandoordeel","tenaamstellen_mogelijk","vervaldatum_apk_dt","datum_tenaamstelling_dt","datum_eerste_toelating_dt","datum_eerste_tenaamstelling_in_nederland_dt","vervaldatum_tachograaf_dt","maximum_last_onder_de_vooras_sen_tezamen_koppeling","type_remsysteem_voertuig_code","rupsonderstelconfiguratiecode","wielbasis_voertuig_minimum","wielbasis_voertuig_maximum","lengte_voertuig_minimum","lengte_voertuig_maximum","breedte_voertuig_minimum","breedte_voertuig_maximum","hoogte_voertuig","hoogte_voertuig_minimum","hoogte_voertuig_maximum","massa_bedrijfsklaar_minimaal","massa_bedrijfsklaar_maximaal","technisch_toelaatbaar_massa_koppelpunt","maximum_massa_technisch_maximaal","maximum_massa_technisch_minimaal","subcategorie_nederland","verticale_belasting_koppelpunt_getrokken_voertuig","zuinigheidsclassificatie","registratie_datum_goedkeuring_afschrijvingsmoment_bpm","registratie_datum_goedkeuring_afschrijvingsmoment_bpm_dt","gem_lading_wrde","aerodyn_voorz","massa_alt_aandr","verl_cab_ind","api_gekentekende_voertuigen_assen","api_gekentekende_voertuigen_brandstof","api_gekentekende_voertuigen_carrosserie","api_gekentekende_voertuigen_carrosserie_specifiek","api_gekentekende_voertuigen_voertuigklasse"
"52KDD1","Personenauto","AUDI","A8 QUATTRO","20240908","20091012","31288","sedan","5","BLAUW","Niet geregistreerd","8","4200","1950","2552","2050","750",,"20060630","20091012","Geen verstrekking in Open Data",,"Ja",,,,,,,"4","4",,,,,,"M1",,,"r. balk kofferruimte","2552",,,,,,,"0.12","296","Nee","Nee",,"Nee",,,,"2024","Geen oordeel","05","Ja","2024-09-08T00:00:00.000","2009-10-12T00:00:00.000","2006-06-30T00:00:00.000","2009-10-12T00:00:00.000",,"0",,,,,,,,,,,,,,,,,,,,,,,,,,"https://opendata.rdw.nl/resource/3huj-srit.json","https://opendata.rdw.nl/resource/8ys7-d773.json","https://opendata.rdw.nl/resource/vezc-m2t6.json","https://opendata.rdw.nl/resource/jhie-znh9.json","https://opendata.rdw.nl/resource/kmfi-hrps.json"
"55SLTP","Personenauto","AUDI","A8 QUATTRO","20240206","20210202","24477","sedan",,"GRIJS","Niet geregistreerd","8","4172","1810","2350","1910",,,"19970219","20060302","Geen verstrekking in Open Data",,"Nee",,,,,,,"4","4",,,,,,"M1",,,"r. tegen schutbord onder motorkap","2350",,,,,,,"0.12","289","Nee","Nee",,"Nee",,,,"2023","Geen oordeel","05","Ja","2024-02-06T00:00:00.000","2021-02-02T00:00:00.000","1997-02-19T00:00:00.000","2006-03-02T00:00:00.000",,"0",,,,,,,,,,,,,,,,,,,,,,,,,,"https://opendata.rdw.nl/resource/3huj-srit.json","https://opendata.rdw.nl/resource/8ys7-d773.json","https://opendata.rdw.nl/resource/vezc-m2t6.json","https://opendata.rdw.nl/resource/jhie-znh9.json","https://opendata.rdw.nl/resource/kmfi-hrps.json"
"G719VG","Personenauto","AUDI","AUDI A8 QUATTRO","20241219","20200808","6769","sedan","5","BLAUW","Niet geregistreerd","8","3697","1850","2370","1950","750","2300","20040625","20191204","Geen verstrekking in Open Data",,"Ja",,,,,,,"4","4",,,,,,"M1",,,,"2370","AUDI A8 QUATTRO",,,,,,"0.11","293","Nee","Nee",,"Nee",,,,"2024","Geen oordeel","05","Ja","2024-12-19T00:00:00.000","2020-08-08T00:00:00.000","2004-06-25T00:00:00.000","2019-12-04T00:00:00.000",,,,,,,,,,,,,,,,,,,,,,,,,,,,"https://opendata.rdw.nl/resource/3huj-srit.json","https://opendata.rdw.nl/resource/8ys7-d773.json","https://opendata.rdw.nl/resource/vezc-m2t6.json","https://opendata.rdw.nl/resource/jhie-znh9.json","https://opendata.rdw.nl/resource/kmfi-hrps.json"
"G961NB","Personenauto","AUDI","A8 QUATTRO","20231121","20231201","26087","sedan","5","BLAUW","Niet geregistreerd","8","4172","1835","2380","1935",,"2330","20030818","20191112","Geen verstrekking in Open Data",,"Ja",,,,,,,"4","4",,,,,,"M1",,,"r. bodemplaat onder voorzitting","2380","4E",,,,,,"0.13","295","Nee","Nee",,"Nee","4710",,,"2023","Geen oordeel","05","Ja","2023-11-21T00:00:00.000","2023-12-01T00:00:00.000","2003-08-18T00:00:00.000","2019-11-12T00:00:00.000",,,,,,,,,,,,,,,,,,,,,,,,,,,,"https://opendata.rdw.nl/resource/3huj-srit.json","https://opendata.rdw.nl/resource/8ys7-d773.json","https://opendata.rdw.nl/resource/vezc-m2t6.json","https://opendata.rdw.nl/resource/jhie-znh9.json","https://opendata.rdw.nl/resource/kmfi-hrps.json"
"H410HV","Personenauto","AUDI","A8 QUATTRO","20240613","20221024","28904","sedan","5","BLAUW","Niet geregistreerd","8","4172","1860","2380","1960",,,"20030905","20200605","Geen verstrekking in Open Data",,"Ja",,,,,,,"4","4",,,,,,"M1",,,,"2380",,,,,,,"0.13","295","Nee","Nee",,"Nee","4710",,,"2023","Geen oordeel","05","Ja","2024-06-13T00:00:00.000","2022-10-24T00:00:00.000","2003-09-05T00:00:00.000","2020-06-05T00:00:00.000",,,,,,,,,,,,,,,,,,,,,,,,,,,,"https://opendata.rdw.nl/resource/3huj-srit.json","https://opendata.rdw.nl/resource/8ys7-d773.json","https://opendata.rdw.nl/resource/vezc-m2t6.json","https://opendata.rdw.nl/resource/jhie-znh9.json","https://opendata.rdw.nl/resource/kmfi-hrps.json"
"H430DJ","Personenauto","AUDI","A8 QUATTRO","20250110","20200806","133","sedan","5","GRIJS","Niet geregistreerd","12","5998","1970","2545","2070",,,"20050717","20200113","Geen verstrekking in Open Data",,"Ja","209",,,,,,"4","4",,,,,,"M1",,,,"2545",,,,,,,"0.16","295","Nee","Nee",,"Nee",,,,"2024","Geen oordeel","05","Ja","2025-01-10T00:00:00.000","2020-08-06T00:00:00.000","2005-07-17T00:00:00.000","2020-01-13T00:00:00.000",,,,,,,,,,,,,,,,,,,,,,,,,,,,"https://opendata.rdw.nl/resource/3huj-srit.json","https://opendata.rdw.nl/resource/8ys7-d773.json","https://opendata.rdw.nl/resource/vezc-m2t6.json","https://opendata.rdw.nl/resource/jhie-znh9.json","https://opendata.rdw.nl/resource/kmfi-hrps.json"
"HG011V","Personenauto","AUDI","A8 QUATTRO","20240625","20211120","26561","sedan","5","GRIJS","Niet geregistreerd","8","4172","1795","2350","1895",,"2320","19990501","20151029","Geen verstrekking in Open Data",,"Ja",,,,,,,"4","4",,,,,,"M1",,,"r. schutbord by motorruimte","2350",,,,,,,"0.12","288","Nee","Nee",,"Nee","4670",,,"2023","Geen oordeel","05","Ja","2024-06-25T00:00:00.000","2021-11-20T00:00:00.000","1999-05-01T00:00:00.000","2015-10-29T00:00:00.000",,,,,,,,,,,,,,,,,,,,,,,,,,,,"https://opendata.rdw.nl/resource/3huj-srit.json","https://opendata.rdw.nl/resource/8ys7-d773.json","https://opendata.rdw.nl/resource/vezc-m2t6.json","https://opendata.rdw.nl/resource/jhie-znh9.json","https://opendata.rdw.nl/resource/kmfi-hrps.json"
"J493TP","Personenauto","AUDI","A8 QUATTRO","20241030","20240326","7807","sedan","5","ZWART","Niet geregistreerd","12","5998","2013","2510","2113",,"2050","20050501","20201105","Geen verstrekking in Open Data",,"Ja",,,,,,,"4","4",,,,,,"M1",,,,"2510","4E",,,,,,"0.16","294","Nee","Nee",,"Nee","4860",,,"2024","Geen oordeel","05","Ja","2024-10-30T00:00:00.000","2024-03-26T00:00:00.000","2005-05-01T00:00:00.000","2020-11-05T00:00:00.000",,,,,,,,,,,,,,,,,,,,,,,,,,,,"https://opendata.rdw.nl/resource/3huj-srit.json","https://opendata.rdw.nl/resource/8ys7-d773.json","https://opendata.rdw.nl/resource/vezc-m2t6.json","https://opendata.rdw.nl/resource/jhie-znh9.json","https://opendata.rdw.nl/resource/kmfi-hrps.json"
"JZDJ38","Personenauto","AUDI","A8 QUATTRO 128 KW","20210709","20190419","20014","sedan",,"BLAUW","Niet geregistreerd","6","2771","1495","2120","1595","750","2050","19950119","19950119","Geen verstrekking in Open Data",,"Nee",,,,,,,"4","4","0","0",,"0","0","M1",,,"r. tegen schutbord onder motorkap","2120",,,,,,"0","0.08","289","Nee","Nee",,"Nee","4095",,,"2020","Logisch","00","Ja","2021-07-09T00:00:00.000","2019-04-19T00:00:00.000","1995-01-19T00:00:00.000","1995-01-19T00:00:00.000",,,,,,,,,,,,,,,,,,,,,,,,,,,,"https://opendata.rdw.nl/resource/3huj-srit.json","https://opendata.rdw.nl/resource/8ys7-d773.json","https://opendata.rdw.nl/resource/vezc-m2t6.json","https://opendata.rdw.nl/resource/jhie-znh9.json","https://opendata.rdw.nl/resource/kmfi-hrps.json"
"LBPX84","Personenauto","AUDI","A8 QUATTRO 128 KW AUT","20170523","20170330","19803","sedan",,"GRIJS","Niet geregistreerd","6","2771","1545","2170","1645","750","2100","19950215","19950215","Geen verstrekking in Open Data",,"Ja",,,,,,,"4","4","0","0",,"0","0","M1",,,"r. tegen schutbord onder motorkap","2170",,,,,,"0","0.08","289","Nee","Nee",,"Nee","4195",,,"2017","Logisch","00","Ja","2017-05-23T00:00:00.000","2017-03-30T00:00:00.000","1995-02-15T00:00:00.000","1995-02-15T00:00:00.000",,,,,,,,,,,,,,,,,,,,,,,,,,,,"https://opendata.rdw.nl/resource/3huj-srit.json","https://opendata.rdw.nl/resource/8ys7-d773.json","https://opendata.rdw.nl/resource/vezc-m2t6.json","https://opendata.rdw.nl/resource/jhie-znh9.json","https://opendata.rdw.nl/resource/kmfi-hrps.json"
"LFGF64","Personenauto","AUDI","A8 QUATTRO 128 KW AUT","20190129","20180208","20860","sedan",,"GROEN","Niet geregistreerd","6","2771","1545","2170","1645","750","2100","19950310","19950310","Geen verstrekking in Open Data",,"Ja",,,,,,,"4","4","0","0",,"0","0","M1",,,"r. tegen schutbord onder motorkap","2170",,,,,,"0","0.08","289","Nee","Nee",,"Nee","4195",,,"2018","Geen oordeel","07","Ja","2019-01-29T00:00:00.000","2018-02-08T00:00:00.000","1995-03-10T00:00:00.000","1995-03-10T00:00:00.000",,,,,,,,,,,,,,,,,,,,,,,,,,,,"https://opendata.rdw.nl/resource/3huj-srit.json","https://opendata.rdw.nl/resource/8ys7-d773.json","https://opendata.rdw.nl/resource/vezc-m2t6.json","https://opendata.rdw.nl/resource/jhie-znh9.json","https://opendata.rdw.nl/resource/kmfi-hrps.json"
"N001KS","Personenauto","AUDI","A8 QUATTRO","20241109","20211122","26659","sedan","5","GRIJS","Niet geregistreerd","8","4172","1835","2380","1935",,"2330","20030415","20211122","Geen verstrekking in Open Data",,"Ja",,,,,,,"4","4",,,,,,"M1",,,,"2380",,,,,,,"0.13","294","Nee","Nee",,"Nee","4710",,,"2023","Geen oordeel","05","Ja","2024-11-09T00:00:00.000","2021-11-22T00:00:00.000","2003-04-15T00:00:00.000","2021-11-22T00:00:00.000",,,,,,,,,,,,,,,,,,,,,,"20211027","2021-10-27T00:00:00.000",,,,,"https://opendata.rdw.nl/resource/3huj-srit.json","https://opendata.rdw.nl/resource/8ys7-d773.json","https://opendata.rdw.nl/resource/vezc-m2t6.json","https://opendata.rdw.nl/resource/jhie-znh9.json","https://opendata.rdw.nl/resource/kmfi-hrps.json"
"N840ZZ","Personenauto","AUDI","A8 QUATTRO","20230125","20220126","18703","sedan","5","ZWART","Niet geregistreerd","8","4163","1780","2545","1880",,,"20110923","20220126","Geen verstrekking in Open Data","192004","Ja","250",,,,,,"4","4",,,,"527","195","M1",,,,"2545","AB",,,,,,"0.15","312","Nee","Nee",,"Nee",,,,"2022","Geen oordeel","05","Ja","2023-01-25T00:00:00.000","2022-01-26T00:00:00.000","2011-09-23T00:00:00.000","2022-01-26T00:00:00.000",,,,,,,,,,,"156",,,,,,,,,,,"20220104","2022-01-04T00:00:00.000",,,,,"https://opendata.rdw.nl/resource/3huj-srit.json","https://opendata.rdw.nl/resource/8ys7-d773.json","https://opendata.rdw.nl/resource/vezc-m2t6.json","https://opendata.rdw.nl/resource/jhie-znh9.json","https://opendata.rdw.nl/resource/kmfi-hrps.json"
"N979KR","Personenauto","AUDI","A8 QUATTRO","20241124","20221103","9799","sedan","5","BLAUW","Niet geregistreerd","8","4172","1860","2400","1960",,"2350","20050622","20211124","Geen verstrekking in Open Data",,"Ja",,,,,,,"4","4",,,,,,"M1",,,,"2400","4E",,,,,,"0.13","294","Nee","Nee",,"Nee","4750",,,"2023","Geen oordeel","05","Ja","2024-11-24T00:00:00.000","2022-11-03T00:00:00.000","2005-06-22T00:00:00.000","2021-11-24T00:00:00.000",,,,,,,,,,,,,,,,,,,,,,"20211026","2021-10-26T00:00:00.000",,,,,"https://opendata.rdw.nl/resource/3huj-srit.json","https://opendata.rdw.nl/resource/8ys7-d773.json","https://opendata.rdw.nl/resource/vezc-m2t6.json","https://opendata.rdw.nl/resource/jhie-znh9.json","https://opendata.rdw.nl/resource/kmfi-hrps.json"
"NVLT86","Personenauto","AUDI","A8 QUATTRO 128 KW AUT","20150915","20100903","17037","sedan",,"GRIJS","Niet geregistreerd","6","2771","1545","2170","1645","750","2100","19960404","19960404","Geen verstrekking in Open Data",,"Ja",,,,,,,"4","4","0","0",,"0","0","M1",,,"r. tegen schutbord onder motorkap","2170",,,,,,"0","0.08","289","Nee","Nee",,"Nee","4195",,,"2014","Logisch","00","Ja","2015-09-15T00:00:00.000","2010-09-03T00:00:00.000","1996-04-04T00:00:00.000","1996-04-04T00:00:00.000",,,,,,,,,,,,,,,,,,,,,,,,,,,,"https://opendata.rdw.nl/resource/3huj-srit.json","https://opendata.rdw.nl/resource/8ys7-d773.json","https://opendata.rdw.nl/resource/vezc-m2t6.json","https://opendata.rdw.nl/resource/jhie-znh9.json","https://opendata.rdw.nl/resource/kmfi-hrps.json"
"PG391X","Personenauto","AUDI","A8 QUATTRO","20240714","20171031","25437","sedan","5","GRIJS","Niet geregistreerd","8","4172","1915","2380","2015",,"2330","20021101","20170622","Geen verstrekking in Open Data","114150","Ja",,,,,,,"4","4",,,,,,"M1",,,"r. bodemplaat a. voorzitting","2380",,"G3 gasinstallatie",,,,,"0.12","294","Nee","Nee",,"Nee","4710",,,"2023","Geen oordeel","05","Ja","2024-07-14T00:00:00.000","2017-10-31T00:00:00.000","2002-11-01T00:00:00.000","2017-06-22T00:00:00.000",,,,,,,,,,,,,,,,,,,,,,,,,,,,"https://opendata.rdw.nl/resource/3huj-srit.json","https://opendata.rdw.nl/resource/8ys7-d773.json","https://opendata.rdw.nl/resource/vezc-m2t6.json","https://opendata.rdw.nl/resource/jhie-znh9.json","https://opendata.rdw.nl/resource/kmfi-hrps.json"
"RF134P","Personenauto","AUDI","A8 QUATTRO","20241201","20240113","29678","sedan","5","BLAUW","Niet geregistreerd","8","3697","1905","2370","2005",,,"20030207","20171214","Geen verstrekking in Open Data",,"Ja",,,,,,,"4","4",,,,,,"M1",,,"a. r. voorzitting","2370",,,,,,,"0.10","295","Nee","Nee",,"Nee","4700",,,"2024","Geen oordeel","05","Ja","2024-12-01T00:00:00.000","2024-01-13T00:00:00.000","2003-02-07T00:00:00.000","2017-12-14T00:00:00.000",,,,,,,,,,,,,,,,,,,,,,,,,,,,"https://opendata.rdw.nl/resource/3huj-srit.json","https://opendata.rdw.nl/resource/8ys7-d773.json","https://opendata.rdw.nl/resource/vezc-m2t6.json","https://opendata.rdw.nl/resource/jhie-znh9.json","https://opendata.rdw.nl/resource/kmfi-hrps.json"
"RG401K","Personenauto","AUDI","A8 QUATTRO","20241103","20201120","32148","sedan","5","GRIJS","Niet geregistreerd","8","4172","1915","2380","2015",,,"20021115","20171220","Geen verstrekking in Open Data",,"Ja",,,,,,,"4","4",,,,,,"M1",,,"a. r. voorzitting","2380",,"G3 gasinstallatie",,,,,"0.12","295","Nee","Nee",,"Nee","4710",,,"2023","Geen oordeel","05","Ja","2024-11-03T00:00:00.000","2020-11-20T00:00:00.000","2002-11-15T00:00:00.000","2017-12-20T00:00:00.000",,,,,,,,,,,,,,,,,,,,,,,,,,,,"https://opendata.rdw.nl/resource/3huj-srit.json","https://opendata.rdw.nl/resource/8ys7-d773.json","https://opendata.rdw.nl/resource/vezc-m2t6.json","https://opendata.rdw.nl/resource/jhie-znh9.json","https://opendata.rdw.nl/resource/kmfi-hrps.json"
"RJ042H","Personenauto","AUDI","A8 QUATTRO","20241130","20180410","31094","sedan","5","GRIJS","Niet geregistreerd","8","4127","1835","2380","1935",,,"20030409","20171201","Geen verstrekking in Open Data","126377","Ja",,,,,,,"4","4",,,,,,"M1",,,,"2380",,,,,,,"0.13","295","Nee","Nee",,"Nee",,,,"2023","Geen oordeel","05","Ja","2024-11-30T00:00:00.000","2018-04-10T00:00:00.000","2003-04-09T00:00:00.000","2017-12-01T00:00:00.000",,,,,,,,,,,,,,,,,,,,,,,,,,,,"https://opendata.rdw.nl/resource/3huj-srit.json","https://opendata.rdw.nl/resource/8ys7-d773.json","https://opendata.rdw.nl/resource/vezc-m2t6.json","https://opendata.rdw.nl/resource/jhie-znh9.json","https://opendata.rdw.nl/resource/kmfi-hrps.json"
"RJ992G","Personenauto","AUDI","A8 QUATTRO","20221201","20220625","31922","sedan","5","ZWART","Niet geregistreerd","8","4172","1835","2380","1935",,,"20030513","20180106","Geen verstrekking in Open Data",,"Ja",,,,,,,"4","4",,,,,,"M1",,,"r. schroefveerkoker","2380",,,,,,,"0.13","295","Nee","Nee",,"Nee","4710",,,"2022","Geen oordeel","05","Ja","2022-12-01T00:00:00.000","2022-06-25T00:00:00.000","2003-05-13T00:00:00.000","2018-01-06T00:00:00.000",,,,,,,,,,,,,,,,,,,,,,,,,,,,"https://opendata.rdw.nl/resource/3huj-srit.json","https://opendata.rdw.nl/resource/8ys7-d773.json","https://opendata.rdw.nl/resource/vezc-m2t6.json","https://opendata.rdw.nl/resource/jhie-znh9.json","https://opendata.rdw.nl/resource/kmfi-hrps.json"
"TB245P","Personenauto","AUDI","AUDI A8 QUATTRO","20240703","20210928","31815","sedan","5","BLAUW","Niet geregistreerd","8","4172","1928","2380","2028",,"2330","20030912","20180627","Geen verstrekking in Open Data",,"Ja",,,,,,,"4","4",,,,,,"M1",,,,"2380","4E","G3 gasinstallatie",,,,,"0.12","294","Nee","Nee",,"Nee","4710",,,"2024","Geen oordeel","05","Ja","2024-07-03T00:00:00.000","2021-09-28T00:00:00.000","2003-09-12T00:00:00.000","2018-06-27T00:00:00.000",,,,,,,,,,,,,,,,,,,,,,,,,,,,"https://opendata.rdw.nl/resource/3huj-srit.json","https://opendata.rdw.nl/resource/8ys7-d773.json","https://opendata.rdw.nl/resource/vezc-m2t6.json","https://opendata.rdw.nl/resource/jhie-znh9.json","https://opendata.rdw.nl/resource/kmfi-hrps.json"
"TJ987G","Personenauto","AUDI","A8 QUATTRO","20240929","20220908","31847","sedan","5","GRIJS","Niet geregistreerd","8","4172","1835","2380","1935",,"2350","20030605","20180820","Geen verstrekking in Open Data",,"Ja",,,,,,,"4","4",,,,,,"M1",,,"r. bodemplaat onder voorzitting","2380",,,,,,,"0.13","307","Nee","Nee",,"Nee","4730",,,"2023","Geen oordeel","05","Ja","2024-09-29T00:00:00.000","2022-09-08T00:00:00.000","2003-06-05T00:00:00.000","2018-08-20T00:00:00.000",,,,,,,,,,,,,,,,,,,,,,,,,,,,"https://opendata.rdw.nl/resource/3huj-srit.json","https://opendata.rdw.nl/resource/8ys7-d773.json","https://opendata.rdw.nl/resource/vezc-m2t6.json","https://opendata.rdw.nl/resource/jhie-znh9.json","https://opendata.rdw.nl/resource/kmfi-hrps.json"
"TT148N","Personenauto","AUDI","A8 QUATTRO","20250106","20220408","35597","sedan","5","BLAUW","Niet geregistreerd","8","4172","1860","2380","1960",,"2330","20031016","20181221","Geen verstrekking in Open Data",,"Ja",,,,,,,"4","4",,,,,,"M1",,,"op bodemplaat onder r. voorzitting","2380",,,,,,,"0.13","294","Nee","Nee",,"Nee","4710",,,"2023","Geen oordeel","05","Ja","2025-01-06T00:00:00.000","2022-04-08T00:00:00.000","2003-10-16T00:00:00.000","2018-12-21T00:00:00.000",,,,,,,,,,,,,,,,,,,,,,,,,,,,"https://opendata.rdw.nl/resource/3huj-srit.json","https://opendata.rdw.nl/resource/8ys7-d773.json","https://opendata.rdw.nl/resource/vezc-m2t6.json","https://opendata.rdw.nl/resource/jhie-znh9.json","https://opendata.rdw.nl/resource/kmfi-hrps.json"
"XR242F","Personenauto","AUDI","A8 QUATTRO","20240228","20231128","25646","sedan","5","ZWART","Niet geregistreerd","8","4172","1835","2380","1935",,"2330","20030124","20190227","Geen verstrekking in Open Data",,"Ja",,,,,,,"4","4",,,,,,"M1",,,"onder r. voorzitting","2380","4E",,,,,,"0.13","294","Nee","Nee",,"Nee","4710",,,"2023","Niet geregistreerd","NG","Ja","2024-02-28T00:00:00.000","2023-11-28T00:00:00.000","2003-01-24T00:00:00.000","2019-02-27T00:00:00.000",,,,,,,,,,,,,,,,,,,,,,,,,,,,"https://opendata.rdw.nl/resource/3huj-srit.json","https://opendata.rdw.nl/resource/8ys7-d773.json","https://opendata.rdw.nl/resource/vezc-m2t6.json","https://opendata.rdw.nl/resource/jhie-znh9.json","https://opendata.rdw.nl/resource/kmfi-hrps.json"
"XX453F","Personenauto","AUDI","A8 QUATTRO","20250417","20231122","39409","sedan","5","ZWART","Niet geregistreerd","12","5998","2033","2510","2133",,,"20040716","20190327","Geen verstrekking in Open Data",,"Nee",,,,,,,"4","4",,,,,,"M1",,,"r. bodemplaat onder voorzitting","2510",,,,,,,"0.16","295","Nee","Nee",,"Nee",,,,"2024","Geen oordeel","05","Ja","2025-04-17T00:00:00.000","2023-11-22T00:00:00.000","2004-07-16T00:00:00.000","2019-03-27T00:00:00.000",,,,,,,,,,,,,,,,,,,,,,,,,,,,"https://opendata.rdw.nl/resource/3huj-srit.json","https://opendata.rdw.nl/resource/8ys7-d773.json","https://opendata.rdw.nl/resource/vezc-m2t6.json","https://opendata.rdw.nl/resource/jhie-znh9.json","https://opendata.rdw.nl/resource/kmfi-hrps.json"
"ZT548P","Personenauto","AUDI","AUDI A8 QUATTRO","20250410","20210320","25221","sedan","5","BLAUW","Niet geregistreerd","8","4172","1936","2380","2036","750","2300","20030515","20190801","Geen verstrekking in Open Data",,"Ja",,,,,,,"4","4",,,,,,"M1",,,,"2380",,,,,,,"0.12","295","Nee","Nee",,"Nee","4710",,,"2024","Onlogisch","04","Ja","2025-04-10T00:00:00.000","2021-03-20T00:00:00.000","2003-05-15T00:00:00.000","2019-08-01T00:00:00.000",,,,,,,,,,,,,,,,,,,,,,,,,,,,"https://opendata.rdw.nl/resource/3huj-srit.json","https://opendata.rdw.nl/resource/8ys7-d773.json","https://opendata.rdw.nl/resource/vezc-m2t6.json","https://opendata.rdw.nl/resource/jhie-znh9.json","https://opendata.rdw.nl/resource/kmfi-hrps.json"
