"kenteken","voertuigsoort","merk","handelsbenaming","vervaldatum_apk","datum_tenaamstelling","bruto_bpm","inrichting","aantal_zitplaatsen","eerste_kleur","tweede_kleur","aantal_cilinders","cilinderinhoud","massa_ledig_voertuig","toegestane_maximum_massa_voertuig","massa_rijklaar","maximum_massa_trekken_ongeremd","maximum_trekken_massa_geremd","datum_eerste_toelating","datum_eerste_tenaamstelling_in_nederland","wacht_op_keuren","catalogusprijs","wam_verzekerd","maximale_constructiesnelheid","laadvermogen","oplegger_geremd","aanhangwagen_autonoom_geremd","aanhangwagen_middenas_geremd","aantal_staanplaatsen","aantal_deuren","aantal_wielen","afstand_hart_koppeling_tot_achterzijde_voertuig","afstand_voorzijde_voertuig_tot_hart_koppeling","afwijkende_maximum_snelheid","lengte","breedte","europese_voertuigcategorie","europese_voertuigcategorie_toevoeging","europese_uitvoeringcategorie_toevoeging","plaats_chassisnummer","technische_max_massa_voertuig","type","type_gasinstallatie","typegoedkeuringsnummer","variant","uitvoering","volgnummer_wijziging_eu_typegoedkeuring","vermogen_massarijklaar","wielbasis","export_indicator","openstaande_terugroepactie_indicator","vervaldatum_tachograaf","taxi_indicator","maximum_massa_samenstelling","aantal_rolstoelplaatsen","maximum_ondersteunende_snelheid","jaar_laatste_registratie_tellerstand","tellerstandoordeel","code_toelichting_tellerstandoordeel","tenaamstellen_mogelijk","vervaldatum_apk_dt","datum_tenaamstelling_dt","datum_eerste_toelating_dt","datum_eerste_tenaamstelling_in_nederland_dt","vervaldatum_tachograaf_dt","maximum_last_onder_de_vooras_sen_tezamen_koppeling","type_remsysteem_voertuig_code","rupsonderstelconfiguratiecode","wielbasis_voertuig_minimum","wielbasis_voertuig_maximum","lengte_voertuig_minimum","lengte_voertuig_maximum","breedte_voertuig_minimum","breedte_voertuig_maximum","hoogte_voertuig","hoogte_voertuig_minimum","hoogte_voertuig_maximum","massa_bedrijfsklaar_minimaal","massa_bedrijfsklaar_maximaal","technisch_toelaatbaar_massa_koppelpunt","maximum_massa_technisch_maximaal","maximum_massa_technisch_minimaal","subcategorie_nederland","verticale_belasting_koppelpunt_getrokken_voertuig","zuinigheidsclassificatie","registratie_datum_goedkeuring_afschrijvingsmoment_bpm","registratie_datum_goedkeuring_afschrijvingsmoment_bpm_dt","gem_lading_wrde","aerodyn_voorz","massa_alt_aandr","verl_cab_ind","api_gekentekende_voertuigen_assen","api_gekentekende_voertuigen_brandstof","api_gekentekende_voertuigen_carrosserie","api_gekentekende_voertuigen_carrosserie_specifiek","api_gekentekende_voertuigen_voertuigklasse"
"3ZTV14","Personenauto","ADRIA","MATRIX M 670SL","20241018","20150401","12173","kampeerwagen","5","GRIJS","Niet geregistreerd","4","2287","2857","3500","2957","750","1800","20150401","20150401","Geen verstrekking in Open Data","81443","Ja",,,,,,,"3","4","0","0",,"0","0","M1",,,"r.","4250","B",,"e1*2007/46*0766*09","8FA","M15","0","0.04","404","Nee","Nee",,"Nee","5300","0","0.00","2023","Logisch","00","Ja","2024-10-18T00:00:00.000","2015-04-01T00:00:00.000","2015-04-01T00:00:00.000","2015-04-01T00:00:00.000",,,,,,,,,,,,,,,,,,,,,,,,,,,,"https://opendata.rdw.nl/resource/3huj-srit.json","https://opendata.rdw.nl/resource/8ys7-d773.json","https://opendata.rdw.nl/resource/vezc-m2t6.json","https://opendata.rdw.nl/resource/jhie-znh9.json","https://opendata.rdw.nl/resource/kmfi-hrps.json"
"7ZLP66","Personenauto","ADRIA","MATRIX M 670SL","20250510","20211217","11369","kampeerwagen","5","WIT","Niet geregistreerd","4","2287","2873","3500","2973","750","2000","20150129","20150129","Geen verstrekking in Open Data","75649","Ja",,,,,,,"3","4","0","0",,"0","0","M1",,,"r.","3500","B",,"e1*2007/46*0766*09","8ED","M15","0","0.04","404","Nee","Nee",,"Nee","5500","0","0.00","2024","Logisch","00","Ja","2025-05-10T00:00:00.000","2021-12-17T00:00:00.000","2015-01-29T00:00:00.000","2015-01-29T00:00:00.000",,,,,,,,,,,,,,,,,,,,,,,,,,,,"https://opendata.rdw.nl/resource/3huj-srit.json","https://opendata.rdw.nl/resource/8ys7-d773.json","https://opendata.rdw.nl/resource/vezc-m2t6.json","https://opendata.rdw.nl/resource/jhie-znh9.json","https://opendata.rdw.nl/resource/kmfi-hrps.json"
"7ZNL10","Personenauto","ADRIA","MATRIX M 670SL","20250227","20150227","11827","kampeerwagen","5","GRIJS","Niet geregistreerd","4","2287","2857","3500","2957","750","1800","20150227","20150227","Geen verstrekking in Open Data","75069","Ja",,,,,,,"3","4","0","0",,"0","0","M1",,,"r.","4250","B",,"e1*2007/46*0766*09","8FA","M15","0","0.04","404","Nee","Nee",,"Nee","6050","0","0.00","2024","Logisch","00","Ja","2025-02-27T00:00:00.000","2015-02-27T00:00:00.000","2015-02-27T00:00:00.000","2015-02-27T00:00:00.000",,,,,,,,,,,,,,,,,,,,,,,,,,,,"https://opendata.rdw.nl/resource/3huj-srit.json","https://opendata.rdw.nl/resource/8ys7-d773.json","https://opendata.rdw.nl/resource/vezc-m2t6.json","https://opendata.rdw.nl/resource/jhie-znh9.json","https://opendata.rdw.nl/resource/kmfi-hrps.json"
"8ZTL59","Personenauto","ADRIA","MATRIX M 670SL","20250327","20230223","11937","kampeerwagen","5","WIT","Niet geregistreerd","4","2287","2857","3500","2957","750","1800","20150327","20150327","Geen verstrekking in Open Data","80467","Ja",,,,,,,"3","4","0","0",,"0","0","M1",,,"r.","4250","B",,"e1*2007/46*0766*09","8FA","M15","0","0.04","404","Nee","Nee",,"Nee","5300","0","0.00","2024","Logisch","00","Ja","2025-03-27T00:00:00.000","2023-02-23T00:00:00.000","2015-03-27T00:00:00.000","2015-03-27T00:00:00.000",,,,,,,,,,,,,,,,,,,,,,,,,,,,"https://opendata.rdw.nl/resource/3huj-srit.json","https://opendata.rdw.nl/resource/8ys7-d773.json","https://opendata.rdw.nl/resource/vezc-m2t6.json","https://opendata.rdw.nl/resource/jhie-znh9.json","https://opendata.rdw.nl/resource/kmfi-hrps.json"
"G140JF","Personenauto","ADRIA","MATRIX M 670SL","20250506","20191206","8440","kampeerwagen","5","WIT","Niet geregistreerd","4","2287","2873","3500","2973","750","2000","20161129","20191206","Geen verstrekking in Open Data","34654","Ja",,,,,,,"3","4","0","0",,"0","0","M1",,,"r.","3500","B",,"e1*2007/46*0766*15","8CGA","M15","0","0.03","404","Nee","Nee",,"Nee","5500","0","0.00","2024","Geen oordeel","05","Ja","2025-05-06T00:00:00.000","2019-12-06T00:00:00.000","2016-11-29T00:00:00.000","2019-12-06T00:00:00.000",,,,,,,,,,,,,,,,,,,,,,,,,,,,"https://opendata.rdw.nl/resource/3huj-srit.json","https://opendata.rdw.nl/resource/8ys7-d773.json","https://opendata.rdw.nl/resource/vezc-m2t6.json","https://opendata.rdw.nl/resource/jhie-znh9.json","https://opendata.rdw.nl/resource/kmfi-hrps.json"
"G147HP","Personenauto","ADRIA","MATRIX M 670SL","20250116","20240322","12429","kampeerwagen","5","GRIJS","Niet geregistreerd","4","2287","2873","3500","2973","750","1950","20180116","20190925","Geen verstrekking in Open Data","51445","Ja","145",,,,,,"3","4",,,,,,"M1",,,"r. voorwielscherm","3650","B",,,,,,"0.04","404","Nee","Nee",,"Nee","5450",,,"2024","Geen oordeel","05","Ja","2025-01-16T00:00:00.000","2024-03-22T00:00:00.000","2018-01-16T00:00:00.000","2019-09-25T00:00:00.000",,,,,,,,,,,,,,,,,,,,,,,,,,,,"https://opendata.rdw.nl/resource/3huj-srit.json","https://opendata.rdw.nl/resource/8ys7-d773.json","https://opendata.rdw.nl/resource/vezc-m2t6.json","https://opendata.rdw.nl/resource/jhie-znh9.json","https://opendata.rdw.nl/resource/kmfi-hrps.json"
"G272LP","Personenauto","ADRIA","MATRIX M 670SL","20250507","20240515","12088","kampeerwagen","5","WIT","Niet geregistreerd","4","2287","2899","3500","2999","750","2000","20191031","20191031","Geen verstrekking in Open Data","81193","Ja","140",,,,,,"3","4",,,,"738","230","M1",,,,"3500","B",,"e1*2007/46*0766*19","8DRA","M15","0","0.03","404","Nee","Nee",,"Nee","5500",,,"2024","Logisch","00","Ja","2025-05-07T00:00:00.000","2024-05-15T00:00:00.000","2019-10-31T00:00:00.000","2019-10-31T00:00:00.000",,,,,,,,,,,"283",,,,,,,,,,,,,,,,,"https://opendata.rdw.nl/resource/3huj-srit.json","https://opendata.rdw.nl/resource/8ys7-d773.json","https://opendata.rdw.nl/resource/vezc-m2t6.json","https://opendata.rdw.nl/resource/jhie-znh9.json","https://opendata.rdw.nl/resource/kmfi-hrps.json"
"G304TZ","Personenauto","ADRIA","MATRIX M 670SL","20241116","20191211","11771","kampeerwagen","5","WIT","Niet geregistreerd","4","2287","2873","3500","2973","750","2000","20160503","20191211","Geen verstrekking in Open Data","48676","Ja","140",,,,,,"3","4","0","0",,"0","0","M1",,,"r.","3500","B",,"e1*2007/46*0766*14","8CD","M15","0","0.03","404","Nee","Nee",,"Nee","5500","0","0.00","2024","Geen oordeel","05","Ja","2024-11-16T00:00:00.000","2019-12-11T00:00:00.000","2016-05-03T00:00:00.000","2019-12-11T00:00:00.000",,,,,,,,,,,,,,,,,,,,,,,,,,,,"https://opendata.rdw.nl/resource/3huj-srit.json","https://opendata.rdw.nl/resource/8ys7-d773.json","https://opendata.rdw.nl/resource/vezc-m2t6.json","https://opendata.rdw.nl/resource/jhie-znh9.json","https://opendata.rdw.nl/resource/kmfi-hrps.json"
"G480HJ","Personenauto","ADRIA","MATRIX M 670SL","20250518","20210816","11545","kampeerwagen","5","GRIJS","Niet geregistreerd","4","2287","2923","3500","3023","750","1750","20170518","20190924","Geen verstrekking in Open Data","47724","Ja","145",,,,,,"3","4","0","0",,"0","0","M1",,,"r.","4400","B",,"e1*2007/46*0766*15","8FAA","M15","0","0.04","404","Nee","Nee",,"Nee","5250","0","0.00","2024","Geen oordeel","05","Ja","2025-05-18T00:00:00.000","2021-08-16T00:00:00.000","2017-05-18T00:00:00.000","2019-09-24T00:00:00.000",,,,,,,,,,,,,,,,,,,,,,,,,,,,"https://opendata.rdw.nl/resource/3huj-srit.json","https://opendata.rdw.nl/resource/8ys7-d773.json","https://opendata.rdw.nl/resource/vezc-m2t6.json","https://opendata.rdw.nl/resource/jhie-znh9.json","https://opendata.rdw.nl/resource/kmfi-hrps.json"
"G530LK","Personenauto","ADRIA","MATRIX M 670SL","20241030","20191106","10508","kampeerwagen","5","WIT","Niet geregistreerd","4","2287","2873","3500","2973","750","2000","20161011","20191106","Geen verstrekking in Open Data","47160","Ja","140",,,,,,"3","4","0","0",,"0","0","M1",,,"r.","3500","B",,"e1*2007/46*0766*14","8CD","M15","0","0.03","404","Nee","Nee",,"Nee","5500","0","0.00","2023","Geen oordeel","05","Ja","2024-10-30T00:00:00.000","2019-11-06T00:00:00.000","2016-10-11T00:00:00.000","2019-11-06T00:00:00.000",,,,,,,,,,,,,,,,,,,,,,,,,,,,"https://opendata.rdw.nl/resource/3huj-srit.json","https://opendata.rdw.nl/resource/8ys7-d773.json","https://opendata.rdw.nl/resource/vezc-m2t6.json","https://opendata.rdw.nl/resource/jhie-znh9.json","https://opendata.rdw.nl/resource/kmfi-hrps.json"
"G555XP","Personenauto","ADRIA","MATRIX M 670SL","20250403","20200103","11432","kampeerwagen","5","WIT","Niet geregistreerd","4","1997","3007","3850","3107","750","2000","20180403","20200103","Geen verstrekking in Open Data","47248","Ja","140",,,,,,"3","4",,,,,,"M1",,,"r.","3850","N",,,,,,"0.03","404","Nee","Nee",,"Nee","5500",,,"2024","Geen oordeel","05","Ja","2025-04-03T00:00:00.000","2020-01-03T00:00:00.000","2018-04-03T00:00:00.000","2020-01-03T00:00:00.000",,,,,,,,,,,,,,,,,,,,,,,,,,,,"https://opendata.rdw.nl/resource/3huj-srit.json","https://opendata.rdw.nl/resource/8ys7-d773.json","https://opendata.rdw.nl/resource/vezc-m2t6.json","https://opendata.rdw.nl/resource/jhie-znh9.json","https://opendata.rdw.nl/resource/kmfi-hrps.json"
"G800HN","Personenauto","ADRIA","MATRIX M 670SL","20250403","20220621","8440","kampeerwagen","5","WIT","Niet geregistreerd","4","2287","2873","3500","2973","750","2000","20160304","20191001","Geen verstrekking in Open Data","34654","Ja","140",,,,,,"3","4","0","0",,"0","0","M1",,,"r.","3500","B",,"e1*2007/46*0766*13","8CD","M15","0","0.03","404","Nee","Nee",,"Nee","5500","0","0.00","2024","Geen oordeel","05","Ja","2025-04-03T00:00:00.000","2022-06-21T00:00:00.000","2016-03-04T00:00:00.000","2019-10-01T00:00:00.000",,,,,,,,,,,,,,,,,,,,,,,,,,,,"https://opendata.rdw.nl/resource/3huj-srit.json","https://opendata.rdw.nl/resource/8ys7-d773.json","https://opendata.rdw.nl/resource/vezc-m2t6.json","https://opendata.rdw.nl/resource/jhie-znh9.json","https://opendata.rdw.nl/resource/kmfi-hrps.json"
"G896FD","Personenauto","ADRIA","MATRIX M 670SL","20240531","20191007","7030","kampeerwagen","5","GRIJS","Niet geregistreerd","4","2287","2873","3500","2973","750","2000","20160525","20191007","Geen verstrekking in Open Data","28719","Ja","140",,,,,,"3","4","0","0",,"0","0","M1",,,"r.","3500","B",,"e1*2007/46*0766*14","8CD","M15","0","0.03","404","Nee","Nee",,"Nee","5500","0","0.00","2023","Geen oordeel","05","Ja","2024-05-31T00:00:00.000","2019-10-07T00:00:00.000","2016-05-25T00:00:00.000","2019-10-07T00:00:00.000",,,,,,,,,,,,,,,,,,,,,,,,,,,,"https://opendata.rdw.nl/resource/3huj-srit.json","https://opendata.rdw.nl/resource/8ys7-d773.json","https://opendata.rdw.nl/resource/vezc-m2t6.json","https://opendata.rdw.nl/resource/jhie-znh9.json","https://opendata.rdw.nl/resource/kmfi-hrps.json"
"G949DS","Personenauto","ADRIA","MATRIX M 670SL","20250422","20190905","6995","kampeerwagen","5","GRIJS","Niet geregistreerd","4","2287","2873","3500","2973","750","2000","20150924","20190905","Geen verstrekking in Open Data","27926","Ja","145",,,,,,"3","4","0","0",,"0","0","M1",,,"r.","3500","B",,"e1*2007/46*0766*12","8ED","M15","0","0.04","404","Nee","Nee",,"Nee","5500","0","0.00","2024","Geen oordeel","05","Ja","2025-04-22T00:00:00.000","2019-09-05T00:00:00.000","2015-09-24T00:00:00.000","2019-09-05T00:00:00.000",,,,,,,,,,,,,,,,,,,,,,,,,,,,"https://opendata.rdw.nl/resource/3huj-srit.json","https://opendata.rdw.nl/resource/8ys7-d773.json","https://opendata.rdw.nl/resource/vezc-m2t6.json","https://opendata.rdw.nl/resource/jhie-znh9.json","https://opendata.rdw.nl/resource/kmfi-hrps.json"
"GB322K","Personenauto","ADRIA","MATRIX M 670SLT","20240710","20200701","12539","kampeerwagen","5","GRIJS","Niet geregistreerd","4","2287","2877","3500","2977","750","1800","20150403","20150403","Geen verstrekking in Open Data","87780","Ja",,,,,,,"3","4","0","0",,"0","0","M1",,,"r.","4250","B",,"e1*2007/46*0766*09","8FA","M55","0","0.04","404","Nee","Nee",,"Nee","5300","0","0.00","2023","Logisch","00","Ja","2024-07-10T00:00:00.000","2020-07-01T00:00:00.000","2015-04-03T00:00:00.000","2015-04-03T00:00:00.000",,,,,,,,,,,,,,,,,,,,,,,,,,,,"https://opendata.rdw.nl/resource/3huj-srit.json","https://opendata.rdw.nl/resource/8ys7-d773.json","https://opendata.rdw.nl/resource/vezc-m2t6.json","https://opendata.rdw.nl/resource/jhie-znh9.json","https://opendata.rdw.nl/resource/kmfi-hrps.json"
"GB353L","Personenauto","ADRIA","MATRIX M 670SL","20250512","20200512","21802","kampeerwagen","5","GRIJS","Niet geregistreerd","4","2287","2873","3500","2973","750","2000","20150414","20150414","Geen verstrekking in Open Data","90901","Ja",,,,,,,"3","4","0","0",,"0","0","M1",,,"r.","3500","B",,"e1*2007/46*0766*09","8CC","M15","0","0.03","404","Nee","Nee",,"Nee","5500","0","0.00","2024","Geen oordeel","05","Ja","2025-05-12T00:00:00.000","2020-05-12T00:00:00.000","2015-04-14T00:00:00.000","2015-04-14T00:00:00.000",,,,,,,,,,,,,,,,,,,,,,,,,,,,"https://opendata.rdw.nl/resource/3huj-srit.json","https://opendata.rdw.nl/resource/8ys7-d773.json","https://opendata.rdw.nl/resource/vezc-m2t6.json","https://opendata.rdw.nl/resource/jhie-znh9.json","https://opendata.rdw.nl/resource/kmfi-hrps.json"
"GB677S","Personenauto","ADRIA","MATRIX M 670SL","20250220","20171214","12383","kampeerwagen","5","GRIJS","Niet geregistreerd","4","2287","2857","3500","2957","750","1800","20150410","20150410","Geen verstrekking in Open Data","85858","Ja",,,,,,,"3","4","0","0",,"0","0","M1",,,"r.","4250","B",,"e1*2007/46*0766*09","8FA","M15","0","0.04","404","Nee","Nee",,"Nee","5300","0","0.00","2024","Logisch","00","Ja","2025-02-20T00:00:00.000","2017-12-14T00:00:00.000","2015-04-10T00:00:00.000","2015-04-10T00:00:00.000",,,,,,,,,,,,,,,,,,,,,,,,,,,,"https://opendata.rdw.nl/resource/3huj-srit.json","https://opendata.rdw.nl/resource/8ys7-d773.json","https://opendata.rdw.nl/resource/vezc-m2t6.json","https://opendata.rdw.nl/resource/jhie-znh9.json","https://opendata.rdw.nl/resource/kmfi-hrps.json"
"GB678S","Personenauto","ADRIA","MATRIX M 670SL","20250413","20201114","12383","kampeerwagen","5","GRIJS","Niet geregistreerd","4","2287","2857","3500","2957","750","1800","20150410","20150410","Geen verstrekking in Open Data","85858","Ja",,,,,,,"3","4","0","0",,"0","0","M1",,,"r.","4250","B",,"e1*2007/46*0766*09","8FA","M15","0","0.04","404","Nee","Nee",,"Nee","5300","0","0.00","2024","Logisch","00","Ja","2025-04-13T00:00:00.000","2020-11-14T00:00:00.000","2015-04-10T00:00:00.000","2015-04-10T00:00:00.000",,,,,,,,,,,,,,,,,,,,,,,,,,,,"https://opendata.rdw.nl/resource/3huj-srit.json","https://opendata.rdw.nl/resource/8ys7-d773.json","https://opendata.rdw.nl/resource/vezc-m2t6.json","https://opendata.rdw.nl/resource/jhie-znh9.json","https://opendata.rdw.nl/resource/kmfi-hrps.json"
"GB937S","Personenauto","ADRIA","MATRIX M 670SL","20250518","20150411","11255","kampeerwagen","5","GRIJS","Niet geregistreerd","4","2287","2873","3500","2973","750","2000","20150411","20150411","Geen verstrekking in Open Data","78030","Ja",,,,,,,"3","4","0","0",,"0","0","M1",,,"r.","3500","B",,"e1*2007/46*0766*09","8CD","M15","0","0.03","404","Nee","Ja",,"Nee","5500","0","0.00","2024","Logisch","00","Ja","2025-05-18T00:00:00.000","2015-04-11T00:00:00.000","2015-04-11T00:00:00.000","2015-04-11T00:00:00.000",,,,,,,,,,,,,,,,,,,,,,,,,,,,"https://opendata.rdw.nl/resource/3huj-srit.json","https://opendata.rdw.nl/resource/8ys7-d773.json","https://opendata.rdw.nl/resource/vezc-m2t6.json","https://opendata.rdw.nl/resource/jhie-znh9.json","https://opendata.rdw.nl/resource/kmfi-hrps.json"
"GB955J","Personenauto","ADRIA","MATRIX M 670SL","20250421","20180330","12485","kampeerwagen","5","GRIJS","Niet geregistreerd","4","2287","2857","3500","2957","750","1800","20150420","20150420","Geen verstrekking in Open Data","84011","Ja",,,,,,,"3","4","0","0",,"0","0","M1",,,"r.","4250","B",,"e1*2007/46*0766*09","8FA","M15","0","0.04","404","Nee","Nee",,"Nee","5300","0","0.00","2024","Logisch","00","Ja","2025-04-21T00:00:00.000","2018-03-30T00:00:00.000","2015-04-20T00:00:00.000","2015-04-20T00:00:00.000",,,,,,,,,,,,,,,,,,,,,,,,,,,,"https://opendata.rdw.nl/resource/3huj-srit.json","https://opendata.rdw.nl/resource/8ys7-d773.json","https://opendata.rdw.nl/resource/vezc-m2t6.json","https://opendata.rdw.nl/resource/jhie-znh9.json","https://opendata.rdw.nl/resource/kmfi-hrps.json"
"GB964T","Personenauto","ADRIA","MATRIX M 670SL","20250412","20150415","12010","kampeerwagen","5","WIT","Niet geregistreerd","4","2287","2857","4250","2957","750","1800","20150415","20150415","Geen verstrekking in Open Data","84145","Ja",,,,,,,"3","4","0","0",,"0","0","M1",,,"r.","4250","B",,"e1*2007/46*0766*09","8FA","M15","0","0.04","404","Nee","Nee",,"Nee","6050","0","0.00","2024","Logisch","00","Ja","2025-04-12T00:00:00.000","2015-04-15T00:00:00.000","2015-04-15T00:00:00.000","2015-04-15T00:00:00.000",,,,,,,,,,,,,,,,,,,,,,,,,,,,"https://opendata.rdw.nl/resource/3huj-srit.json","https://opendata.rdw.nl/resource/8ys7-d773.json","https://opendata.rdw.nl/resource/vezc-m2t6.json","https://opendata.rdw.nl/resource/jhie-znh9.json","https://opendata.rdw.nl/resource/kmfi-hrps.json"
"GB971T","Personenauto","ADRIA","MATRIX M 670SL","20250428","20150421","12427","kampeerwagen","5","GRIJS","Niet geregistreerd","4","2287","2857","4250","2957","750","1800","20150421","20150421","Geen verstrekking in Open Data","87170","Ja",,,,,,,"3","4","0","0",,"0","0","M1",,,"r.","4250","B",,"e1*2007/46*0766*09","8FA","M15","0","0.04","404","Nee","Ja",,"Nee","6050","0","0.00","2024","Logisch","00","Ja","2025-04-28T00:00:00.000","2015-04-21T00:00:00.000","2015-04-21T00:00:00.000","2015-04-21T00:00:00.000",,,,,,,,,,,,,,,,,,,,,,,,,,,,"https://opendata.rdw.nl/resource/3huj-srit.json","https://opendata.rdw.nl/resource/8ys7-d773.json","https://opendata.rdw.nl/resource/vezc-m2t6.json","https://opendata.rdw.nl/resource/jhie-znh9.json","https://opendata.rdw.nl/resource/kmfi-hrps.json"
"GB975F","Personenauto","ADRIA","MATRIX M 670SL","20250402","20170414","12206","kampeerwagen","5","GRIJS","Niet geregistreerd","4","2287","2857","3500","2957","750","1800","20150402","20150402","Geen verstrekking in Open Data","84805","Ja",,,,,,,"3","4","0","0",,"0","0","M1",,,"r.","4250","B",,"e1*2007/46*0766*09","8FA","M15","0","0.04","404","Nee","Nee",,"Nee","5300","0","0.00","2024","Logisch","00","Ja","2025-04-02T00:00:00.000","2017-04-14T00:00:00.000","2015-04-02T00:00:00.000","2015-04-02T00:00:00.000",,,,,,,,,,,,,,,,,,,,,,,,,,,,"https://opendata.rdw.nl/resource/3huj-srit.json","https://opendata.rdw.nl/resource/8ys7-d773.json","https://opendata.rdw.nl/resource/vezc-m2t6.json","https://opendata.rdw.nl/resource/jhie-znh9.json","https://opendata.rdw.nl/resource/kmfi-hrps.json"
"GD223L","Personenauto","ADRIA","MATRIX M 670SL","20240529","20210514","11980","kampeerwagen","5","GRIJS","Niet geregistreerd","4","2287","2847","3500","2947","750","1800","20150528","20150528","Geen verstrekking in Open Data","83305","Ja",,,,,,,"3","4","0","0",,"0","0","M1",,,"r.","4250","B",,"e1*2007/46*0766*09","8EA","M15","0","0.04","404","Nee","Nee",,"Nee","5300","0","0.00","2023","Logisch","00","Ja","2024-05-29T00:00:00.000","2021-05-14T00:00:00.000","2015-05-28T00:00:00.000","2015-05-28T00:00:00.000",,,,,,,,,,,,,,,,,,,,,,,,,,,,"https://opendata.rdw.nl/resource/3huj-srit.json","https://opendata.rdw.nl/resource/8ys7-d773.json","https://opendata.rdw.nl/resource/vezc-m2t6.json","https://opendata.rdw.nl/resource/jhie-znh9.json","https://opendata.rdw.nl/resource/kmfi-hrps.json"
"GD226L","Personenauto","ADRIA","MATRIX M 670SL","20250624","20200626","11207","kampeerwagen","5","GRIJS","Niet geregistreerd","4","2287","2873","3500","2973","750","2000","20150420","20150420","Geen verstrekking in Open Data","71371","Ja",,,,,,,"3","4","0","0",,"0","0","M1",,,"r.","3500","B",,"e1*2007/46*0766*09","8CD","M15","0","0.03","404","Nee","Nee",,"Nee","5500","0","0.00","2024","Logisch","00","Ja","2025-06-24T00:00:00.000","2020-06-26T00:00:00.000","2015-04-20T00:00:00.000","2015-04-20T00:00:00.000",,,,,,,,,,,,,,,,,,,,,,,,,,,,"https://opendata.rdw.nl/resource/3huj-srit.json","https://opendata.rdw.nl/resource/8ys7-d773.json","https://opendata.rdw.nl/resource/vezc-m2t6.json","https://opendata.rdw.nl/resource/jhie-znh9.json","https://opendata.rdw.nl/resource/kmfi-hrps.json"
"GD559X","Personenauto","ADRIA","MATRIX M 670SL","20250428","20200516","10438","kampeerwagen","5","GRIJS","Niet geregistreerd","4","2287","2873","3500","2973","750","1950","20150428","20150428","Geen verstrekking in Open Data","70237","Ja",,,,,,,"3","4","0","0",,"0","0","M1",,,"r.","3650","B",,"e1*2007/46*0766*09","8CC","M15","0","0.03","404","Nee","Nee",,"Nee","5450","0","0.00","2024","Logisch","00","Ja","2025-04-28T00:00:00.000","2020-05-16T00:00:00.000","2015-04-28T00:00:00.000","2015-04-28T00:00:00.000",,,,,,,,,,,,,,,,,,,,,,,,,,,,"https://opendata.rdw.nl/resource/3huj-srit.json","https://opendata.rdw.nl/resource/8ys7-d773.json","https://opendata.rdw.nl/resource/vezc-m2t6.json","https://opendata.rdw.nl/resource/jhie-znh9.json","https://opendata.rdw.nl/resource/kmfi-hrps.json"
"GD772R","Personenauto","ADRIA","MATRIX M 670SL","20240912","20240514","12302","kampeerwagen","5","GRIJS","Niet geregistreerd","4","2287","2857","3500","2957","750","1800","20150422","20150422","Geen verstrekking in Open Data","85807","Ja",,,,,,,"3","4","0","0",,"0","0","M1",,,"r.","4250","B",,"e1*2007/46*0766*09","8FA","M15","0","0.04","404","Nee","Nee",,"Nee","5300","0","0.00","2023","Logisch","00","Ja","2024-09-12T00:00:00.000","2024-05-14T00:00:00.000","2015-04-22T00:00:00.000","2015-04-22T00:00:00.000",,,,,,,,,,,,,,,,,,,,,,,,,,,,"https://opendata.rdw.nl/resource/3huj-srit.json","https://opendata.rdw.nl/resource/8ys7-d773.json","https://opendata.rdw.nl/resource/vezc-m2t6.json","https://opendata.rdw.nl/resource/jhie-znh9.json","https://opendata.rdw.nl/resource/kmfi-hrps.json"