"kenteken","voertuigsoort","merk","handelsbenaming","vervaldatum_apk","datum_tenaamstelling","bruto_bpm","inrichting","aantal_zitplaatsen","eerste_kleur","tweede_kleur","aantal_cilinders","cilinderinhoud","massa_ledig_voertuig","toegestane_maximum_massa_voertuig","massa_rijklaar","maximum_massa_trekken_ongeremd","maximum_trekken_massa_geremd","datum_eerste_toelating","datum_eerste_tenaamstelling_in_nederland","wacht_op_keuren","catalogusprijs","wam_verzekerd","maximale_constructiesnelheid","laadvermogen","oplegger_geremd","aanhangwagen_autonoom_geremd","aanhangwagen_middenas_geremd","aantal_staanplaatsen","aantal_deuren","aantal_wielen","afstand_hart_koppeling_tot_achterzijde_voertuig","afstand_voorzijde_voertuig_tot_hart_koppeling","afwijkende_maximum_snelheid","lengte","breedte","europese_voertuigcategorie","europese_voertuigcategorie_toevoeging","europese_uitvoeringcategorie_toevoeging","plaats_chassisnummer","technische_max_massa_voertuig","type","type_gasinstallatie","typegoedkeuringsnummer","variant","uitvoering","volgnummer_wijziging_eu_typegoedkeuring","vermogen_massarijklaar","wielbasis","export_indicator","openstaande_terugroepactie_indicator","vervaldatum_tachograaf","taxi_indicator","maximum_massa_samenstelling","aantal_rolstoelplaatsen","maximum_ondersteunende_snelheid","jaar_laatste_registratie_tellerstand","tellerstandoordeel","code_toelichting_tellerstandoordeel","tenaamstellen_mogelijk","vervaldatum_apk_dt","datum_tenaamstelling_dt","datum_eerste_toelating_dt","datum_eerste_tenaamstelling_in_nederland_dt","vervaldatum_tachograaf_dt","maximum_last_onder_de_vooras_sen_tezamen_koppeling","type_remsysteem_voertuig_code","rupsonderstelconfiguratiecode","wielbasis_voertuig_minimum","wielbasis_voertuig_maximum","lengte_voertuig_minimum","lengte_voertuig_maximum","breedte_voertuig_minimum","breedte_voertuig_maximum","hoogte_voertuig","hoogte_voertuig_minimum","hoogte_voertuig_maximum","massa_bedrijfsklaar_minimaal","massa_bedrijfsklaar_maximaal","technisch_toelaatbaar_massa_koppelpunt","maximum_massa_technisch_maximaal","maximum_massa_technisch_minimaal","subcategorie_nederland","verticale_belasting_koppelpunt_getrokken_voertuig","zuinigheidsclassificatie","registratie_datum_goedkeuring_afschrijvingsmoment_bpm","registratie_datum_goedkeuring_afschrijvingsmoment_bpm_dt","gem_lading_wrde","aerodyn_voorz","massa_alt_aandr","verl_cab_ind","api_gekentekende_voertuigen_assen","api_gekentekende_voertuigen_brandstof","api_gekentekende_voertuigen_carrosserie","api_gekentekende_voertuigen_carrosserie_specifiek","api_gekentekende_voertuigen_voertuigklasse"
"G185LB","Personenauto","VOLVO","XC60 T8 TWIN ENGINE","20251026",,"2731","stationwagen","5","GRIJS","Niet geregistreerd","4","1969","2061","2660","2161","750","2100","20191026","20191026","Geen verstrekking in Open Data","77979","Ja","230",,,,,,"5","4","0","0",,"469","190","M1",,,,"2660","U",,"e4*2007/46*1220*06","UZBM","UZBMUD0?","0","0.01","287","Ja","Nee",,"Nee","4760","0","0.00","2023","Logisch","00","Nee","2025-10-26T00:00:00.000",,"2019-10-26T00:00:00.000","2019-10-26T00:00:00.000",,,,,,,,,,,"164",,,,,,,,,,"A",,,,,,,"https://opendata.rdw.nl/resource/3huj-srit.json","https://opendata.rdw.nl/resource/8ys7-d773.json","https://opendata.rdw.nl/resource/vezc-m2t6.json","https://opendata.rdw.nl/resource/jhie-znh9.json","https://opendata.rdw.nl/resource/kmfi-hrps.json"
"G651GD","Personenauto","VOLVO","XC60 T8 TWIN ENGINE","20250920","20240131","2166","stationwagen","5","WIT","Niet geregistreerd","4","1969","2061","2660","2161","750","2100","20190920","20190920","Geen verstrekking in Open Data","72915","Ja","230",,,,,,"5","4","0","0",,"469","190","M1",,,,"2660","U",,"e4*2007/46*1220*06","UZBM","UZBMVD0?","0","0.01","287","Ja","Nee",,"Nee","4760","0","0.00","2024","Logisch","00","Nee","2025-09-20T00:00:00.000","2024-01-31T00:00:00.000","2019-09-20T00:00:00.000","2019-09-20T00:00:00.000",,,,,,,,,,,"164",,,,,,,,,,"A",,,,,,,"https://opendata.rdw.nl/resource/3huj-srit.json","https://opendata.rdw.nl/resource/8ys7-d773.json","https://opendata.rdw.nl/resource/vezc-m2t6.json","https://opendata.rdw.nl/resource/jhie-znh9.json","https://opendata.rdw.nl/resource/kmfi-hrps.json"
"G664DB","Personenauto","VOLVO","XC60 T8 TWIN ENGINE","20251027",,"3612","stationwagen","5","WIT","Niet geregistreerd","4","1969","2061","2660","2161","750","2100","20191008","20191008","Geen verstrekking in Open Data","95236","Nee","230",,,,,,"5","4","0","0",,"469","194","M1",,,,"2660","U",,"e4*2007/46*1220*05","UZBM","UZBMTD0?","0","0.10","287","Ja","Ja",,"Nee","4760","0","0.00","2023","Logisch","00","Nee","2025-10-27T00:00:00.000",,"2019-10-08T00:00:00.000","2019-10-08T00:00:00.000",,,,,,,,,,,"164",,,,,,,,,,"A",,,,,,,"https://opendata.rdw.nl/resource/3huj-srit.json","https://opendata.rdw.nl/resource/8ys7-d773.json","https://opendata.rdw.nl/resource/vezc-m2t6.json","https://opendata.rdw.nl/resource/jhie-znh9.json","https://opendata.rdw.nl/resource/kmfi-hrps.json"
"H134RS","Personenauto","VOLVO","XC60 T8 TWIN ENGINE",,,"2697","stationwagen","5","GRIJS","Niet geregistreerd","4","1969","2061","2660","2161","750","2100","20200423","20200423","Geen verstrekking in Open Data","92120","Nee","230",,,,,,"5","4","0","0",,"469","190","M1",,,,"2660","U",,"e4*2007/46*1220*06","UZBM","UZBMUD0?","0","0.01","287","Ja","Nee",,"Nee","4760","0","0.00","2022","Logisch","00","Nee",,,"2020-04-23T00:00:00.000","2020-04-23T00:00:00.000",,,,,,,,,,,"164",,,,,,,,,,"C",,,,,,,"https://opendata.rdw.nl/resource/3huj-srit.json","https://opendata.rdw.nl/resource/8ys7-d773.json","https://opendata.rdw.nl/resource/vezc-m2t6.json","https://opendata.rdw.nl/resource/jhie-znh9.json","https://opendata.rdw.nl/resource/kmfi-hrps.json"
"H583VP","Personenauto","VOLVO","XC60 T8 TWIN ENGINE",,,"2333","stationwagen","5","ZWART","Niet geregistreerd","4","1969","2039","2660","2139","750","2100","20180625","20200611","Geen verstrekking in Open Data","79664","Nee","230",,,,,,"5","4","0","0",,"469","0","M1",,,,"2660","U",,"e4*2007/46*1220*02","UZBM","UZBMUD??","0","0.01","287","Ja","Nee",,"Nee","4760","0","0.00","2022","Geen oordeel","05","Nee",,,"2018-06-25T00:00:00.000","2020-06-11T00:00:00.000",,,,,,,,,,,"164",,,,,,,,,,"A",,,,,,,"https://opendata.rdw.nl/resource/3huj-srit.json","https://opendata.rdw.nl/resource/8ys7-d773.json","https://opendata.rdw.nl/resource/vezc-m2t6.json","https://opendata.rdw.nl/resource/jhie-znh9.json","https://opendata.rdw.nl/resource/kmfi-hrps.json"
"K919FN","Personenauto","VOLVO","XC60 T8 TWIN ENGINE",,,"1983","stationwagen","5","ZWART","Niet geregistreerd","4","1969","2061","2660","2161","750","2100","20191126","20210305","Geen verstrekking in Open Data","77989","Nee","230",,,,,,"5","4","0","0",,"469","0","M1",,,,"2660","U",,"e4*2007/46*1220*06","UZBM","UZBMUD0?","1","0.01","287","Ja","Nee",,"Nee","4760","0","0.00","2022","Geen oordeel","05","Nee",,,"2019-11-26T00:00:00.000","2021-03-05T00:00:00.000",,,,,,,,,,,"164",,,,,,,,,,"A",,,,,,,"https://opendata.rdw.nl/resource/3huj-srit.json","https://opendata.rdw.nl/resource/8ys7-d773.json","https://opendata.rdw.nl/resource/vezc-m2t6.json","https://opendata.rdw.nl/resource/jhie-znh9.json","https://opendata.rdw.nl/resource/kmfi-hrps.json"
"L070RH","Personenauto","VOLVO","XC60 T8 TWIN ENGINE","20250412","20240117","2808","stationwagen","5","ROOD","Niet geregistreerd","4","1969","2039","2660","2139","750","2100","20190412","20210712","Geen verstrekking in Open Data","71530","Ja","230",,,,,,"5","4","0","0",,"469","0","M1",,,,"2660","U",,"e4*2007/46*1220*04","UZBM","UZBMVD0?","0","0.01","287","Ja","Nee",,"Nee","4760","0","0.00","2024","Geen oordeel","05","Nee","2025-04-12T00:00:00.000","2024-01-17T00:00:00.000","2019-04-12T00:00:00.000","2021-07-12T00:00:00.000",,,,,,,,,,,"164",,,,,,,,,,,,,,,,,"https://opendata.rdw.nl/resource/3huj-srit.json","https://opendata.rdw.nl/resource/8ys7-d773.json","https://opendata.rdw.nl/resource/vezc-m2t6.json","https://opendata.rdw.nl/resource/jhie-znh9.json","https://opendata.rdw.nl/resource/kmfi-hrps.json"
"L170ST","Personenauto","VOLVO","XC60 T8 TWIN ENGINE",,,"2522","stationwagen","5","BRUIN","Niet geregistreerd","4","1969","2061","2660","2161","750","2100","20200217","20211013","Geen verstrekking in Open Data","92647","Nee","230",,,,,,"5","4","0","0",,"469","0","M1",,,,"2660","U",,"e4*2007/46*1220*07","UZBM","UZBMTD0?","0","0.01","287","Ja","Nee",,"Nee","4760","0","0.00","2023","Geen oordeel","05","Nee",,,"2020-02-17T00:00:00.000","2021-10-13T00:00:00.000",,,,,,,,,,,"164",,,,,,,,,,,"20230320","2023-03-20T00:00:00.000",,,,,"https://opendata.rdw.nl/resource/3huj-srit.json","https://opendata.rdw.nl/resource/8ys7-d773.json","https://opendata.rdw.nl/resource/vezc-m2t6.json","https://opendata.rdw.nl/resource/jhie-znh9.json","https://opendata.rdw.nl/resource/kmfi-hrps.json"
"N135DF","Personenauto","VOLVO","XC60 T8 TWIN ENGINE",,"20240125","2808","stationwagen","5","WIT","Niet geregistreerd","4","1969","2061","2660","2161","750","2100","20200227","20211001","Geen verstrekking in Open Data","75627","Ja","230",,,,,,"5","4","0","0",,"469","0","M1",,,"r. bodemplaat by voorzitting","2660","U",,"e4*2007/46*1220*06","UZBM","UZBMTD0?","0","0.01","287","Ja","Nee",,"Nee","4760","0","0.00","2024","Geen oordeel","05","Nee",,"2024-01-25T00:00:00.000","2020-02-27T00:00:00.000","2021-10-01T00:00:00.000",,,,,,,,,,,"164",,,,,,,,,,,,,,,,,"https://opendata.rdw.nl/resource/3huj-srit.json","https://opendata.rdw.nl/resource/8ys7-d773.json","https://opendata.rdw.nl/resource/vezc-m2t6.json","https://opendata.rdw.nl/resource/jhie-znh9.json","https://opendata.rdw.nl/resource/kmfi-hrps.json"
"N521BL","Personenauto","VOLVO","XC60 T8 TWIN ENGINE","20240711",,"2888","stationwagen","5","GRIJS","Niet geregistreerd","4","1969","2039","2660","2139","750","2100","20180711","20211028","Geen verstrekking in Open Data","83470","Nee","230",,,,,,"5","4","0","0",,"469","190","M1",,,"r. bodemplaat by voorzitting","2660","U",,"e4*2007/46*1220*02","UZBM","UZBMUD??","0","0.01","287","Ja","Nee",,"Nee","4760","0","0.00","2022","Geen oordeel","05","Nee","2024-07-11T00:00:00.000",,"2018-07-11T00:00:00.000","2021-10-28T00:00:00.000",,,,,,,,,,,"164",,,,,,,,,,,,,,,,,"https://opendata.rdw.nl/resource/3huj-srit.json","https://opendata.rdw.nl/resource/8ys7-d773.json","https://opendata.rdw.nl/resource/vezc-m2t6.json","https://opendata.rdw.nl/resource/jhie-znh9.json","https://opendata.rdw.nl/resource/kmfi-hrps.json"
"N743HT","Personenauto","VOLVO","XC60 T8 TWIN ENGINE",,,"2760","stationwagen","5","GRIJS","Niet geregistreerd","4","1969","2061","2660","2161","750","2100","20200325","20211102","Geen verstrekking in Open Data","89291","Nee","230",,,,,,"5","4","0","0",,"469","0","M1",,,,"2660","U",,"e4*2007/46*1220*07","UZBM","UZBMTD0?","0","0.01","287","Ja","Nee",,"Nee","4760","0","0.00","2023","Geen oordeel","05","Nee",,,"2020-03-25T00:00:00.000","2021-11-02T00:00:00.000",,,,,,,,,,,"164",,,,,,,,,,,,,,,,,"https://opendata.rdw.nl/resource/3huj-srit.json","https://opendata.rdw.nl/resource/8ys7-d773.json","https://opendata.rdw.nl/resource/vezc-m2t6.json","https://opendata.rdw.nl/resource/jhie-znh9.json","https://opendata.rdw.nl/resource/kmfi-hrps.json"
"P415GV","Personenauto","VOLVO","XC60 T8 TWIN ENGINE","20240311",,"2223","stationwagen","5","GRIJS","Niet geregistreerd","4","1969","2018","2660","2118","750","2100","20180209","20220312","Geen verstrekking in Open Data","76801","Nee","230",,,,,,"5","4","0","0",,"469","0","M1",,,,"2660","U",,"e4*2007/46*1220*01","UZBA","UZBABD??","0","0.01","287","Ja","Nee",,"Nee","4760","0","0.00","2024","Geen oordeel","05","Nee","2024-03-11T00:00:00.000",,"2018-02-09T00:00:00.000","2022-03-12T00:00:00.000",,,,,,,,,,,"164",,,,,,,,,,,"20220304","2022-03-04T00:00:00.000",,,,,"https://opendata.rdw.nl/resource/3huj-srit.json","https://opendata.rdw.nl/resource/8ys7-d773.json","https://opendata.rdw.nl/resource/vezc-m2t6.json","https://opendata.rdw.nl/resource/jhie-znh9.json","https://opendata.rdw.nl/resource/kmfi-hrps.json"
"P870RD","Personenauto","VOLVO","XC60 T8 TWIN ENGINE","20240519",,"2135","stationwagen","5","BLAUW","Niet geregistreerd","4","1969","2039","2660","2139","750","2100","20190102","20220519","Geen verstrekking in Open Data","79395","Nee","230",,,,,,"5","4","0","0",,"469","0","M1",,,,"2660","U",,"e4*2007/46*1220*04","UZBM","UZBMVD0?","0","0.01","287","Ja","Nee",,"Nee","4760","0","0.00","2024","Geen oordeel","05","Nee","2024-05-19T00:00:00.000",,"2019-01-02T00:00:00.000","2022-05-19T00:00:00.000",,,,,,,,,,,"164",,,,,,,,,,,"20220509","2022-05-09T00:00:00.000",,,,,"https://opendata.rdw.nl/resource/3huj-srit.json","https://opendata.rdw.nl/resource/8ys7-d773.json","https://opendata.rdw.nl/resource/vezc-m2t6.json","https://opendata.rdw.nl/resource/jhie-znh9.json","https://opendata.rdw.nl/resource/kmfi-hrps.json"
"RS853G","Personenauto","VOLVO","XC60 T8 TWIN ENGINE","20240207","20180117","2223","stationwagen","5","ZWART","Niet geregistreerd","4","1969","2018","2660","2118","750","2100","20180117","20180117","Geen verstrekking in Open Data","77650","Nee",,,,,,,"5","4","0","0",,"469","192","M1",,,,"2660","U",,"e4*2007/46*1220*01","UZBA","UZBABD??","0","0.11","287","Ja","Nee",,"Nee","4760","0","0.00","2022","Logisch","00","Nee","2024-02-07T00:00:00.000","2018-01-17T00:00:00.000","2018-01-17T00:00:00.000","2018-01-17T00:00:00.000",,,,,,,,,,,"164",,,,,,,,,,"A",,,,,,,"https://opendata.rdw.nl/resource/3huj-srit.json","https://opendata.rdw.nl/resource/8ys7-d773.json","https://opendata.rdw.nl/resource/vezc-m2t6.json","https://opendata.rdw.nl/resource/jhie-znh9.json","https://opendata.rdw.nl/resource/kmfi-hrps.json"
"RV616J","Personenauto","VOLVO","XC60 T8 TWIN ENGINE","20240209",,"2223","stationwagen","5","GRIJS","Niet geregistreerd","4","1969","2018","2660","2118","750","2100","20180209","20180209","Geen verstrekking in Open Data","85734","Nee",,,,,,,"5","4","0","0",,"469","192","M1",,,,"2660","U",,"e4*2007/46*1220*01","UZBA","UZBABD??","0","0.11","287","Ja","Nee",,"Nee","4760","0","0.00","2023","Logisch","00","Nee","2024-02-09T00:00:00.000",,"2018-02-09T00:00:00.000","2018-02-09T00:00:00.000",,,,,,,,,,,"164",,,,,,,,,,"A",,,,,,,"https://opendata.rdw.nl/resource/3huj-srit.json","https://opendata.rdw.nl/resource/8ys7-d773.json","https://opendata.rdw.nl/resource/vezc-m2t6.json","https://opendata.rdw.nl/resource/jhie-znh9.json","https://opendata.rdw.nl/resource/kmfi-hrps.json"
"S237JN","Personenauto","VOLVO","XC60 T8 TWIN ENGINE","20250226",,"2598","stationwagen","5","BLAUW","Niet geregistreerd","4","1969","2039","2660","2139","750","2100","20190226","20230207","Geen verstrekking in Open Data","78290","Nee","230",,,,,,"5","4","0","0",,"469","0","M1",,,,"2660","U",,"e4*2007/46*1220*04","UZBM","UZBMUD0?","0","0.01","287","Ja","Nee",,"Nee","4760","0","0.00","2023","Niet geregistreerd","NG","Nee","2025-02-26T00:00:00.000",,"2019-02-26T00:00:00.000","2023-02-07T00:00:00.000",,,,,,,,,,,"164",,,,,,,,,,,"20230130","2023-01-30T00:00:00.000",,,,,"https://opendata.rdw.nl/resource/3huj-srit.json","https://opendata.rdw.nl/resource/8ys7-d773.json","https://opendata.rdw.nl/resource/vezc-m2t6.json","https://opendata.rdw.nl/resource/jhie-znh9.json","https://opendata.rdw.nl/resource/kmfi-hrps.json"
"SP716L","Personenauto","VOLVO","XC60 T8 TWIN ENGINE","20240519","20180519","2223","stationwagen","5","GRIJS","Niet geregistreerd","4","1969","2018","2660","2118","750","2100","20180519","20180519","Geen verstrekking in Open Data","76490","Nee",,,,,,,"5","4","0","0",,"469","190","M1",,,,"2660","U",,"e4*2007/46*1220*01","UZBA","UZBABD??","0","0.11","287","Ja","Nee",,"Nee","4760","0","0.00","2023","Logisch","00","Nee","2024-05-19T00:00:00.000","2018-05-19T00:00:00.000","2018-05-19T00:00:00.000","2018-05-19T00:00:00.000",,,,,,,,,,,"164",,,,,,,,,,"A",,,,,,,"https://opendata.rdw.nl/resource/3huj-srit.json","https://opendata.rdw.nl/resource/8ys7-d773.json","https://opendata.rdw.nl/resource/vezc-m2t6.json","https://opendata.rdw.nl/resource/jhie-znh9.json","https://opendata.rdw.nl/resource/kmfi-hrps.json"
"SV797K","Personenauto","VOLVO","XC60 T8 TWIN ENGINE","20240614","20240301","2888","stationwagen","5","GRIJS","Niet geregistreerd","4","1969","2039","2660","2139","750","2100","20180614","20180614","Geen verstrekking in Open Data","82059","Ja",,,,,,,"5","4","0","0",,"469","190","M1",,,,"2660","U",,"e4*2007/46*1220*02","UZBM","UZBMUD??","0","0.10","287","Ja","Nee",,"Nee","4760","0","0.00","2024","Logisch","00","Nee","2024-06-14T00:00:00.000","2024-03-01T00:00:00.000","2018-06-14T00:00:00.000","2018-06-14T00:00:00.000",,,,,,,,,,,"164",,,,,,,,,,"A",,,,,,,"https://opendata.rdw.nl/resource/3huj-srit.json","https://opendata.rdw.nl/resource/8ys7-d773.json","https://opendata.rdw.nl/resource/vezc-m2t6.json","https://opendata.rdw.nl/resource/jhie-znh9.json","https://opendata.rdw.nl/resource/kmfi-hrps.json"
"SZ951K","Personenauto","VOLVO","XC60 T8 TWIN ENGINE","20240627",,"2888","stationwagen","5","WIT","Niet geregistreerd","4","1969","2039","2660","2139","750","2100","20180627","20180627","Geen verstrekking in Open Data","80854","Nee",,,,,,,"5","4","0","0",,"469","190","M1",,,,"2660","U",,"e4*2007/46*1220*02","UZBM","UZBMUD??","0","0.10","287","Ja","Nee",,"Nee","4760","0","0.00","2023","Logisch","00","Nee","2024-06-27T00:00:00.000",,"2018-06-27T00:00:00.000","2018-06-27T00:00:00.000",,,,,,,,,,,"164",,,,,,,,,,"A",,,,,,,"https://opendata.rdw.nl/resource/3huj-srit.json","https://opendata.rdw.nl/resource/8ys7-d773.json","https://opendata.rdw.nl/resource/vezc-m2t6.json","https://opendata.rdw.nl/resource/jhie-znh9.json","https://opendata.rdw.nl/resource/kmfi-hrps.json"
"T431ZZ","Personenauto","VOLVO","XC60 T8 TWIN ENGINE",,,"1394","stationwagen","5","BLAUW","Niet geregistreerd","4","1969","2039","2660","2139","750","2100","20190222","20231227","Geen verstrekking in Open Data","73409","Nee","230",,,,,,"5","4","0","0",,"469","0","M1",,,,"2660","U",,"e4*2007/46*1220*04","UZBM","UZBMUD0?","0","0.01","287","Ja","Nee",,"Nee","4760","0","0.00","2024","Geen oordeel","05","Nee",,,"2019-02-22T00:00:00.000","2023-12-27T00:00:00.000",,,,,,,,,,,"164",,,,,,,,,,,"20230928","2023-09-28T00:00:00.000",,,,,"https://opendata.rdw.nl/resource/3huj-srit.json","https://opendata.rdw.nl/resource/8ys7-d773.json","https://opendata.rdw.nl/resource/vezc-m2t6.json","https://opendata.rdw.nl/resource/jhie-znh9.json","https://opendata.rdw.nl/resource/kmfi-hrps.json"
"TB087L","Personenauto","VOLVO","XC60 T8 TWIN ENGINE","20240704",,"2888","stationwagen","5","ZWART","Niet geregistreerd","4","1969","2039","2660","2139","750","2100","20180704","20180704","Geen verstrekking in Open Data","79114","Nee",,,,,,,"5","4","0","0",,"469","190","M1",,,,"2660","U",,"e4*2007/46*1220*02","UZBM","UZBMUD??","0","0.10","287","Ja","Nee",,"Nee","4760","0","0.00","2023","Logisch","00","Nee","2024-07-04T00:00:00.000",,"2018-07-04T00:00:00.000","2018-07-04T00:00:00.000",,,,,,,,,,,"164",,,,,,,,,,"A",,,,,,,"https://opendata.rdw.nl/resource/3huj-srit.json","https://opendata.rdw.nl/resource/8ys7-d773.json","https://opendata.rdw.nl/resource/vezc-m2t6.json","https://opendata.rdw.nl/resource/jhie-znh9.json","https://opendata.rdw.nl/resource/kmfi-hrps.json"
"TR424F","Personenauto","VOLVO","XC60 T8 TWIN ENGINE","20251011",,"1854","stationwagen","5","WIT","Niet geregistreerd","4","1969","2015","2700","2115","750","2100","20171011","20191127","Geen verstrekking in Open Data","78345","Nee",,,,,,,"5","4","0","0",,"469","0","M1",,,,"2700","U",,"e4*2007/46*1220*00","UZBA","UZBABD??","0","0.01","287","Ja","Ja",,"Nee","4800","0","0.00","2024","Geen oordeel","05","Nee","2025-10-11T00:00:00.000",,"2017-10-11T00:00:00.000","2019-11-27T00:00:00.000",,,,,,,,,,,,,,,,,,,,,"A",,,,,,,"https://opendata.rdw.nl/resource/3huj-srit.json","https://opendata.rdw.nl/resource/8ys7-d773.json","https://opendata.rdw.nl/resource/vezc-m2t6.json","https://opendata.rdw.nl/resource/jhie-znh9.json","https://opendata.rdw.nl/resource/kmfi-hrps.json"
"TR963S","Personenauto","VOLVO","XC60 T8 TWIN ENGINE","20241005",,"2310","stationwagen","5","GRIJS","Niet geregistreerd","4","1969","2039","2660","2139","750","2100","20181005","20181005","Geen verstrekking in Open Data","73475","Nee",,,,,,,"5","4","0","0",,"469","190","M1",,,,"2660","U",,"e4*2007/46*1220*03","UZBM","UZBMVD0?","0","0.10","287","Ja","Nee",,"Nee","4760","0","0.00","2022","Logisch","00","Nee","2024-10-05T00:00:00.000",,"2018-10-05T00:00:00.000","2018-10-05T00:00:00.000",,,,,,,,,,,"164",,,,,,,,,,"A",,,,,,,"https://opendata.rdw.nl/resource/3huj-srit.json","https://opendata.rdw.nl/resource/8ys7-d773.json","https://opendata.rdw.nl/resource/vezc-m2t6.json","https://opendata.rdw.nl/resource/jhie-znh9.json","https://opendata.rdw.nl/resource/kmfi-hrps.json"
"TS242L","Personenauto","VOLVO","XC60 T8 TWIN ENGINE","20241016",,"2888","stationwagen","5","GRIJS","Niet geregistreerd","4","1969","2039","2660","2139","750","2100","20181016","20181016","Geen verstrekking in Open Data","74274","Nee",,,,,,,"5","4","0","0",,"469","190","M1",,,,"2660","U",,"e4*2007/46*1220*03","UZBM","UZBMUD0?","0","0.10","287","Ja","Nee",,"Nee","4760","0","0.00","2022","Logisch","00","Nee","2024-10-16T00:00:00.000",,"2018-10-16T00:00:00.000","2018-10-16T00:00:00.000",,,,,,,,,,,"164",,,,,,,,,,"A",,,,,,,"https://opendata.rdw.nl/resource/3huj-srit.json","https://opendata.rdw.nl/resource/8ys7-d773.json","https://opendata.rdw.nl/resource/vezc-m2t6.json","https://opendata.rdw.nl/resource/jhie-znh9.json","https://opendata.rdw.nl/resource/kmfi-hrps.json"
"TS461J","Personenauto","VOLVO","XC60 T8 TWIN ENGINE",,,"2888","stationwagen","5","WIT","Niet geregistreerd","4","1969","2039","2660","2139","750","2100","20181015","20181015","Geen verstrekking in Open Data","82290","Nee",,,,,,,"5","4","0","0",,"469","0","M1",,,,"2660","U",,"e4*2007/46*1220*03","UZBM","UZBMUD0?","0","0.10","287","Ja","Nee",,"Nee","4760","0","0.00","2022","Logisch","00","Nee",,,"2018-10-15T00:00:00.000","2018-10-15T00:00:00.000",,,,,,,,,,,,,,,,,,,,,"A",,,,,,,"https://opendata.rdw.nl/resource/3huj-srit.json","https://opendata.rdw.nl/resource/8ys7-d773.json","https://opendata.rdw.nl/resource/vezc-m2t6.json","https://opendata.rdw.nl/resource/jhie-znh9.json","https://opendata.rdw.nl/resource/kmfi-hrps.json"
"TT564P","Personenauto","VOLVO","XC60 T8 TWIN ENGINE","20241025",,"2888","stationwagen","5","GRIJS","Niet geregistreerd","4","1969","2039","2660","2139","750","2100","20181025","20181025","Geen verstrekking in Open Data","80399","Ja",,,,,,,"5","4","0","0",,"469","190","M1",,,,"2660","U",,"e4*2007/46*1220*03","UZBM","UZBMUD0?","0","0.10","287","Ja","Nee",,"Nee","4760","0","0.00","2023","Logisch","00","Nee","2024-10-25T00:00:00.000",,"2018-10-25T00:00:00.000","2018-10-25T00:00:00.000",,,,,,,,,,,"164",,,,,,,,,,"A",,,,,,,"https://opendata.rdw.nl/resource/3huj-srit.json","https://opendata.rdw.nl/resource/8ys7-d773.json","https://opendata.rdw.nl/resource/vezc-m2t6.json","https://opendata.rdw.nl/resource/jhie-znh9.json","https://opendata.rdw.nl/resource/kmfi-hrps.json"
"TV325B","Personenauto","VOLVO","XC60 T8 TWIN ENGINE","20241101",,"2888","stationwagen","5","ORANJE","Niet geregistreerd","4","1969","2039","2660","2139","750","2100","20181101","20181101","Geen verstrekking in Open Data","85159","Nee",,,,,,,"5","4","0","0",,"469","190","M1",,,,"2660","U",,"e4*2007/46*1220*03","UZBM","UZBMUD0?","0","0.10","287","Ja","Nee",,"Nee","4760","0","0.00","2023","Logisch","00","Nee","2024-11-01T00:00:00.000",,"2018-11-01T00:00:00.000","2018-11-01T00:00:00.000",,,,,,,,,,,"164",,,,,,,,,,"A",,,,,,,"https://opendata.rdw.nl/resource/3huj-srit.json","https://opendata.rdw.nl/resource/8ys7-d773.json","https://opendata.rdw.nl/resource/vezc-m2t6.json","https://opendata.rdw.nl/resource/jhie-znh9.json","https://opendata.rdw.nl/resource/kmfi-hrps.json"