"kenteken","voertuigsoort","merk","handelsbenaming","vervaldatum_apk","datum_tenaamstelling","bruto_bpm","inrichting","aantal_zitplaatsen","eerste_kleur","tweede_kleur","aantal_cilinders","cilinderinhoud","massa_ledig_voertuig","toegestane_maximum_massa_voertuig","massa_rijklaar","maximum_massa_trekken_ongeremd","maximum_trekken_massa_geremd","datum_eerste_toelating","datum_eerste_tenaamstelling_in_nederland","wacht_op_keuren","catalogusprijs","wam_verzekerd","maximale_constructiesnelheid","laadvermogen","oplegger_geremd","aanhangwagen_autonoom_geremd","aanhangwagen_middenas_geremd","aantal_staanplaatsen","aantal_deuren","aantal_wielen","afstand_hart_koppeling_tot_achterzijde_voertuig","afstand_voorzijde_voertuig_tot_hart_koppeling","afwijkende_maximum_snelheid","lengte","breedte","europese_voertuigcategorie","europese_voertuigcategorie_toevoeging","europese_uitvoeringcategorie_toevoeging","plaats_chassisnummer","technische_max_massa_voertuig","type","type_gasinstallatie","typegoedkeuringsnummer","variant","uitvoering","volgnummer_wijziging_eu_typegoedkeuring","vermogen_massarijklaar","wielbasis","export_indicator","openstaande_terugroepactie_indicator","vervaldatum_tachograaf","taxi_indicator","maximum_massa_samenstelling","aantal_rolstoelplaatsen","maximum_ondersteunende_snelheid","jaar_laatste_registratie_tellerstand","tellerstandoordeel","code_toelichting_tellerstandoordeel","tenaamstellen_mogelijk","vervaldatum_apk_dt","datum_tenaamstelling_dt","datum_eerste_toelating_dt","datum_eerste_tenaamstelling_in_nederland_dt","vervaldatum_tachograaf_dt","maximum_last_onder_de_vooras_sen_tezamen_koppeling","type_remsysteem_voertuig_code","rupsonderstelconfiguratiecode","wielbasis_voertuig_minimum","wielbasis_voertuig_maximum","lengte_voertuig_minimum","lengte_voertuig_maximum","breedte_voertuig_minimum","breedte_voertuig_maximum","hoogte_voertuig","hoogte_voertuig_minimum","hoogte_voertuig_maximum","massa_bedrijfsklaar_minimaal","massa_bedrijfsklaar_maximaal","technisch_toelaatbaar_massa_koppelpunt","maximum_massa_technisch_maximaal","maximum_massa_technisch_minimaal","subcategorie_nederland","verticale_belasting_koppelpunt_getrokken_voertuig","zuinigheidsclassificatie","registratie_datum_goedkeuring_afschrijvingsmoment_bpm","registratie_datum_goedkeuring_afschrijvingsmoment_bpm_dt","gem_lading_wrde","aerodyn_voorz","massa_alt_aandr","verl_cab_ind","api_gekentekende_voertuigen_assen","api_gekentekende_voertuigen_brandstof","api_gekentekende_voertuigen_carrosserie","api_gekentekende_voertuigen_carrosserie_specifiek","api_gekentekende_voertuigen_voertuigklasse"
"G474BS","Personenauto","VOLVO","V60 TWIN ENGINE",,,"295","stationwagen","5","ZWART","Niet geregistreerd","5","2400","1880","2505","1980","750","1800","20150601","20190828","Geen verstrekking in Open Data","68399","Nee","230",,,,,,"5","4","0","0",,"464","187","M1",,,,"2505","G",,"e9*2007/46*0093*08","GWDC","GWDCH0??","0","0.01","278","Ja","Ja",,"Nee","4305","0","0.00","2022","Geen oordeel","05","Nee",,,"2015-06-01T00:00:00.000","2019-08-28T00:00:00.000",,,,,,,,,,,"148",,,,,,,,,,"A",,,,,,,"https://opendata.rdw.nl/resource/3huj-srit.json","https://opendata.rdw.nl/resource/8ys7-d773.json","https://opendata.rdw.nl/resource/vezc-m2t6.json","https://opendata.rdw.nl/resource/jhie-znh9.json","https://opendata.rdw.nl/resource/kmfi-hrps.json"
"GF596N","Personenauto","VOLVO","V60 TWIN ENGINE","20230729",,"463","stationwagen","5","BLAUW","Niet geregistreerd","5","2400","1880","2505","1980","750","1800","20150508","20150508","Geen verstrekking in Open Data","61485","Nee",,,,,,,"5","4","0","0",,"464","0","M1",,,"r. onder voorzitting","2505","G",,"e9*2007/46*0093*08","GWDC","GWDCH0??","0","0.01","278","Ja","Nee",,"Nee","4305","0","0.00","2023","Logisch","00","Nee","2023-07-29T00:00:00.000",,"2015-05-08T00:00:00.000","2015-05-08T00:00:00.000",,,,,,,,,,,,,,,,,,,,,"A",,,,,,,"https://opendata.rdw.nl/resource/3huj-srit.json","https://opendata.rdw.nl/resource/8ys7-d773.json","https://opendata.rdw.nl/resource/vezc-m2t6.json","https://opendata.rdw.nl/resource/jhie-znh9.json","https://opendata.rdw.nl/resource/kmfi-hrps.json"
"GF694V","Personenauto","VOLVO","V60 TWIN ENGINE","20240215",,"463","stationwagen","5","ZWART","Niet geregistreerd","5","2400","1880","2505","1980","750","1800","20150507","20150507","Geen verstrekking in Open Data","69015","Nee",,,,,,,"5","4","0","0",,"464","0","M1",,,"r. onder voorzitting","2505","G",,"e9*2007/46*0093*08","GWDC","GWDCH0??","0","0.01","278","Ja","Nee",,"Nee","4305","0","0.00","2023","Logisch","00","Nee","2024-02-15T00:00:00.000",,"2015-05-07T00:00:00.000","2015-05-07T00:00:00.000",,,,,,,,,,,,,,,,,,,,,"A",,,,,,,"https://opendata.rdw.nl/resource/3huj-srit.json","https://opendata.rdw.nl/resource/8ys7-d773.json","https://opendata.rdw.nl/resource/vezc-m2t6.json","https://opendata.rdw.nl/resource/jhie-znh9.json","https://opendata.rdw.nl/resource/kmfi-hrps.json"
"GG120Z","Personenauto","VOLVO","V60 TWIN ENGINE","20220522",,"463","stationwagen","5","GRIJS","Niet geregistreerd","5","2400","1880","2505","1980","750","1800","20150522","20150522","Geen verstrekking in Open Data","69565","Nee",,,,,,,"5","4","0","0",,"464","0","M1",,,"r. onder voorzitting","2505","G",,"e9*2007/46*0093*08","GWDC","GWDCH0??","0","0.01","278","Ja","Nee",,"Nee","4305","0","0.00","2022","Logisch","00","Nee","2022-05-22T00:00:00.000",,"2015-05-22T00:00:00.000","2015-05-22T00:00:00.000",,,,,,,,,,,,,,,,,,,,,"A",,,,,,,"https://opendata.rdw.nl/resource/3huj-srit.json","https://opendata.rdw.nl/resource/8ys7-d773.json","https://opendata.rdw.nl/resource/vezc-m2t6.json","https://opendata.rdw.nl/resource/jhie-znh9.json","https://opendata.rdw.nl/resource/kmfi-hrps.json"
"GG195N","Personenauto","VOLVO","V60 TWIN ENGINE","20230515",,"463","stationwagen","5","GRIJS","Niet geregistreerd","5","2400","1880","2505","1980","750","1800","20150515","20150515","Geen verstrekking in Open Data","70305","Nee",,,,,,,"5","4","0","0",,"464","0","M1",,,"r. onder voorzitting","2505","G",,"e9*2007/46*0093*08","GWDC","GWDCH0??","0","0.01","278","Ja","Nee",,"Nee","4305","0","0.00","2022","Logisch","00","Nee","2023-05-15T00:00:00.000",,"2015-05-15T00:00:00.000","2015-05-15T00:00:00.000",,,,,,,,,,,,,,,,,,,,,"A",,,,,,,"https://opendata.rdw.nl/resource/3huj-srit.json","https://opendata.rdw.nl/resource/8ys7-d773.json","https://opendata.rdw.nl/resource/vezc-m2t6.json","https://opendata.rdw.nl/resource/jhie-znh9.json","https://opendata.rdw.nl/resource/kmfi-hrps.json"
"GG695H","Personenauto","VOLVO","V60 TWIN ENGINE","20231105",,"463","stationwagen","5","ZWART","Niet geregistreerd","5","2400","1880","2505","1980","750","1800","20150515","20150515","Geen verstrekking in Open Data","62090","Nee",,,,,,,"5","4","0","0",,"464","0","M1",,,"r. onder voorzitting","2505","G",,"e9*2007/46*0093*08","GWDC","GWDCH0??","0","0.01","278","Ja","Nee",,"Nee","4305","0","0.00","2023","Logisch","00","Nee","2023-11-05T00:00:00.000",,"2015-05-15T00:00:00.000","2015-05-15T00:00:00.000",,,,,,,,,,,,,,,,,,,,,"A",,,,,,,"https://opendata.rdw.nl/resource/3huj-srit.json","https://opendata.rdw.nl/resource/8ys7-d773.json","https://opendata.rdw.nl/resource/vezc-m2t6.json","https://opendata.rdw.nl/resource/jhie-znh9.json","https://opendata.rdw.nl/resource/kmfi-hrps.json"
"GG747S","Personenauto","VOLVO","V60 TWIN ENGINE","20240425",,"463","stationwagen","5","GRIJS","Niet geregistreerd","5","2400","1880","2505","1980","750","1800","20150528","20150528","Geen verstrekking in Open Data","73805","Nee",,,,,,,"5","4","0","0",,"464","0","M1",,,"r. onder voorzitting","2505","G",,"e9*2007/46*0093*08","GWDC","GWDCH0??","0","0.01","278","Ja","Nee",,"Nee","4305","0","0.00","2023","Logisch","00","Nee","2024-04-25T00:00:00.000",,"2015-05-28T00:00:00.000","2015-05-28T00:00:00.000",,,,,,,,,,,,,,,,,,,,,"A",,,,,,,"https://opendata.rdw.nl/resource/3huj-srit.json","https://opendata.rdw.nl/resource/8ys7-d773.json","https://opendata.rdw.nl/resource/vezc-m2t6.json","https://opendata.rdw.nl/resource/jhie-znh9.json","https://opendata.rdw.nl/resource/kmfi-hrps.json"
"GG981P","Personenauto","VOLVO","V60 TWIN ENGINE","20230519",,"463","stationwagen","5","GRIJS","Niet geregistreerd","5","2400","1880","2505","1980","750","1800","20150519","20150519","Geen verstrekking in Open Data","69040","Nee",,,,,,,"5","4","0","0",,"464","0","M1",,,"r. onder voorzitting","2505","G",,"e9*2007/46*0093*08","GWDC","GWDCH0??","0","0.01","278","Ja","Nee",,"Nee","4305","0","0.00","2023","Logisch","00","Nee","2023-05-19T00:00:00.000",,"2015-05-19T00:00:00.000","2015-05-19T00:00:00.000",,,,,,,,,,,,,,,,,,,,,"A",,,,,,,"https://opendata.rdw.nl/resource/3huj-srit.json","https://opendata.rdw.nl/resource/8ys7-d773.json","https://opendata.rdw.nl/resource/vezc-m2t6.json","https://opendata.rdw.nl/resource/jhie-znh9.json","https://opendata.rdw.nl/resource/kmfi-hrps.json"
"GH640Z","Personenauto","VOLVO","V60 TWIN ENGINE","20240726",,"463","stationwagen","5","GRIJS","Niet geregistreerd","5","2400","1880","2505","1980","750","1800","20150601","20150601","Geen verstrekking in Open Data","72725","Nee",,,,,,,"5","4","0","0",,"464","0","M1",,,"r. onder voorzitting","2505","G",,"e9*2007/46*0093*08","GWDC","GWDCH0??","0","0.01","278","Ja","Nee",,"Nee","4305","0","0.00","2023","Logisch","00","Nee","2024-07-26T00:00:00.000",,"2015-06-01T00:00:00.000","2015-06-01T00:00:00.000",,,,,,,,,,,,,,,,,,,,,"A",,,,,,,"https://opendata.rdw.nl/resource/3huj-srit.json","https://opendata.rdw.nl/resource/8ys7-d773.json","https://opendata.rdw.nl/resource/vezc-m2t6.json","https://opendata.rdw.nl/resource/jhie-znh9.json","https://opendata.rdw.nl/resource/kmfi-hrps.json"
"GH807J","Personenauto","VOLVO","V60 TWIN ENGINE","20230528",,"463","stationwagen","5","BLAUW","Niet geregistreerd","5","2400","1880","2505","1980","750","1800","20150528","20150528","Geen verstrekking in Open Data","62090","Nee",,,,,,,"5","4","0","0",,"464","0","M1",,,"r. onder voorzitting","2505","G",,"e9*2007/46*0093*08","GWDC","GWDCH0??","0","0.01","278","Ja","Nee",,"Nee","4305","0","0.00","2023","Logisch","00","Nee","2023-05-28T00:00:00.000",,"2015-05-28T00:00:00.000","2015-05-28T00:00:00.000",,,,,,,,,,,,,,,,,,,,,"A",,,,,,,"https://opendata.rdw.nl/resource/3huj-srit.json","https://opendata.rdw.nl/resource/8ys7-d773.json","https://opendata.rdw.nl/resource/vezc-m2t6.json","https://opendata.rdw.nl/resource/jhie-znh9.json","https://opendata.rdw.nl/resource/kmfi-hrps.json"
"GH846L","Personenauto","VOLVO","V60 TWIN ENGINE","20240207",,"463","stationwagen","5","ZWART","Niet geregistreerd","5","2400","1880","2505","1980","750","1800","20150529","20150529","Geen verstrekking in Open Data","72585","Nee",,,,,,,"5","4","0","0",,"464","0","M1",,,"r. onder voorzitting","2505","G",,"e9*2007/46*0093*08","GWDC","GWDCH0??","0","0.01","278","Ja","Nee",,"Nee","4305","0","0.00","2023","Logisch","00","Nee","2024-02-07T00:00:00.000",,"2015-05-29T00:00:00.000","2015-05-29T00:00:00.000",,,,,,,,,,,,,,,,,,,,,"A",,,,,,,"https://opendata.rdw.nl/resource/3huj-srit.json","https://opendata.rdw.nl/resource/8ys7-d773.json","https://opendata.rdw.nl/resource/vezc-m2t6.json","https://opendata.rdw.nl/resource/jhie-znh9.json","https://opendata.rdw.nl/resource/kmfi-hrps.json"
"GJ444G","Personenauto","VOLVO","V60 TWIN ENGINE","20240613","20240223","463","stationwagen","5","GRIJS","Niet geregistreerd","5","2400","1880","2505","1980","750","1800","20150605","20150605","Geen verstrekking in Open Data","68835","Ja",,,,,,,"5","4","0","0",,"464","0","M1",,,"r. onder voorzitting","2505","G",,"e9*2007/46*0093*08","GWDC","GWDCH0??","0","0.01","278","Ja","Nee",,"Nee","4305","0","0.00","2024","Logisch","00","Nee","2024-06-13T00:00:00.000","2024-02-23T00:00:00.000","2015-06-05T00:00:00.000","2015-06-05T00:00:00.000",,,,,,,,,,,,,,,,,,,,,"A",,,,,,,"https://opendata.rdw.nl/resource/3huj-srit.json","https://opendata.rdw.nl/resource/8ys7-d773.json","https://opendata.rdw.nl/resource/vezc-m2t6.json","https://opendata.rdw.nl/resource/jhie-znh9.json","https://opendata.rdw.nl/resource/kmfi-hrps.json"
"GJ473G","Personenauto","VOLVO","V60 TWIN ENGINE","20240613",,"463","stationwagen","5","ZWART","Niet geregistreerd","5","2400","1880","2505","1980","750","1800","20150602","20150602","Geen verstrekking in Open Data","68809","Nee",,,,,,,"5","4","0","0",,"464","0","M1",,,"r. onder voorzitting","2505","G",,"e9*2007/46*0093*08","GWDC","GWDCH0??","0","0.01","278","Ja","Nee",,"Nee","4305","0","0.00","2023","Logisch","00","Nee","2024-06-13T00:00:00.000",,"2015-06-02T00:00:00.000","2015-06-02T00:00:00.000",,,,,,,,,,,,,,,,,,,,,"A",,,,,,,"https://opendata.rdw.nl/resource/3huj-srit.json","https://opendata.rdw.nl/resource/8ys7-d773.json","https://opendata.rdw.nl/resource/vezc-m2t6.json","https://opendata.rdw.nl/resource/jhie-znh9.json","https://opendata.rdw.nl/resource/kmfi-hrps.json"
"GJ813J","Personenauto","VOLVO","V60 TWIN ENGINE","20240911",,"463","stationwagen","5","WIT","Niet geregistreerd","5","2400","1880","2505","1980","750","1800","20150605","20150605","Geen verstrekking in Open Data","64360","Nee",,,,,,,"5","4","0","0",,"464","0","M1",,,"r. onder voorzitting","2505","G",,"e9*2007/46*0093*08","GWDC","GWDCH0??","0","0.01","278","Ja","Ja",,"Nee","4305","0","0.00","2023","Logisch","00","Nee","2024-09-11T00:00:00.000",,"2015-06-05T00:00:00.000","2015-06-05T00:00:00.000",,,,,,,,,,,,,,,,,,,,,"A",,,,,,,"https://opendata.rdw.nl/resource/3huj-srit.json","https://opendata.rdw.nl/resource/8ys7-d773.json","https://opendata.rdw.nl/resource/vezc-m2t6.json","https://opendata.rdw.nl/resource/jhie-znh9.json","https://opendata.rdw.nl/resource/kmfi-hrps.json"
"GJ825J","Personenauto","VOLVO","V60 TWIN ENGINE","20241017",,"463","stationwagen","5","ZWART","Niet geregistreerd","5","2400","1880","2505","1980","750","1800","20150620","20150620","Geen verstrekking in Open Data","66775","Nee",,,,,,,"5","4","0","0",,"464","0","M1",,,"r. onder voorzitting","2505","G",,"e9*2007/46*0093*08","GWDC","GWDCH0??","0","0.01","278","Ja","Nee",,"Nee","4305","0","0.00","2023","Logisch","00","Nee","2024-10-17T00:00:00.000",,"2015-06-20T00:00:00.000","2015-06-20T00:00:00.000",,,,,,,,,,,,,,,,,,,,,"A",,,,,,,"https://opendata.rdw.nl/resource/3huj-srit.json","https://opendata.rdw.nl/resource/8ys7-d773.json","https://opendata.rdw.nl/resource/vezc-m2t6.json","https://opendata.rdw.nl/resource/jhie-znh9.json","https://opendata.rdw.nl/resource/kmfi-hrps.json"
"GJ888L","Personenauto","VOLVO","V60 TWIN ENGINE","20230622",,"463","stationwagen","5","ZWART","Niet geregistreerd","5","2400","1880","2505","1980","750","1800","20150608","20150608","Geen verstrekking in Open Data","68850","Nee",,,,,,,"5","4","0","0",,"464","0","M1",,,"r. onder voorzitting","2505","G",,"e9*2007/46*0093*08","GWDC","GWDCH0??","0","0.01","278","Ja","Nee",,"Nee","4305","0","0.00","2022","Logisch","00","Nee","2023-06-22T00:00:00.000",,"2015-06-08T00:00:00.000","2015-06-08T00:00:00.000",,,,,,,,,,,,,,,,,,,,,"A",,,,,,,"https://opendata.rdw.nl/resource/3huj-srit.json","https://opendata.rdw.nl/resource/8ys7-d773.json","https://opendata.rdw.nl/resource/vezc-m2t6.json","https://opendata.rdw.nl/resource/jhie-znh9.json","https://opendata.rdw.nl/resource/kmfi-hrps.json"
"GK102J","Personenauto","VOLVO","V60 TWIN ENGINE","20240828",,"463","stationwagen","5","BLAUW","Niet geregistreerd","5","2400","1880","2505","1980","750","1800","20150714","20150714","Geen verstrekking in Open Data","74395","Nee",,,,,,,"5","4","0","0",,"464","0","M1",,,"r. onder voorzitting","2505","G",,"e9*2007/46*0093*08","GWDC","GWDCH0??","0","0.01","278","Ja","Nee",,"Nee","4305","0","0.00","2023","Logisch","00","Nee","2024-08-28T00:00:00.000",,"2015-07-14T00:00:00.000","2015-07-14T00:00:00.000",,,,,,,,,,,,,,,,,,,,,"A",,,,,,,"https://opendata.rdw.nl/resource/3huj-srit.json","https://opendata.rdw.nl/resource/8ys7-d773.json","https://opendata.rdw.nl/resource/vezc-m2t6.json","https://opendata.rdw.nl/resource/jhie-znh9.json","https://opendata.rdw.nl/resource/kmfi-hrps.json"
"GK736V","Personenauto","VOLVO","V60 TWIN ENGINE","20230709",,"463","stationwagen","5","ZWART","Niet geregistreerd","5","2400","1880","2505","1980","750","1800","20150626","20150626","Geen verstrekking in Open Data","74055","Nee",,,,,,,"5","4","0","0",,"464","0","M1",,,"r. onder voorzitting","2505","G",,"e9*2007/46*0093*08","GWDC","GWDCH0??","0","0.01","278","Ja","Nee",,"Nee","4305","0","0.00","2022","Logisch","00","Nee","2023-07-09T00:00:00.000",,"2015-06-26T00:00:00.000","2015-06-26T00:00:00.000",,,,,,,,,,,,,,,,,,,,,"A",,,,,,,"https://opendata.rdw.nl/resource/3huj-srit.json","https://opendata.rdw.nl/resource/8ys7-d773.json","https://opendata.rdw.nl/resource/vezc-m2t6.json","https://opendata.rdw.nl/resource/jhie-znh9.json","https://opendata.rdw.nl/resource/kmfi-hrps.json"
"GK740V","Personenauto","VOLVO","V60 TWIN ENGINE","20241026",,"463","stationwagen","5","ZWART","Niet geregistreerd","5","2400","1880","2505","1980","750","1800","20150623","20150623","Geen verstrekking in Open Data","66835","Nee",,,,,,,"5","4","0","0",,"464","0","M1",,,"r. onder voorzitting","2505","G",,"e9*2007/46*0093*08","GWDC","GWDCH0??","0","0.01","278","Ja","Nee",,"Nee","4305","0","0.00","2023","Niet geregistreerd","NG","Nee","2024-10-26T00:00:00.000",,"2015-06-23T00:00:00.000","2015-06-23T00:00:00.000",,,,,,,,,,,,,,,,,,,,,"A",,,,,,,"https://opendata.rdw.nl/resource/3huj-srit.json","https://opendata.rdw.nl/resource/8ys7-d773.json","https://opendata.rdw.nl/resource/vezc-m2t6.json","https://opendata.rdw.nl/resource/jhie-znh9.json","https://opendata.rdw.nl/resource/kmfi-hrps.json"
"GK750V","Personenauto","VOLVO","V60 TWIN ENGINE","20240905",,"463","stationwagen","5","BLAUW","Niet geregistreerd","5","2400","1880","2505","1980","750","1800","20150624","20150624","Geen verstrekking in Open Data","69510","Nee",,,,,,,"5","4","0","0",,"464","0","M1",,,"r. onder voorzitting","2505","G",,"e9*2007/46*0093*08","GWDC","GWDCH0??","0","0.01","278","Ja","Nee",,"Nee","4305","0","0.00","2023","Logisch","00","Nee","2024-09-05T00:00:00.000",,"2015-06-24T00:00:00.000","2015-06-24T00:00:00.000",,,,,,,,,,,,,,,,,,,,,"A",,,,,,,"https://opendata.rdw.nl/resource/3huj-srit.json","https://opendata.rdw.nl/resource/8ys7-d773.json","https://opendata.rdw.nl/resource/vezc-m2t6.json","https://opendata.rdw.nl/resource/jhie-znh9.json","https://opendata.rdw.nl/resource/kmfi-hrps.json"
"GL758S","Personenauto","VOLVO","V60 TWIN ENGINE","20221214",,"463","stationwagen","5","ROOD","Niet geregistreerd","5","2400","1880","2505","1980","750","1800","20150609","20150701","Geen verstrekking in Open Data","75415","Nee",,,,,,,"4","4","0","0",,"464","0","M1",,,"r. onder voorzitting","2505","G",,"e9*2007/46*0093*08","GWDC","GWDCH0??","0","0.03","278","Ja","Nee",,"Nee","4305","0","0.00","2023","Logisch","00","Nee","2022-12-14T00:00:00.000",,"2015-06-09T00:00:00.000","2015-07-01T00:00:00.000",,,,,,,,,,,,,,,,,,,,,"A",,,,,,,"https://opendata.rdw.nl/resource/3huj-srit.json","https://opendata.rdw.nl/resource/8ys7-d773.json","https://opendata.rdw.nl/resource/vezc-m2t6.json","https://opendata.rdw.nl/resource/jhie-znh9.json","https://opendata.rdw.nl/resource/kmfi-hrps.json"
"GL905D","Personenauto","VOLVO","V60 TWIN ENGINE","20231029",,"463","stationwagen","5","WIT","Niet geregistreerd","5","2400","1880","2505","1980","750","1800","20150625","20150625","Geen verstrekking in Open Data","65279","Nee",,,,,,,"5","4","0","0",,"464","0","M1",,,"r. onder voorzitting","2505","G",,"e9*2007/46*0093*08","GWDC","GWDCH0??","0","0.01","278","Ja","Nee",,"Nee","4305","0","0.00","2022","Logisch","00","Nee","2023-10-29T00:00:00.000",,"2015-06-25T00:00:00.000","2015-06-25T00:00:00.000",,,,,,,,,,,,,,,,,,,,,"A",,,,,,,"https://opendata.rdw.nl/resource/3huj-srit.json","https://opendata.rdw.nl/resource/8ys7-d773.json","https://opendata.rdw.nl/resource/vezc-m2t6.json","https://opendata.rdw.nl/resource/jhie-znh9.json","https://opendata.rdw.nl/resource/kmfi-hrps.json"
"GN074D","Personenauto","VOLVO","V60 TWIN ENGINE","20230701",,"463","stationwagen","5","ZWART","Niet geregistreerd","5","2400","1880","2275","1980","750","1800","20150701","20150701","Geen verstrekking in Open Data","61550","Nee",,,,,,,"4","4","0","0",,"464","0","M1",,,"r. onder voorzitting","2505","G",,"e9*2007/46*0093*08","GWDC","GWDCH0??","0","0.03","278","Ja","Nee",,"Nee","4075","0","0.00","2023","Logisch","00","Nee","2023-07-01T00:00:00.000",,"2015-07-01T00:00:00.000","2015-07-01T00:00:00.000",,,,,,,,,,,,,,,,,,,,,"A",,,,,,,"https://opendata.rdw.nl/resource/3huj-srit.json","https://opendata.rdw.nl/resource/8ys7-d773.json","https://opendata.rdw.nl/resource/vezc-m2t6.json","https://opendata.rdw.nl/resource/jhie-znh9.json","https://opendata.rdw.nl/resource/kmfi-hrps.json"
"GP458P","Personenauto","VOLVO","V60 TWIN ENGINE","20230822",,"463","stationwagen","5","GRIJS","Niet geregistreerd","5","2400","1880","2505","1980","750","1800","20150716","20150716","Geen verstrekking in Open Data","64830","Nee",,,,,,,"5","4","0","0",,"464","0","M1",,,"r. onder voorzitting","2505","G",,"e9*2007/46*0093*08","GWDC","GWDCH0??","0","0.01","278","Ja","Nee",,"Nee","4305","0","0.00","2022","Logisch","00","Nee","2023-08-22T00:00:00.000",,"2015-07-16T00:00:00.000","2015-07-16T00:00:00.000",,,,,,,,,,,,,,,,,,,,,"A",,,,,,,"https://opendata.rdw.nl/resource/3huj-srit.json","https://opendata.rdw.nl/resource/8ys7-d773.json","https://opendata.rdw.nl/resource/vezc-m2t6.json","https://opendata.rdw.nl/resource/jhie-znh9.json","https://opendata.rdw.nl/resource/kmfi-hrps.json"
"GP931S","Personenauto","VOLVO","V60 TWIN ENGINE","20240728",,"463","stationwagen","5","ZWART","Niet geregistreerd","5","2400","1880","2505","1980","750","1800","20150702","20150716","Geen verstrekking in Open Data","68853","Nee",,,,,,,"4","4","0","0",,"464","0","M1",,,"r. onder voorzitting","2505","G",,"e9*2007/46*0093*08","GWDC","GWDCH0??","0","0.03","278","Ja","Nee",,"Nee","4305","0","0.00","2023","Logisch","00","Nee","2024-07-28T00:00:00.000",,"2015-07-02T00:00:00.000","2015-07-16T00:00:00.000",,,,,,,,,,,,,,,,,,,,,"A",,,,,,,"https://opendata.rdw.nl/resource/3huj-srit.json","https://opendata.rdw.nl/resource/8ys7-d773.json","https://opendata.rdw.nl/resource/vezc-m2t6.json","https://opendata.rdw.nl/resource/jhie-znh9.json","https://opendata.rdw.nl/resource/kmfi-hrps.json"
"GR409T","Personenauto","VOLVO","V60 TWIN ENGINE","20220820",,"463","stationwagen","5","WIT","Niet geregistreerd","5","2400","1880","2505","1980","750","1800","20150812","20150812","Geen verstrekking in Open Data","60600","Nee",,,,,,,"4","4","0","0",,"464","0","M1",,,"r. onder voorzitting","2505","G",,"e9*2007/46*0093*09","GWBN","GWBNH0??","0","0.01","278","Ja","Nee",,"Nee","4305","0","0.00","2022","Logisch","00","Nee","2022-08-20T00:00:00.000",,"2015-08-12T00:00:00.000","2015-08-12T00:00:00.000",,,,,,,,,,,,,,,,,,,,,"A",,,,,,,"https://opendata.rdw.nl/resource/3huj-srit.json","https://opendata.rdw.nl/resource/8ys7-d773.json","https://opendata.rdw.nl/resource/vezc-m2t6.json","https://opendata.rdw.nl/resource/jhie-znh9.json","https://opendata.rdw.nl/resource/kmfi-hrps.json"
"GS590Z","Personenauto","VOLVO","V60 TWIN ENGINE","20240902","20240416","463","stationwagen","5","ZWART","Niet geregistreerd","5","2400","1880","2505","1980","750","1800","20150813","20150813","Geen verstrekking in Open Data","70840","Ja",,,,,,,"5","4","0","0",,"464","187","M1",,,"in bodemplaat r. v.","2505","G",,"e9*2007/46*0093*08","GWDC","GWDCH0??","0","0.01","278","Ja","Ja",,"Nee","4305","0","0.00","2024","Logisch","00","Nee","2024-09-02T00:00:00.000","2024-04-16T00:00:00.000","2015-08-13T00:00:00.000","2015-08-13T00:00:00.000",,,,,,,,,,,"148",,,,,,,,,,"A",,,,,,,"https://opendata.rdw.nl/resource/3huj-srit.json","https://opendata.rdw.nl/resource/8ys7-d773.json","https://opendata.rdw.nl/resource/vezc-m2t6.json","https://opendata.rdw.nl/resource/jhie-znh9.json","https://opendata.rdw.nl/resource/kmfi-hrps.json"