"kenteken","voertuigsoort","merk","handelsbenaming","vervaldatum_apk","datum_tenaamstelling","bruto_bpm","inrichting","aantal_zitplaatsen","eerste_kleur","tweede_kleur","aantal_cilinders","cilinderinhoud","massa_ledig_voertuig","toegestane_maximum_massa_voertuig","massa_rijklaar","maximum_massa_trekken_ongeremd","maximum_trekken_massa_geremd","datum_eerste_toelating","datum_eerste_tenaamstelling_in_nederland","wacht_op_keuren","catalogusprijs","wam_verzekerd","maximale_constructiesnelheid","laadvermogen","oplegger_geremd","aanhangwagen_autonoom_geremd","aanhangwagen_middenas_geremd","aantal_staanplaatsen","aantal_deuren","aantal_wielen","afstand_hart_koppeling_tot_achterzijde_voertuig","afstand_voorzijde_voertuig_tot_hart_koppeling","afwijkende_maximum_snelheid","lengte","breedte","europese_voertuigcategorie","europese_voertuigcategorie_toevoeging","europese_uitvoeringcategorie_toevoeging","plaats_chassisnummer","technische_max_massa_voertuig","type","type_gasinstallatie","typegoedkeuringsnummer","variant","uitvoering","volgnummer_wijziging_eu_typegoedkeuring","vermogen_massarijklaar","wielbasis","export_indicator","openstaande_terugroepactie_indicator","vervaldatum_tachograaf","taxi_indicator","maximum_massa_samenstelling","aantal_rolstoelplaatsen","maximum_ondersteunende_snelheid","jaar_laatste_registratie_tellerstand","tellerstandoordeel","code_toelichting_tellerstandoordeel","tenaamstellen_mogelijk","vervaldatum_apk_dt","datum_tenaamstelling_dt","datum_eerste_toelating_dt","datum_eerste_tenaamstelling_in_nederland_dt","vervaldatum_tachograaf_dt","maximum_last_onder_de_vooras_sen_tezamen_koppeling","type_remsysteem_voertuig_code","rupsonderstelconfiguratiecode","wielbasis_voertuig_minimum","wielbasis_voertuig_maximum","lengte_voertuig_minimum","lengte_voertuig_maximum","breedte_voertuig_minimum","breedte_voertuig_maximum","hoogte_voertuig","hoogte_voertuig_minimum","hoogte_voertuig_maximum","massa_bedrijfsklaar_minimaal","massa_bedrijfsklaar_maximaal","technisch_toelaatbaar_massa_koppelpunt","maximum_massa_technisch_maximaal","maximum_massa_technisch_minimaal","subcategorie_nederland","verticale_belasting_koppelpunt_getrokken_voertuig","zuinigheidsclassificatie","registratie_datum_goedkeuring_afschrijvingsmoment_bpm","registratie_datum_goedkeuring_afschrijvingsmoment_bpm_dt","gem_lading_wrde","aerodyn_voorz","massa_alt_aandr","verl_cab_ind","api_gekentekende_voertuigen_assen","api_gekentekende_voertuigen_brandstof","api_gekentekende_voertuigen_carrosserie","api_gekentekende_voertuigen_carrosserie_specifiek","api_gekentekende_voertuigen_voertuigklasse"
"V173NX","Bedrijfsauto","VOLKSWAGEN","CRAFTER","20240507","20240222","9451","neerklapbare zijschotten","7","N.v.t.","N.v.t.","4","1968","2156","3500","2256","750",,"20130110","20180508","Geen verstrekking in Open Data","38908","Ja",,"1344",,"2000","2000",,"0","4","0","0",,"614","209","N1",,,"schutbord motorruimte","3500","2FJE2",,"e1*2007/46*0522*04","PD4B1350E","MED2KUA7","0","0.04","367","Ja","Nee",,"Nee","5500","0","0.00","2024","Geen oordeel","05","Nee","2024-05-07T00:00:00.000","2024-02-22T00:00:00.000","2013-01-10T00:00:00.000","2018-05-08T00:00:00.000",,"0",,,,,,,,,,,,,,,,,,,,,,,,,,"https://opendata.rdw.nl/resource/3huj-srit.json","https://opendata.rdw.nl/resource/8ys7-d773.json","https://opendata.rdw.nl/resource/vezc-m2t6.json","https://opendata.rdw.nl/resource/jhie-znh9.json","https://opendata.rdw.nl/resource/kmfi-hrps.json"
"V229NT","Bedrijfsauto","VOLKSWAGEN","CRAFTER","20240503",,"11837","neerklapbare zijschotten","2","N.v.t.","N.v.t.","5","2461","2275","3025","2375","750",,"20080319","20180420","Geen verstrekking in Open Data",,"Nee",,"750",,,"2000",,,"4",,,,,"209","N1",,,"r. schutbord","3025",,,,,,,"0.03","365","Ja","Nee",,"Nee","5025",,,"2023","Geen oordeel","05","Nee","2024-05-03T00:00:00.000",,"2008-03-19T00:00:00.000","2018-04-20T00:00:00.000",,"0",,,,,,,,,,,,,,,,,,,,,,,,,,"https://opendata.rdw.nl/resource/3huj-srit.json","https://opendata.rdw.nl/resource/8ys7-d773.json","https://opendata.rdw.nl/resource/vezc-m2t6.json","https://opendata.rdw.nl/resource/jhie-znh9.json","https://opendata.rdw.nl/resource/kmfi-hrps.json"
"V231NX","Bedrijfsauto","VOLKSWAGEN","CRAFTER","20230511",,"10608","neerklapbare zijschotten","3","N.v.t.","N.v.t.","4","1968","2010","3500","2110","750",,"20130301","20180628","Geen verstrekking in Open Data","43780","Nee",,"1490",,"2000","2000",,,"4",,,,,"209","N1",,,"schutbord motorruimte","3500","2FJE2",,,,,,"0.05","366","Ja","Nee",,"Nee","5500",,,"2023","Niet geregistreerd","NG","Nee","2023-05-11T00:00:00.000",,"2013-03-01T00:00:00.000","2018-06-28T00:00:00.000",,"0",,,,,,,,,,,,,,,,,,,,,,,,,,"https://opendata.rdw.nl/resource/3huj-srit.json","https://opendata.rdw.nl/resource/8ys7-d773.json","https://opendata.rdw.nl/resource/vezc-m2t6.json","https://opendata.rdw.nl/resource/jhie-znh9.json","https://opendata.rdw.nl/resource/kmfi-hrps.json"
"V333BT","Bedrijfsauto","VOLKSWAGEN","CRAFTER","20231222",,"12894","neerklapbare zijschotten","3","N.v.t.","N.v.t.","4","1968","2191","3500","2291",,,"20120507","20170204","Geen verstrekking in Open Data","53405","Nee",,"1309",,"2000","2000",,,"4",,,,,"218","N1",,,"schutbord motorruimte","3500","ZFJZ",,,,,,"0.05","432","Ja","Nee",,"Nee","5500",,,"2023","Geen oordeel","05","Nee","2023-12-22T00:00:00.000",,"2012-05-07T00:00:00.000","2017-02-04T00:00:00.000",,"0",,,,,,,,,,,,,,,,,,,,,,,,,,"https://opendata.rdw.nl/resource/3huj-srit.json","https://opendata.rdw.nl/resource/8ys7-d773.json","https://opendata.rdw.nl/resource/vezc-m2t6.json","https://opendata.rdw.nl/resource/jhie-znh9.json","https://opendata.rdw.nl/resource/kmfi-hrps.json"
"V419NP","Bedrijfsauto","VOLKSWAGEN","CRAFTER","20240207",,"7699","neerklapbare zijschotten","7","N.v.t.","N.v.t.","4","1968","2156","3500","2256","750",,"20121210","20180411","Geen verstrekking in Open Data","31536","Nee",,"1344",,"2000","2000",,"0","4","0","0",,"614","209","N1",,,"schutbord motorruimte","3500","2FJE2",,"e1*2007/46*0522*04","PD4B1350E","MED2KUA7","0","0.04","367","Ja","Nee",,"Nee","5500","0","0.00","2023","Geen oordeel","05","Nee","2024-02-07T00:00:00.000",,"2012-12-10T00:00:00.000","2018-04-11T00:00:00.000",,"0",,,,,,,,,,,,,,,,,,,,,,,,,,"https://opendata.rdw.nl/resource/3huj-srit.json","https://opendata.rdw.nl/resource/8ys7-d773.json","https://opendata.rdw.nl/resource/vezc-m2t6.json","https://opendata.rdw.nl/resource/jhie-znh9.json","https://opendata.rdw.nl/resource/kmfi-hrps.json"
"V523TL","Bedrijfsauto","VOLKSWAGEN","CRAFTER","20240208","20231201","11498","neerklapbare zijschotten","3","N.v.t.","N.v.t.","4","1968","2420","3500","2520","750",,"20160718","20190206","Geen verstrekking in Open Data","47525","Ja",,"1080",,"2000","2000",,,"4",,,,,"217","N1",,,"r. schutbord motorruimte","3500","2FJE2",,,,,,"0.05","433","Ja","Nee",,"Nee","5500",,,"2024","Onlogisch","04","Nee","2024-02-08T00:00:00.000","2023-12-01T00:00:00.000","2016-07-18T00:00:00.000","2019-02-06T00:00:00.000",,"0",,,,,,,,,,,,,,,,,,,,,,,,,,"https://opendata.rdw.nl/resource/3huj-srit.json","https://opendata.rdw.nl/resource/8ys7-d773.json","https://opendata.rdw.nl/resource/vezc-m2t6.json","https://opendata.rdw.nl/resource/jhie-znh9.json","https://opendata.rdw.nl/resource/kmfi-hrps.json"
"V622XG","Bedrijfsauto","VOLKSWAGEN","CRAFTER","20250226","20190307","15976","neerklapbare zijschotten","3","N.v.t.","N.v.t.","4","1968","3252","3500","3352","750",,"20190226","20190226","Geen verstrekking in Open Data","66378","Nee",,"248",,"3500","3500",,,"4",,,,,"208","N1",,,"r. motorruimte","3500","SZN1Z",,,,,,"0.04","364","Ja","Nee",,"Nee","7000",,,"2024","Niet geregistreerd","NG","Nee","2025-02-26T00:00:00.000","2019-03-07T00:00:00.000","2019-02-26T00:00:00.000","2019-02-26T00:00:00.000",,"0",,,,,,,,,,,,,,,,,,,,,,,,,,"https://opendata.rdw.nl/resource/3huj-srit.json","https://opendata.rdw.nl/resource/8ys7-d773.json","https://opendata.rdw.nl/resource/vezc-m2t6.json","https://opendata.rdw.nl/resource/jhie-znh9.json","https://opendata.rdw.nl/resource/kmfi-hrps.json"
"V844FG","Bedrijfsauto","VOLKSWAGEN","CRAFTER","20230315",,"11522","neerklapbare zijschotten","3","N.v.t.","N.v.t.","4","1968","2272","3500","2372","750",,"20140930","20170301","Geen verstrekking in Open Data","47628","Nee",,"1228",,"2000","2000",,,"4",,,,,"220","N1",,,"schutbord motorruimte","3500","2FJE2",,,,,,"0.04","433","Ja","Nee",,"Nee","5500",,,"2022","Geen oordeel","05","Nee","2023-03-15T00:00:00.000",,"2014-09-30T00:00:00.000","2017-03-01T00:00:00.000",,"0",,,,,,,,,,,,,,,,,,,,,,,,,,"https://opendata.rdw.nl/resource/3huj-srit.json","https://opendata.rdw.nl/resource/8ys7-d773.json","https://opendata.rdw.nl/resource/vezc-m2t6.json","https://opendata.rdw.nl/resource/jhie-znh9.json","https://opendata.rdw.nl/resource/kmfi-hrps.json"
"V993BX","Bedrijfsauto","VOLKSWAGEN","CRAFTER","20221216",,"11134","neerklapbare zijschotten","2","N.v.t.","N.v.t.","4","1968","2192","3500","2292","750",,"20161216","20161216","Geen verstrekking in Open Data","45994","Nee",,"1308",,"2000","2000",,,"4",,,,,"209","N1",,,"r. schutbord motorruimte","3500","2FJE2",,,,,,"0.03","433","Ja","Nee",,"Nee","5500",,,"2023","Logisch","00","Nee","2022-12-16T00:00:00.000",,"2016-12-16T00:00:00.000","2016-12-16T00:00:00.000",,"0",,,,,,,,,,,,,,,,,,,,,,,,,,"https://opendata.rdw.nl/resource/3huj-srit.json","https://opendata.rdw.nl/resource/8ys7-d773.json","https://opendata.rdw.nl/resource/vezc-m2t6.json","https://opendata.rdw.nl/resource/jhie-znh9.json","https://opendata.rdw.nl/resource/kmfi-hrps.json"
"VDP01K","Bedrijfsauto","VOLKSWAGEN","CRAFTER","20240310",,"13285","neerklapbare zijschotten","6","N.v.t.","N.v.t.","4","1968","2520","3500","2620","750",,"20140620","20200811","Geen verstrekking in Open Data","55048","Nee","146","980",,"3500","3500",,"0","4","0","0",,"704","220","N1",,,"schutbord by motorruimte","3500","2FJZ",,"e1*2007/46*0524*07","PD4D1350N","LEB34WD6","0","0.05","432","Ja","Nee",,"Nee","7000","0","0.00","2023","Geen oordeel","05","Nee","2024-03-10T00:00:00.000",,"2014-06-20T00:00:00.000","2020-08-11T00:00:00.000",,,,,,,,,,,,,,,,,,,,,,,,,,,,"https://opendata.rdw.nl/resource/3huj-srit.json","https://opendata.rdw.nl/resource/8ys7-d773.json","https://opendata.rdw.nl/resource/vezc-m2t6.json","https://opendata.rdw.nl/resource/jhie-znh9.json","https://opendata.rdw.nl/resource/kmfi-hrps.json"
"VF414B","Bedrijfsauto","VOLKSWAGEN","CRAFTER","20230702",,"10636","neerklapbare zijschotten","3","N.v.t.","N.v.t.","4","1968","2270","3200","2370","750",,"20130627","20130627","Geen verstrekking in Open Data","43899","Nee",,"930",,"2800","2800",,,"4",,,,,"210","N1",,,"schutbord motorruimte","3200","2FJE2",,,,,,"0.05","433","Ja","Nee",,"Nee","6000",,,"2024","Logisch","00","Nee","2023-07-02T00:00:00.000",,"2013-06-27T00:00:00.000","2013-06-27T00:00:00.000",,"0",,,,,,,,,,,,,,,,,,,,,,,,,,"https://opendata.rdw.nl/resource/3huj-srit.json","https://opendata.rdw.nl/resource/8ys7-d773.json","https://opendata.rdw.nl/resource/vezc-m2t6.json","https://opendata.rdw.nl/resource/jhie-znh9.json","https://opendata.rdw.nl/resource/kmfi-hrps.json"
"VG083R","Bedrijfsauto","VOLKSWAGEN","CRAFTER","20230221",,"11716","neerklapbare zijschotten","3","N.v.t.","N.v.t.","4","1968","2990","3500","3090","750",,"20131219","20131219","Geen verstrekking in Open Data","48446","Nee",,"510",,"3500","3500",,,"4",,,,,"220","N1",,,"r. motorruimte","3500","2FJZ",,,,,,"0.03","367","Ja","Nee",,"Nee","7000",,,"2023","Logisch","00","Nee","2023-02-21T00:00:00.000",,"2013-12-19T00:00:00.000","2013-12-19T00:00:00.000",,"0",,,,,,,,,,,,,,,,,,,,,,,,,,"https://opendata.rdw.nl/resource/3huj-srit.json","https://opendata.rdw.nl/resource/8ys7-d773.json","https://opendata.rdw.nl/resource/vezc-m2t6.json","https://opendata.rdw.nl/resource/jhie-znh9.json","https://opendata.rdw.nl/resource/kmfi-hrps.json"
"VH371K","Bedrijfsauto","VOLKSWAGEN","VOLKSWAGEN CRAFTER","20240803",,"10139","neerklapbare zijschotten","7","N.v.t.","N.v.t.","5","2461","1929","3500","2029","750",,"20090519","20140324","Geen verstrekking in Open Data",,"Nee",,"1571",,"2800","2800",,,"4",,,,,"210","N1",,,"schutbord","3500","CRAFTER",,,,,,"0.05","432","Ja","Nee",,"Nee","6300",,,"2023","Geen oordeel","05","Nee","2024-08-03T00:00:00.000",,"2009-05-19T00:00:00.000","2014-03-24T00:00:00.000",,"0",,,,,,,,,,,,,,,,,,,,,,,,,,"https://opendata.rdw.nl/resource/3huj-srit.json","https://opendata.rdw.nl/resource/8ys7-d773.json","https://opendata.rdw.nl/resource/vezc-m2t6.json","https://opendata.rdw.nl/resource/jhie-znh9.json","https://opendata.rdw.nl/resource/kmfi-hrps.json"
"VH864S","Bedrijfsauto","VOLKSWAGEN","CRAFTER","20230120",,"12027","neerklapbare zijschotten","3","N.v.t.","N.v.t.","4","1968","2490","3500","2590","750",,"20140402","20140402","Geen verstrekking in Open Data","49755","Nee",,"1010",,"3500","3500",,,"4",,,,,"210","N1",,,"r. motorruimte","3500","2FJZ",,,,,,"0.05","433","Ja","Nee","20220525","Nee",,,,"2022","Logisch","00","Nee","2023-01-20T00:00:00.000",,"2014-04-02T00:00:00.000","2014-04-02T00:00:00.000","2022-05-25T00:00:00.000","0",,,,,,,,,,,,,,,,,,,,,,,,,,"https://opendata.rdw.nl/resource/3huj-srit.json","https://opendata.rdw.nl/resource/8ys7-d773.json","https://opendata.rdw.nl/resource/vezc-m2t6.json","https://opendata.rdw.nl/resource/jhie-znh9.json","https://opendata.rdw.nl/resource/kmfi-hrps.json"
"VJ142P","Bedrijfsauto","VOLKSWAGEN","CRAFTER","20240623","20240417","11686","neerklapbare zijschotten","3","N.v.t.","N.v.t.","4","1968","2500","3500","2600","750",,"20140623","20140623","Geen verstrekking in Open Data","48319","Ja",,"1000",,"3500","3500",,,"4",,,,,"215","N1",,,"r. motorruimte","3500","2FJZ",,,,,,"0.04","367","Ja","Nee",,"Nee","7000",,,"2024","Logisch","00","Nee","2024-06-23T00:00:00.000","2024-04-17T00:00:00.000","2014-06-23T00:00:00.000","2014-06-23T00:00:00.000",,"0",,,,,,,,,,,,,,,,,,,,,,,,,,"https://opendata.rdw.nl/resource/3huj-srit.json","https://opendata.rdw.nl/resource/8ys7-d773.json","https://opendata.rdw.nl/resource/vezc-m2t6.json","https://opendata.rdw.nl/resource/jhie-znh9.json","https://opendata.rdw.nl/resource/kmfi-hrps.json"
"VJ476N","Bedrijfsauto","VOLKSWAGEN","CRAFTER","20240621","20220201","13530","neerklapbare zijschotten","6","N.v.t.","N.v.t.","4","1968","2565","3500","2665","750",,"20140619","20140619","Geen verstrekking in Open Data","56080","Ja",,"935",,"3500","3500",,,"4",,,,,"217","N1",,,"r. motorruimte","3500","2FJZ",,,,,,"0.05","367","Ja","Nee","20240610","Nee","7000",,,"2024","Niet geregistreerd","NG","Nee","2024-06-21T00:00:00.000","2022-02-01T00:00:00.000","2014-06-19T00:00:00.000","2014-06-19T00:00:00.000","2024-06-10T00:00:00.000","0",,,,,,,,,,,,,,,,,,,,,,,,,,"https://opendata.rdw.nl/resource/3huj-srit.json","https://opendata.rdw.nl/resource/8ys7-d773.json","https://opendata.rdw.nl/resource/vezc-m2t6.json","https://opendata.rdw.nl/resource/jhie-znh9.json","https://opendata.rdw.nl/resource/kmfi-hrps.json"
"VJ598X","Bedrijfsauto","VOLKSWAGEN","CRAFTER","20240818","20190227","12052","neerklapbare zijschotten","3","N.v.t.","N.v.t.","4","1968","2630","3500","2730","750",,"20140728","20140728","Geen verstrekking in Open Data","49858","Ja",,"870",,"2000","2000",,,"4",,,,,"220","N1",,,"r. motorruimte","3500","2FJZ",,,,,,"0.04","433","Ja","Nee","20230316","Nee","5500",,,"2024","Logisch","00","Nee","2024-08-18T00:00:00.000","2019-02-27T00:00:00.000","2014-07-28T00:00:00.000","2014-07-28T00:00:00.000","2023-03-16T00:00:00.000","0",,,,,,,,,,,,,,,,,,,,,,,,,,"https://opendata.rdw.nl/resource/3huj-srit.json","https://opendata.rdw.nl/resource/8ys7-d773.json","https://opendata.rdw.nl/resource/vezc-m2t6.json","https://opendata.rdw.nl/resource/jhie-znh9.json","https://opendata.rdw.nl/resource/kmfi-hrps.json"
"VK230G","Bedrijfsauto","VOLKSWAGEN","CRAFTER","20221003",,"13313","neerklapbare zijschotten","6","N.v.t.","N.v.t.","4","1968","2715","3500","2815","750",,"20141003","20141003","Geen verstrekking in Open Data","55167","Nee",,"785",,"3500","3500",,,"4",,,,,"211","N1",,,"r. motorruimte","3500","2FJZ",,,,,,"0.04","473","Ja","Nee",,"Nee","7000",,,"2022","Logisch","00","Nee","2022-10-03T00:00:00.000",,"2014-10-03T00:00:00.000","2014-10-03T00:00:00.000",,"0",,,,,,,,,,,,,,,,,,,,,,,,,,"https://opendata.rdw.nl/resource/3huj-srit.json","https://opendata.rdw.nl/resource/8ys7-d773.json","https://opendata.rdw.nl/resource/vezc-m2t6.json","https://opendata.rdw.nl/resource/jhie-znh9.json","https://opendata.rdw.nl/resource/kmfi-hrps.json"
"VK935T","Bedrijfsauto","VOLKSWAGEN","CRAFTER","20221130",,"11266","neerklapbare zijschotten","3","N.v.t.","N.v.t.","5","2461","2287","3500","2387",,,"20090925","20141103","Geen verstrekking in Open Data",,"Nee",,"1213",,"2000","2000",,,"4",,,,,"220","N1",,,"r. schutbord","3500",,,,,,,"0.05","432","Ja","Nee",,"Nee","5500",,,"2023","Geen oordeel","05","Nee","2022-11-30T00:00:00.000",,"2009-09-25T00:00:00.000","2014-11-03T00:00:00.000",,"0",,,,,,,,,,,,,,,,,,,,,,,,,,"https://opendata.rdw.nl/resource/3huj-srit.json","https://opendata.rdw.nl/resource/8ys7-d773.json","https://opendata.rdw.nl/resource/vezc-m2t6.json","https://opendata.rdw.nl/resource/jhie-znh9.json","https://opendata.rdw.nl/resource/kmfi-hrps.json"
"VN403T","Bedrijfsauto","VOLKSWAGEN","CRAFTER","20230806",,"9811","neerklapbare zijschotten","7","N.v.t.","N.v.t.","5","2461","2275","3500","2375","750",,"20110524","20150807","Geen verstrekking in Open Data","40424","Nee",,"1225",,"3500","3500",,"0","4","0","0",,"614","209","N1",,,"schutbord motorruimte","3500","2FJE2",,"e1*2007/46*0522*01","PD5B1350E","MAD2AXD7","0","0.03","367","Ja","Nee",,"Nee","7000","0",,"2023","Geen oordeel","05","Nee","2023-08-06T00:00:00.000",,"2011-05-24T00:00:00.000","2015-08-07T00:00:00.000",,"0",,,,,,,,,,,,,,,,,,,,,,,,,,"https://opendata.rdw.nl/resource/3huj-srit.json","https://opendata.rdw.nl/resource/8ys7-d773.json","https://opendata.rdw.nl/resource/vezc-m2t6.json","https://opendata.rdw.nl/resource/jhie-znh9.json","https://opendata.rdw.nl/resource/kmfi-hrps.json"
"VP982L","Bedrijfsauto","VOLKSWAGEN","CRAFTER","20230627",,"11094","neerklapbare zijschotten","7","N.v.t.","N.v.t.","5","2461","2138","3500","2238","750",,"20110426","20150626","Geen verstrekking in Open Data","45827","Nee",,"1362",,"2800","2800",,,"4",,,,,"210","N1",,,"by schutbord r.","3500","2FF-BJL-MD",,,,,,"0.04","368","Ja","Nee",,"Nee","6300",,,"2023","Geen oordeel","05","Nee","2023-06-27T00:00:00.000",,"2011-04-26T00:00:00.000","2015-06-26T00:00:00.000",,"0",,,,,,,,,,,,,,,,,,,,,,,,,,"https://opendata.rdw.nl/resource/3huj-srit.json","https://opendata.rdw.nl/resource/8ys7-d773.json","https://opendata.rdw.nl/resource/vezc-m2t6.json","https://opendata.rdw.nl/resource/jhie-znh9.json","https://opendata.rdw.nl/resource/kmfi-hrps.json"
"VRJ77Z","Bedrijfsauto","VOLKSWAGEN","CRAFTER",,,"13041","neerklapbare zijschotten","3","N.v.t.","N.v.t.","4","1968","2133","3500","2233","750",,"20160229","20220704","Geen verstrekking in Open Data","54023","Nee",,"1367",,"3500","3500",,"2","4","0","0",,"693","209","N1",,,,"3500","2FJE2",,"e1*2007/46*0522*10","PF4D1350N","LEC24UD3","1","0.05","433","Ja","Nee",,"Nee","7000","0","0.00","2022","Geen oordeel","05","Nee",,,"2016-02-29T00:00:00.000","2022-07-04T00:00:00.000",,,,,,,,,,,,,,,,,,,,,,"20220701","2022-07-01T00:00:00.000",,,,,"https://opendata.rdw.nl/resource/3huj-srit.json","https://opendata.rdw.nl/resource/8ys7-d773.json","https://opendata.rdw.nl/resource/vezc-m2t6.json","https://opendata.rdw.nl/resource/jhie-znh9.json","https://opendata.rdw.nl/resource/kmfi-hrps.json"
"VRS12L","Bedrijfsauto","VOLKSWAGEN","CRAFTER",,,"15707","neerklapbare zijschotten","7","N.v.t.","N.v.t.","4","1968","2457","3500","2557","750",,"20211213","20230317","Geen verstrekking in Open Data","65244","Nee","158","1043",,"3500","3500",,"4","6",,,,"710","220","N1",,,,"3500","SZN1Z",,,,,,"0.05","449","Ja","Nee",,"Nee","7000",,,"2023","Geen oordeel","05","Nee",,,"2021-12-13T00:00:00.000","2023-03-17T00:00:00.000",,,,,,,,,,,,,,,,,,,,,,"20220630","2022-06-30T00:00:00.000",,,,,"https://opendata.rdw.nl/resource/3huj-srit.json","https://opendata.rdw.nl/resource/8ys7-d773.json","https://opendata.rdw.nl/resource/vezc-m2t6.json","https://opendata.rdw.nl/resource/jhie-znh9.json","https://opendata.rdw.nl/resource/kmfi-hrps.json"
"VSH94Z","Bedrijfsauto","VOLKSWAGEN","CRAFTER","20231021",,"12781","neerklapbare zijschotten","7","N.v.t.","N.v.t.","4","1968","2127","3500","2227","750","3000","20180321","20221019","Geen verstrekking in Open Data","52928","Nee","149","1373",,"3000","3000",,"4","4","0","0",,"700","210","N1",,,,"3500","SZN1E",,"e1*2007/46*1619*04","SZIB4ADAUAV4","PN350VSFM6AX002617MMC7DOVW","0","0.05","449","Ja","Nee",,"Nee","6000","0","0.00","2022","Geen oordeel","05","Nee","2023-10-21T00:00:00.000",,"2018-03-21T00:00:00.000","2022-10-19T00:00:00.000",,,,,,,,,,,,,,,,,,,,,,"20221018","2022-10-18T00:00:00.000",,,,,"https://opendata.rdw.nl/resource/3huj-srit.json","https://opendata.rdw.nl/resource/8ys7-d773.json","https://opendata.rdw.nl/resource/vezc-m2t6.json","https://opendata.rdw.nl/resource/jhie-znh9.json","https://opendata.rdw.nl/resource/kmfi-hrps.json"
"VZH73K","Bedrijfsauto","VOLKSWAGEN","CRAFTER",,,"12864","neerklapbare zijschotten","7","N.v.t.","N.v.t.","4","1968","2127","3500","2227","750","3000","20190607","20231129","Geen verstrekking in Open Data","53278","Nee",,"1373",,"3000","3000",,"4","4","0","0",,"700","210","N1",,,,"3500","SZN1E",,"e1*2007/46*1619*08","SZIB4ADAUAV4","PN350VSFM6AX002647MMC7DOVW","0","0.05","449","Ja","Nee",,"Nee","6000","0","0.00","2023","Geen oordeel","05","Nee",,,"2019-06-07T00:00:00.000","2023-11-29T00:00:00.000",,,,,,,,,,,,,,,,,,,,,,"20231030","2023-10-30T00:00:00.000",,,,,"https://opendata.rdw.nl/resource/3huj-srit.json","https://opendata.rdw.nl/resource/8ys7-d773.json","https://opendata.rdw.nl/resource/vezc-m2t6.json","https://opendata.rdw.nl/resource/jhie-znh9.json","https://opendata.rdw.nl/resource/kmfi-hrps.json"
"VZH76R","Bedrijfsauto","VOLKSWAGEN","CRAFTER",,"20240319","10376","neerklapbare zijschotten","7","N.v.t.","N.v.t.","4","1968","2207","3500","2307","750","2500","20190730","20240319","Geen verstrekking in Open Data","42804","Ja",,"1293",,"2500","2500",,"4","4",,,,"700","210","N1",,,,"3500","SZN1E",,,,,,"0.03","449","Ja","Nee",,"Nee","5500",,,"2024","Geen oordeel","05","Nee",,"2024-03-19T00:00:00.000","2019-07-30T00:00:00.000","2024-03-19T00:00:00.000",,,,,,,,,,,,,,,,,,,,,,"20231031","2023-10-31T00:00:00.000",,,,,"https://opendata.rdw.nl/resource/3huj-srit.json","https://opendata.rdw.nl/resource/8ys7-d773.json","https://opendata.rdw.nl/resource/vezc-m2t6.json","https://opendata.rdw.nl/resource/jhie-znh9.json","https://opendata.rdw.nl/resource/kmfi-hrps.json"
"VZX56T","Bedrijfsauto","VOLKSWAGEN","CRAFTER",,"20240105","13482","neerklapbare zijschotten","3","N.v.t.","N.v.t.","4","1968","2560","3500","2660","750",,"20140424","20240102","Geen verstrekking in Open Data","55879","Ja","147","940",,"3500","3500",,"2","4",,"681",,"676","210","N1",,,,"3500","2FJE2",,,,,,"0.05","433","Ja","Nee",,"Nee","7000",,,"2024","Niet geregistreerd","NG","Nee",,"2024-01-05T00:00:00.000","2014-04-24T00:00:00.000","2024-01-02T00:00:00.000",,,,,,,,,,,"247",,,,,,,,,,,"20231117","2023-11-17T00:00:00.000",,,,,"https://opendata.rdw.nl/resource/3huj-srit.json","https://opendata.rdw.nl/resource/8ys7-d773.json","https://opendata.rdw.nl/resource/vezc-m2t6.json","https://opendata.rdw.nl/resource/jhie-znh9.json","https://opendata.rdw.nl/resource/kmfi-hrps.json"
