"kenteken","voertuigsoort","merk","handelsbenaming","vervaldatum_apk","datum_tenaamstelling","bruto_bpm","inrichting","aantal_zitplaatsen","eerste_kleur","tweede_kleur","aantal_cilinders","cilinderinhoud","massa_ledig_voertuig","toegestane_maximum_massa_voertuig","massa_rijklaar","maximum_massa_trekken_ongeremd","maximum_trekken_massa_geremd","datum_eerste_toelating","datum_eerste_tenaamstelling_in_nederland","wacht_op_keuren","catalogusprijs","wam_verzekerd","maximale_constructiesnelheid","laadvermogen","oplegger_geremd","aanhangwagen_autonoom_geremd","aanhangwagen_middenas_geremd","aantal_staanplaatsen","aantal_deuren","aantal_wielen","afstand_hart_koppeling_tot_achterzijde_voertuig","afstand_voorzijde_voertuig_tot_hart_koppeling","afwijkende_maximum_snelheid","lengte","breedte","europese_voertuigcategorie","europese_voertuigcategorie_toevoeging","europese_uitvoeringcategorie_toevoeging","plaats_chassisnummer","technische_max_massa_voertuig","type","type_gasinstallatie","typegoedkeuringsnummer","variant","uitvoering","volgnummer_wijziging_eu_typegoedkeuring","vermogen_massarijklaar","wielbasis","export_indicator","openstaande_terugroepactie_indicator","vervaldatum_tachograaf","taxi_indicator","maximum_massa_samenstelling","aantal_rolstoelplaatsen","maximum_ondersteunende_snelheid","jaar_laatste_registratie_tellerstand","tellerstandoordeel","code_toelichting_tellerstandoordeel","tenaamstellen_mogelijk","vervaldatum_apk_dt","datum_tenaamstelling_dt","datum_eerste_toelating_dt","datum_eerste_tenaamstelling_in_nederland_dt","vervaldatum_tachograaf_dt","maximum_last_onder_de_vooras_sen_tezamen_koppeling","type_remsysteem_voertuig_code","rupsonderstelconfiguratiecode","wielbasis_voertuig_minimum","wielbasis_voertuig_maximum","lengte_voertuig_minimum","lengte_voertuig_maximum","breedte_voertuig_minimum","breedte_voertuig_maximum","hoogte_voertuig","hoogte_voertuig_minimum","hoogte_voertuig_maximum","massa_bedrijfsklaar_minimaal","massa_bedrijfsklaar_maximaal","technisch_toelaatbaar_massa_koppelpunt","maximum_massa_technisch_maximaal","maximum_massa_technisch_minimaal","subcategorie_nederland","verticale_belasting_koppelpunt_getrokken_voertuig","zuinigheidsclassificatie","registratie_datum_goedkeuring_afschrijvingsmoment_bpm","registratie_datum_goedkeuring_afschrijvingsmoment_bpm_dt","gem_lading_wrde","aerodyn_voorz","massa_alt_aandr","verl_cab_ind","api_gekentekende_voertuigen_assen","api_gekentekende_voertuigen_brandstof","api_gekentekende_voertuigen_carrosserie","api_gekentekende_voertuigen_carrosserie_specifiek","api_gekentekende_voertuigen_voertuigklasse"
"01XZB5","Personenauto","VOLKSWAGEN","KOMBI","20231117",,"14247","ambulance","4","GEEL","Niet geregistreerd","4","1968","2240","3200","2340","750","2500","20120919","20120919","Geen verstrekking in Open Data",,"Nee",,,,,,,"4","4",,,,,,"M1",,,"by schutbord","3200",,,,,,,"0.04","340","Ja","Nee",,"Nee","5300",,,"2022","Onlogisch","04","Nee","2023-11-17T00:00:00.000",,"2012-09-19T00:00:00.000","2012-09-19T00:00:00.000",,"0",,,,,,,,,,,,,,,,,,,,,,,,,,"https://opendata.rdw.nl/resource/3huj-srit.json","https://opendata.rdw.nl/resource/8ys7-d773.json","https://opendata.rdw.nl/resource/vezc-m2t6.json","https://opendata.rdw.nl/resource/jhie-znh9.json","https://opendata.rdw.nl/resource/kmfi-hrps.json"
"22KJT7","Personenauto","VOLKSWAGEN","TRANSPORTER","20240104",,"26691","ambulance","4","GEEL","Niet geregistreerd","5","2461","2240","3000","2340","750","2500","20100104","20100104","Geen verstrekking in Open Data",,"Nee",,,,,,,"4","4",,,,,,"M1",,,"schutbord motorruimte","3000",,,,,,,"0.04","340","Ja","Nee",,"Nee","5200",,,"2023","Logisch","00","Nee","2024-01-04T00:00:00.000",,"2010-01-04T00:00:00.000","2010-01-04T00:00:00.000",,"0",,,,,,,,,,,,,,,,,,,,,,,,,,"https://opendata.rdw.nl/resource/3huj-srit.json","https://opendata.rdw.nl/resource/8ys7-d773.json","https://opendata.rdw.nl/resource/vezc-m2t6.json","https://opendata.rdw.nl/resource/jhie-znh9.json","https://opendata.rdw.nl/resource/kmfi-hrps.json"
"2XTD68","Personenauto","VOLKSWAGEN","KOMBI","20240115",,"14247","ambulance","3","GEEL","Niet geregistreerd","4","1968","2562","3200","2662","750","2500","20150115","20150115","Geen verstrekking in Open Data",,"Nee",,,,,,,"3","4",,,,,,"M1",,,"by schutbord","3200",,,,,,,"0.05","340","Ja","Nee",,"Nee","5300",,,"2023","Logisch","00","Nee","2024-01-15T00:00:00.000",,"2015-01-15T00:00:00.000","2015-01-15T00:00:00.000",,"0",,,,,,,,,,,,,,,,,,,,,,,,,,"https://opendata.rdw.nl/resource/3huj-srit.json","https://opendata.rdw.nl/resource/8ys7-d773.json","https://opendata.rdw.nl/resource/vezc-m2t6.json","https://opendata.rdw.nl/resource/jhie-znh9.json","https://opendata.rdw.nl/resource/kmfi-hrps.json"
"33SVXJ","Personenauto","VOLKSWAGEN","TRANSPORTER AMBULANCE TDI 128KW HD 1.2 AUT","20230907",,"15062","ambulance",,"GEEL","Niet geregistreerd","5","2461","2500","3000","2600",,,"20060518","20060518","Geen verstrekking in Open Data",,"Nee",,,,,,,"4","4",,,,,,"M1",,,"midden tegen schutbord onder motorkap","3000",,,,,,,"0.05","340","Ja","Nee",,"Nee",,,,"2023","Niet geregistreerd","NG","Nee","2023-09-07T00:00:00.000",,"2006-05-18T00:00:00.000","2006-05-18T00:00:00.000",,"0",,,,,,,,,,,,,,,,,,,,,,,,,,"https://opendata.rdw.nl/resource/3huj-srit.json","https://opendata.rdw.nl/resource/8ys7-d773.json","https://opendata.rdw.nl/resource/vezc-m2t6.json","https://opendata.rdw.nl/resource/jhie-znh9.json","https://opendata.rdw.nl/resource/kmfi-hrps.json"
"43TKP8","Personenauto","VOLKSWAGEN","KOMBI","20230417",,"14247","ambulance","3","GEEL","Niet geregistreerd","4","1968","2556","3200","2656","750","2500","20120308","20120308","Geen verstrekking in Open Data","37100","Nee",,,,,,,"3","4",,,,,,"M1",,,"by schutbord","3200",,,,,,,"0.05","340","Ja","Nee",,"Nee","5300",,,"2022","Logisch","00","Nee","2023-04-17T00:00:00.000",,"2012-03-08T00:00:00.000","2012-03-08T00:00:00.000",,"0",,,,,,,,,,,,,,,,,,,,,,,,,,"https://opendata.rdw.nl/resource/3huj-srit.json","https://opendata.rdw.nl/resource/8ys7-d773.json","https://opendata.rdw.nl/resource/vezc-m2t6.json","https://opendata.rdw.nl/resource/jhie-znh9.json","https://opendata.rdw.nl/resource/kmfi-hrps.json"
"47LDH8","Personenauto","VOLKSWAGEN","CRAFTER","20230403",,"29190","ambulance","9","WIT","Niet geregistreerd","5","2461","2720","3500","2820","750","2000","20100330","20100330","Geen verstrekking in Open Data","65324","Nee",,,,,,,"0","4","0","0",,"0","0","M1",,,"midden tegen schutbord onder motorkap","3500","2EC2",,"e1*2001/116*0356*08","KM5B1350E","LAC2AXA9","0","0.03","433","Ja","Nee",,"Nee","5500","0","0.00","2022","Logisch","00","Nee","2023-04-03T00:00:00.000",,"2010-03-30T00:00:00.000","2010-03-30T00:00:00.000",,"0",,,,,,,,,,,,,,,,,,,"A",,,,,,,"https://opendata.rdw.nl/resource/3huj-srit.json","https://opendata.rdw.nl/resource/8ys7-d773.json","https://opendata.rdw.nl/resource/vezc-m2t6.json","https://opendata.rdw.nl/resource/jhie-znh9.json","https://opendata.rdw.nl/resource/kmfi-hrps.json"
"4TZF26","Personenauto","VOLKSWAGEN","KOMBI","20230710",,"14247","ambulance","3","GEEL","Niet geregistreerd","4","1968","2555","3200","2655","750","2500","20140710","20140710","Geen verstrekking in Open Data",,"Nee",,,,,,,"3","4",,,,,,"M1",,,"by schutbord","3200",,,,,,,"0.05","340","Ja","Nee",,"Nee","5300",,,"2022","Logisch","00","Nee","2023-07-10T00:00:00.000",,"2014-07-10T00:00:00.000","2014-07-10T00:00:00.000",,"0",,,,,,,,,,,,,,,,,,,,,,,,,,"https://opendata.rdw.nl/resource/3huj-srit.json","https://opendata.rdw.nl/resource/8ys7-d773.json","https://opendata.rdw.nl/resource/vezc-m2t6.json","https://opendata.rdw.nl/resource/jhie-znh9.json","https://opendata.rdw.nl/resource/kmfi-hrps.json"
"52HHK5","Personenauto","VOLKSWAGEN","TRANSPORTER",,,"30962","ambulance","4","GEEL","Niet geregistreerd","5","2461","2735","3500","2835","750","2500","20081126","20081126","Geen verstrekking in Open Data",,"Nee",,,,,,,"4","4",,,,,,"M1",,,"schutbord motorruimte","3500",,,,,,,"0.05","340","Ja","Nee",,"Nee","5200",,,"2022","Geen oordeel","07","Nee",,,"2008-11-26T00:00:00.000","2008-11-26T00:00:00.000",,"0",,,,,,,,,,,,,,,,,,,,,,,,,,"https://opendata.rdw.nl/resource/3huj-srit.json","https://opendata.rdw.nl/resource/8ys7-d773.json","https://opendata.rdw.nl/resource/vezc-m2t6.json","https://opendata.rdw.nl/resource/jhie-znh9.json","https://opendata.rdw.nl/resource/kmfi-hrps.json"
"5TKK35","Personenauto","VOLKSWAGEN","KOMBI","20240419","20231205","14247","ambulance","3","GEEL","Niet geregistreerd","4","1968","2555","3400","2655","750","2500","20140415","20140415","Geen verstrekking in Open Data",,"Nee",,,,,,,"3","4",,,,,,"M1",,,"by schutbord","3400",,,,,,,"0.05","340","Ja","Nee",,"Nee","5300",,,"2024","Logisch","00","Nee","2024-04-19T00:00:00.000","2023-12-05T00:00:00.000","2014-04-15T00:00:00.000","2014-04-15T00:00:00.000",,,,,,,,,,,,,,,,,,,,,,,,,,,,"https://opendata.rdw.nl/resource/3huj-srit.json","https://opendata.rdw.nl/resource/8ys7-d773.json","https://opendata.rdw.nl/resource/vezc-m2t6.json","https://opendata.rdw.nl/resource/jhie-znh9.json","https://opendata.rdw.nl/resource/kmfi-hrps.json"
"73NZD2","Personenauto","VOLKSWAGEN","KOMBI","20250321","20240104","13545","ambulance","3","GEEL","Niet geregistreerd","4","1968","2401","3000","2501","750","2500","20110127","20110127","Geen verstrekking in Open Data",,"Ja",,,,,,,"4","4",,,,,,"M1",,,"by schutbord","3000",,,,,,,"0.05","340","Ja","Nee",,"Nee","5300",,,"2024","Logisch","00","Nee","2025-03-21T00:00:00.000","2024-01-04T00:00:00.000","2011-01-27T00:00:00.000","2011-01-27T00:00:00.000",,"0",,,,,,,,,,,,,,,,,,,,,,,,,,"https://opendata.rdw.nl/resource/3huj-srit.json","https://opendata.rdw.nl/resource/8ys7-d773.json","https://opendata.rdw.nl/resource/vezc-m2t6.json","https://opendata.rdw.nl/resource/jhie-znh9.json","https://opendata.rdw.nl/resource/kmfi-hrps.json"
"78KKH4","Personenauto","VOLKSWAGEN","TRANSPORTER","20240104",,"26091","ambulance","4","GEEL","Niet geregistreerd","5","2461","2240","3200","2340","750","2500","20100104","20100104","Geen verstrekking in Open Data",,"Nee",,,,,,,"4","4",,,,,,"M1",,,"midden tegen schutbord onder motorkap","3200",,,,,,,"0.04","340","Ja","Nee",,"Nee","5200",,,"2023","Onlogisch","04","Nee","2024-01-04T00:00:00.000",,"2010-01-04T00:00:00.000","2010-01-04T00:00:00.000",,"0",,,,,,,,,,,,,,,,,,,,,,,,,,"https://opendata.rdw.nl/resource/3huj-srit.json","https://opendata.rdw.nl/resource/8ys7-d773.json","https://opendata.rdw.nl/resource/vezc-m2t6.json","https://opendata.rdw.nl/resource/jhie-znh9.json","https://opendata.rdw.nl/resource/kmfi-hrps.json"
"86VFV7","Bedrijfsauto","VOLKSWAGEN","TRANSPORTER","20230719",,"19524","ambulance",,"N.v.t.","N.v.t.","5","2461","2840","3500","2940",,,"20070521","20070521","Geen verstrekking in Open Data",,"Nee",,"660",,,,,,"4",,,,,"206","N1",,,"midden tegen schutbord onder motorkap","3500",,,,,,,"0.04","365","Ja","Nee",,"Nee",,,,"2023","Logisch","00","Nee","2023-07-19T00:00:00.000",,"2007-05-21T00:00:00.000","2007-05-21T00:00:00.000",,"0",,,,,,,,,,,,,,,,,,,,,,,,,,"https://opendata.rdw.nl/resource/3huj-srit.json","https://opendata.rdw.nl/resource/8ys7-d773.json","https://opendata.rdw.nl/resource/vezc-m2t6.json","https://opendata.rdw.nl/resource/jhie-znh9.json","https://opendata.rdw.nl/resource/kmfi-hrps.json"
"8XRF04","Personenauto","VOLKSWAGEN","KOMBI","20231030",,"14247","ambulance","3","GEEL","Niet geregistreerd","4","1968","2560","3200","2660","750","2500","20141030","20141030","Geen verstrekking in Open Data",,"Nee",,,,,,,"3","4",,,,,,"M1",,,"by schutbord","3200",,,,,,,"0.05","340","Ja","Nee",,"Nee","5300",,,"2023","Logisch","00","Nee","2023-10-30T00:00:00.000",,"2014-10-30T00:00:00.000","2014-10-30T00:00:00.000",,"0",,,,,,,,,,,,,,,,,,,,,,,,,,"https://opendata.rdw.nl/resource/3huj-srit.json","https://opendata.rdw.nl/resource/8ys7-d773.json","https://opendata.rdw.nl/resource/vezc-m2t6.json","https://opendata.rdw.nl/resource/jhie-znh9.json","https://opendata.rdw.nl/resource/kmfi-hrps.json"
"8XRF05","Personenauto","VOLKSWAGEN","KOMBI","20230925",,"14247","ambulance","3","GEEL","Niet geregistreerd","4","1968","2560","3200","2660","750","2500","20141125","20141125","Geen verstrekking in Open Data",,"Nee",,,,,,,"3","4",,,,,,"M1",,,"by schutbord","3200",,,,,,,"0.05","340","Ja","Nee",,"Nee","5300",,,"2023","Logisch","00","Nee","2023-09-25T00:00:00.000",,"2014-11-25T00:00:00.000","2014-11-25T00:00:00.000",,"0",,,,,,,,,,,,,,,,,,,,,,,,,,"https://opendata.rdw.nl/resource/3huj-srit.json","https://opendata.rdw.nl/resource/8ys7-d773.json","https://opendata.rdw.nl/resource/vezc-m2t6.json","https://opendata.rdw.nl/resource/jhie-znh9.json","https://opendata.rdw.nl/resource/kmfi-hrps.json"
"93PZS8","Personenauto","VOLKSWAGEN","KOMBI","20221222",,"13845","ambulance","3","GEEL","Niet geregistreerd","4","1968","2642","3200","2742","750","2500","20110427","20110427","Geen verstrekking in Open Data","12290","Nee",,,,,,,"3","4",,,,,,"M1",,,"by schutbord","3200",,,,,,,"0.05","340","Ja","Nee",,"Nee","5300",,,"2022","Logisch","00","Nee","2022-12-22T00:00:00.000",,"2011-04-27T00:00:00.000","2011-04-27T00:00:00.000",,"0",,,,,,,,,,,,,,,,,,,,,,,,,,"https://opendata.rdw.nl/resource/3huj-srit.json","https://opendata.rdw.nl/resource/8ys7-d773.json","https://opendata.rdw.nl/resource/vezc-m2t6.json","https://opendata.rdw.nl/resource/jhie-znh9.json","https://opendata.rdw.nl/resource/kmfi-hrps.json"
"97KDL1","Personenauto","VOLKSWAGEN","TRANSPORTER","20250301","20240306","26841","ambulance","3","GEEL","Niet geregistreerd","5","2461","2843","3000","2943",,,"20091023","20091023","Geen verstrekking in Open Data",,"Ja",,,,,,,"4","4",,,,,,"M1",,,"schutbord motorruimte","3000",,,,,,,"0.04","340","Ja","Nee",,"Nee",,,,"2024","Onlogisch","04","Nee","2025-03-01T00:00:00.000","2024-03-06T00:00:00.000","2009-10-23T00:00:00.000","2009-10-23T00:00:00.000",,,,,,,,,,,,,,,,,,,,,,,,,,,,"https://opendata.rdw.nl/resource/3huj-srit.json","https://opendata.rdw.nl/resource/8ys7-d773.json","https://opendata.rdw.nl/resource/vezc-m2t6.json","https://opendata.rdw.nl/resource/jhie-znh9.json","https://opendata.rdw.nl/resource/kmfi-hrps.json"
"GD415P","Personenauto","VOLKSWAGEN","KOMBI","20240528",,"14247","ambulance","3","GEEL","Niet geregistreerd","4","1968","2555","3200","2655","750","2500","20150528","20150528","Geen verstrekking in Open Data",,"Nee",,,,,,,"4","4",,,,,,"M1",,,"by schutbord","3200",,,,,,,"0.05","340","Ja","Nee",,"Nee","5300",,,"2023","Logisch","00","Nee","2024-05-28T00:00:00.000",,"2015-05-28T00:00:00.000","2015-05-28T00:00:00.000",,,,,,,,,,,,,,,,,,,,,,,,,,,,"https://opendata.rdw.nl/resource/3huj-srit.json","https://opendata.rdw.nl/resource/8ys7-d773.json","https://opendata.rdw.nl/resource/vezc-m2t6.json","https://opendata.rdw.nl/resource/jhie-znh9.json","https://opendata.rdw.nl/resource/kmfi-hrps.json"
"GD573P","Personenauto","VOLKSWAGEN","KOMBI","20241115",,"14247","ambulance","3","GEEL","Niet geregistreerd","4","1968","2555","3200","2655","750","2500","20150611","20150611","Geen verstrekking in Open Data",,"Nee",,,,,,,"4","4",,,,,,"M1",,,"by schutbord","3200",,,,,,,"0.05","340","Ja","Nee",,"Nee","5300",,,"2023","Logisch","00","Nee","2024-11-15T00:00:00.000",,"2015-06-11T00:00:00.000","2015-06-11T00:00:00.000",,,,,,,,,,,,,,,,,,,,,,,,,,,,"https://opendata.rdw.nl/resource/3huj-srit.json","https://opendata.rdw.nl/resource/8ys7-d773.json","https://opendata.rdw.nl/resource/vezc-m2t6.json","https://opendata.rdw.nl/resource/jhie-znh9.json","https://opendata.rdw.nl/resource/kmfi-hrps.json"
"GF089V","Personenauto","VOLKSWAGEN","KOMBI","20230718",,"14247","ambulance","3","GEEL","Niet geregistreerd","4","1968","2245","3200","2345","750","2500","20150518","20150518","Geen verstrekking in Open Data",,"Nee",,,,,,,"4","4",,,,,,"M1",,,"by schutbord","3200",,,,,,,"0.04","340","Ja","Nee",,"Nee","5300",,,"2022","Logisch","00","Nee","2023-07-18T00:00:00.000",,"2015-05-18T00:00:00.000","2015-05-18T00:00:00.000",,,,,,,,,,,,,,,,,,,,,,,,,,,,"https://opendata.rdw.nl/resource/3huj-srit.json","https://opendata.rdw.nl/resource/8ys7-d773.json","https://opendata.rdw.nl/resource/vezc-m2t6.json","https://opendata.rdw.nl/resource/jhie-znh9.json","https://opendata.rdw.nl/resource/kmfi-hrps.json"
"KL559R","Personenauto","VOLKSWAGEN","KOMBI","20230519",,"14247","ambulance","3","GEEL","Niet geregistreerd","4","1968","2521","3200","2621","750","2500","20161012","20161012","Geen verstrekking in Open Data",,"Ja",,,,,,,"4","4",,,,,,"M1",,,"by schutbord","3200","7HC",,,,,,"0.06","340","Ja","Nee",,"Nee","5300",,,"2023","Logisch","00","Nee","2023-05-19T00:00:00.000",,"2016-10-12T00:00:00.000","2016-10-12T00:00:00.000",,,,,,,,,,,,,,,,,,,,,,,,,,,,"https://opendata.rdw.nl/resource/3huj-srit.json","https://opendata.rdw.nl/resource/8ys7-d773.json","https://opendata.rdw.nl/resource/vezc-m2t6.json","https://opendata.rdw.nl/resource/jhie-znh9.json","https://opendata.rdw.nl/resource/kmfi-hrps.json"
"KL773R","Personenauto","VOLKSWAGEN","KOMBI","20230728",,"14247","ambulance","3","GEEL","Niet geregistreerd","4","1968","2521","3200","2621","750","2500","20161027","20161027","Geen verstrekking in Open Data",,"Nee",,,,,,,"4","4",,,,,,"M1",,,"by schutbord","3200","7HC",,,,,,"0.06","340","Ja","Nee",,"Nee","5300",,,"2023","Onlogisch","04","Nee","2023-07-28T00:00:00.000",,"2016-10-27T00:00:00.000","2016-10-27T00:00:00.000",,,,,,,,,,,,,,,,,,,,,,,,,,,,"https://opendata.rdw.nl/resource/3huj-srit.json","https://opendata.rdw.nl/resource/8ys7-d773.json","https://opendata.rdw.nl/resource/vezc-m2t6.json","https://opendata.rdw.nl/resource/jhie-znh9.json","https://opendata.rdw.nl/resource/kmfi-hrps.json"
"KT225G","Personenauto","VOLKSWAGEN","KOMBI","20221222",,"14247","ambulance","3","GEEL","Niet geregistreerd","4","1968","2949","3400","3049","750","2500","20161207","20161207","Geen verstrekking in Open Data",,"Nee",,,,,,,"4","4",,,,,,"M1",,,"by schutbord","3400","7HC",,,,,,"0.05","340","Ja","Nee",,"Nee","5300",,,"2022","Logisch","00","Nee","2022-12-22T00:00:00.000",,"2016-12-07T00:00:00.000","2016-12-07T00:00:00.000",,,,,,,,,,,,,,,,,,,,,,,,,,,,"https://opendata.rdw.nl/resource/3huj-srit.json","https://opendata.rdw.nl/resource/8ys7-d773.json","https://opendata.rdw.nl/resource/vezc-m2t6.json","https://opendata.rdw.nl/resource/jhie-znh9.json","https://opendata.rdw.nl/resource/kmfi-hrps.json"
"ND378X","Personenauto","VOLKSWAGEN","KOMBI","20231105",,"14247","ambulance","3","GEEL","Niet geregistreerd","4","1968","2521","3200","2621","750","2500","20170123","20170123","Geen verstrekking in Open Data",,"Nee",,,,,,,"4","4",,,,,,"M1",,,"by schutbord","3200","7HC",,,,,,"0.06","340","Ja","Nee",,"Nee","5300",,,"2023","Onlogisch","04","Nee","2023-11-05T00:00:00.000",,"2017-01-23T00:00:00.000","2017-01-23T00:00:00.000",,,,,,,,,,,,,,,,,,,,,,,,,,,,"https://opendata.rdw.nl/resource/3huj-srit.json","https://opendata.rdw.nl/resource/8ys7-d773.json","https://opendata.rdw.nl/resource/vezc-m2t6.json","https://opendata.rdw.nl/resource/jhie-znh9.json","https://opendata.rdw.nl/resource/kmfi-hrps.json"
"NN021G","Personenauto","VOLKSWAGEN","KOMBI","20230129",,"14247","ambulance","3","GEEL","Niet geregistreerd","4","1968","2521","3200","2621","750","2500","20170316","20170316","Geen verstrekking in Open Data",,"Nee",,,,,,,"4","4",,,,,,"M1",,,"by schutbord","3200","7HC",,,,,,"0.06","340","Ja","Nee",,"Nee","5300",,,"2022","Logisch","00","Nee","2023-01-29T00:00:00.000",,"2017-03-16T00:00:00.000","2017-03-16T00:00:00.000",,,,,,,,,,,,,,,,,,,,,,,,,,,,"https://opendata.rdw.nl/resource/3huj-srit.json","https://opendata.rdw.nl/resource/8ys7-d773.json","https://opendata.rdw.nl/resource/vezc-m2t6.json","https://opendata.rdw.nl/resource/jhie-znh9.json","https://opendata.rdw.nl/resource/kmfi-hrps.json"
"NN182G","Personenauto","VOLKSWAGEN","KOMBI","20230410",,"14247","ambulance","3","GEEL","Niet geregistreerd","4","1968","2521","3200","2621","750","2500","20170322","20170322","Geen verstrekking in Open Data",,"Nee",,,,,,,"4","4",,,,,,"M1",,,"by schutbord","3200","7HC",,,,,,"0.06","340","Ja","Nee",,"Nee","5300",,,"2023","Logisch","00","Nee","2023-04-10T00:00:00.000",,"2017-03-22T00:00:00.000","2017-03-22T00:00:00.000",,,,,,,,,,,,,,,,,,,,,,,,,,,,"https://opendata.rdw.nl/resource/3huj-srit.json","https://opendata.rdw.nl/resource/8ys7-d773.json","https://opendata.rdw.nl/resource/vezc-m2t6.json","https://opendata.rdw.nl/resource/jhie-znh9.json","https://opendata.rdw.nl/resource/kmfi-hrps.json"
"PJ664J","Personenauto","VOLKSWAGEN","KOMBI","20240201",,"14247","ambulance","3","GEEL","Niet geregistreerd","4","1968","2549","3200","2649","750","2500","20170704","20170704","Geen verstrekking in Open Data",,"Nee",,,,,,,"3","4",,,,,,"M1",,,"by schutbord","3200",,,,,,,"0.06","340","Ja","Nee",,"Nee","5300",,,"2023","Logisch","00","Nee","2024-02-01T00:00:00.000",,"2017-07-04T00:00:00.000","2017-07-04T00:00:00.000",,,,,,,,,,,,,,,,,,,,,,,,,,,,"https://opendata.rdw.nl/resource/3huj-srit.json","https://opendata.rdw.nl/resource/8ys7-d773.json","https://opendata.rdw.nl/resource/vezc-m2t6.json","https://opendata.rdw.nl/resource/jhie-znh9.json","https://opendata.rdw.nl/resource/kmfi-hrps.json"
"PL558T","Personenauto","VOLKSWAGEN","KOMBI","20230928",,"14247","ambulance","3","GEEL","Niet geregistreerd","4","1968","3099","3400","3199","750","2500","20170928","20170928","Geen verstrekking in Open Data",,"Nee",,,,,,,"4","4","0","0",,"0","0","M1",,,"by schutbord","3400","7HC",,"e1*2001/116*0220*46","GCXEB320X0","LNFD7BT0117NVR27MMG02L66391","0","0.05","340","Ja","Nee",,"Nee","5300","0","0.00","2022","Onlogisch","04","Nee","2023-09-28T00:00:00.000",,"2017-09-28T00:00:00.000","2017-09-28T00:00:00.000",,,,,,,,,,,,,,,,,,,,,"C",,,,,,,"https://opendata.rdw.nl/resource/3huj-srit.json","https://opendata.rdw.nl/resource/8ys7-d773.json","https://opendata.rdw.nl/resource/vezc-m2t6.json","https://opendata.rdw.nl/resource/jhie-znh9.json","https://opendata.rdw.nl/resource/kmfi-hrps.json"
"PL871H","Personenauto","VOLKSWAGEN","KOMBI","20230917",,"14247","ambulance","4","GEEL","Niet geregistreerd","4","1968","3099","3400","3199","750","2500","20170831","20170831","Geen verstrekking in Open Data",,"Nee",,,,,,,"4","4","0","0",,"0","0","M1",,,"by schutbord","3400","7HC",,"e1*2001/116*0220*46","GCXEB320X0","LNFD7BT0117NVR27MMG02L66391","0","0.05","340","Ja","Nee",,"Nee","5300","0","0.00","2022","Logisch","00","Nee","2023-09-17T00:00:00.000",,"2017-08-31T00:00:00.000","2017-08-31T00:00:00.000",,,,,,,,,,,,,,,,,,,,,"C",,,,,,,"https://opendata.rdw.nl/resource/3huj-srit.json","https://opendata.rdw.nl/resource/8ys7-d773.json","https://opendata.rdw.nl/resource/vezc-m2t6.json","https://opendata.rdw.nl/resource/jhie-znh9.json","https://opendata.rdw.nl/resource/kmfi-hrps.json"
"RD565D","Personenauto","VOLKSWAGEN","KOMBI","20221203",,"14247","ambulance","3","GEEL","Niet geregistreerd","4","1968","3099","3400","3199","750","2500","20171116","20171116","Geen verstrekking in Open Data",,"Nee",,,,,,,"4","4","0","0",,"0","0","M1",,,"by schutbord","3400","7HC",,"e1*2001/116*0220*46","GCXEB320X0","LNFD7BT0117NVR27MMG02L66391","0","0.05","340","Ja","Nee",,"Nee","5300","0","0.00","2022","Logisch","00","Nee","2022-12-03T00:00:00.000",,"2017-11-16T00:00:00.000","2017-11-16T00:00:00.000",,,,,,,,,,,,,,,,,,,,,"C",,,,,,,"https://opendata.rdw.nl/resource/3huj-srit.json","https://opendata.rdw.nl/resource/8ys7-d773.json","https://opendata.rdw.nl/resource/vezc-m2t6.json","https://opendata.rdw.nl/resource/jhie-znh9.json","https://opendata.rdw.nl/resource/kmfi-hrps.json"