"kenteken","voertuigsoort","merk","handelsbenaming","vervaldatum_apk","datum_tenaamstelling","bruto_bpm","inrichting","aantal_zitplaatsen","eerste_kleur","tweede_kleur","aantal_cilinders","cilinderinhoud","massa_ledig_voertuig","toegestane_maximum_massa_voertuig","massa_rijklaar","maximum_massa_trekken_ongeremd","maximum_trekken_massa_geremd","datum_eerste_toelating","datum_eerste_tenaamstelling_in_nederland","wacht_op_keuren","catalogusprijs","wam_verzekerd","maximale_constructiesnelheid","laadvermogen","oplegger_geremd","aanhangwagen_autonoom_geremd","aanhangwagen_middenas_geremd","aantal_staanplaatsen","aantal_deuren","aantal_wielen","afstand_hart_koppeling_tot_achterzijde_voertuig","afstand_voorzijde_voertuig_tot_hart_koppeling","afwijkende_maximum_snelheid","lengte","breedte","europese_voertuigcategorie","europese_voertuigcategorie_toevoeging","europese_uitvoeringcategorie_toevoeging","plaats_chassisnummer","technische_max_massa_voertuig","type","type_gasinstallatie","typegoedkeuringsnummer","variant","uitvoering","volgnummer_wijziging_eu_typegoedkeuring","vermogen_massarijklaar","wielbasis","export_indicator","openstaande_terugroepactie_indicator","vervaldatum_tachograaf","taxi_indicator","maximum_massa_samenstelling","aantal_rolstoelplaatsen","maximum_ondersteunende_snelheid","jaar_laatste_registratie_tellerstand","tellerstandoordeel","code_toelichting_tellerstandoordeel","tenaamstellen_mogelijk","vervaldatum_apk_dt","datum_tenaamstelling_dt","datum_eerste_toelating_dt","datum_eerste_tenaamstelling_in_nederland_dt","vervaldatum_tachograaf_dt","maximum_last_onder_de_vooras_sen_tezamen_koppeling","type_remsysteem_voertuig_code","rupsonderstelconfiguratiecode","wielbasis_voertuig_minimum","wielbasis_voertuig_maximum","lengte_voertuig_minimum","lengte_voertuig_maximum","breedte_voertuig_minimum","breedte_voertuig_maximum","hoogte_voertuig","hoogte_voertuig_minimum","hoogte_voertuig_maximum","massa_bedrijfsklaar_minimaal","massa_bedrijfsklaar_maximaal","technisch_toelaatbaar_massa_koppelpunt","maximum_massa_technisch_maximaal","maximum_massa_technisch_minimaal","subcategorie_nederland","verticale_belasting_koppelpunt_getrokken_voertuig","zuinigheidsclassificatie","registratie_datum_goedkeuring_afschrijvingsmoment_bpm","registratie_datum_goedkeuring_afschrijvingsmoment_bpm_dt","gem_lading_wrde","aerodyn_voorz","massa_alt_aandr","verl_cab_ind","api_gekentekende_voertuigen_assen","api_gekentekende_voertuigen_brandstof","api_gekentekende_voertuigen_carrosserie","api_gekentekende_voertuigen_carrosserie_specifiek","api_gekentekende_voertuigen_voertuigklasse"
"VD570G","Bedrijfsauto","VOLKSWAGEN","CRAFTER 2EKE2 DC","20250315","20240117","12906","gesloten opbouw","7","N.v.t.","N.v.t.","4","1968","2171","3200","2271","750",,"20130418","20130418","Geen verstrekking in Open Data","53453","Ja",,"1029",,"2000","2000",,"0","4","0","0",,"591","199","N1",,,"r. motorruimte","3200","2EKE2",,"e4*NKS*0067*03","LM4E1320N","MEB2KTA7","0","0.05","367","Ja","Nee",,"Nee","5200","0","0.00","2024","Logisch","00","Nee","2025-03-15T00:00:00.000","2024-01-17T00:00:00.000","2013-04-18T00:00:00.000","2013-04-18T00:00:00.000",,"0",,,,,,,,,,,,,,,,,,,,,,,,,,"https://opendata.rdw.nl/resource/3huj-srit.json","https://opendata.rdw.nl/resource/8ys7-d773.json","https://opendata.rdw.nl/resource/vezc-m2t6.json","https://opendata.rdw.nl/resource/jhie-znh9.json","https://opendata.rdw.nl/resource/kmfi-hrps.json"
"VD853D","Bedrijfsauto","VOLKSWAGEN","CRAFTER 2EKE2 DC","20231118",,"13607","gesloten opbouw","7","N.v.t.","N.v.t.","4","1968","2180","3500","2280","750",,"20130408","20130408","Geen verstrekking in Open Data","56404","Nee",,"1320",,"2000","2000",,"0","4","0","0",,"591","199","N1",,,"r. motorruimte","3500","2EKE2",,"e4*NKS*0067*03","LM4C1350N","MEB25TA7","0","0.04","367","Ja","Nee",,"Nee","5500","0",,"2023","Logisch","00","Nee","2023-11-18T00:00:00.000",,"2013-04-08T00:00:00.000","2013-04-08T00:00:00.000",,"0",,,,,,,,,,,,,,,,,,,,,,,,,,"https://opendata.rdw.nl/resource/3huj-srit.json","https://opendata.rdw.nl/resource/8ys7-d773.json","https://opendata.rdw.nl/resource/vezc-m2t6.json","https://opendata.rdw.nl/resource/jhie-znh9.json","https://opendata.rdw.nl/resource/kmfi-hrps.json"
"VF967P","Bedrijfsauto","VOLKSWAGEN","CRAFTER 2EKE2 DC","20240913",,"13718","gesloten opbouw","7","N.v.t.","N.v.t.","4","1968","2189","3500","2289","750",,"20130913","20130913","Geen verstrekking in Open Data","56872","Nee",,"1311",,"3500","3500",,"0","4","0","0",,"591","199","N1",,,"r. motorruimte","3500","2EKE2",,"e4*NKS*0067*04","LM4E1350N","MED2KTD7","0","0.05","367","Ja","Nee",,"Nee","7000","0","0.00","2023","Logisch","00","Nee","2024-09-13T00:00:00.000",,"2013-09-13T00:00:00.000","2013-09-13T00:00:00.000",,"0",,,,,,,,,,,,,,,,,,,,,,,,,,"https://opendata.rdw.nl/resource/3huj-srit.json","https://opendata.rdw.nl/resource/8ys7-d773.json","https://opendata.rdw.nl/resource/vezc-m2t6.json","https://opendata.rdw.nl/resource/jhie-znh9.json","https://opendata.rdw.nl/resource/kmfi-hrps.json"
"VJ278P","Bedrijfsauto","VOLKSWAGEN","CRAFTER 2EKE2 DC","20221111",,"14704","gesloten opbouw","7","N.v.t.","N.v.t.","4","1968","2230","3500","2330","750",,"20140718","20140718","Geen verstrekking in Open Data","61022","Nee",,"1270",,"3500","3500",,"0","4","0","0",,"591","199","N1",,,"r. motorruimte","3500","2EKE2",,"e4*NKS*0067*07","LM4D1350N","MEC24UD7","0","0.05","367","Ja","Nee",,"Nee","7000","0",,"2022","Niet geregistreerd","NG","Nee","2022-11-11T00:00:00.000",,"2014-07-18T00:00:00.000","2014-07-18T00:00:00.000",,"0",,,,,,,,,,,,,,,,,,,,,,,,,,"https://opendata.rdw.nl/resource/3huj-srit.json","https://opendata.rdw.nl/resource/8ys7-d773.json","https://opendata.rdw.nl/resource/vezc-m2t6.json","https://opendata.rdw.nl/resource/jhie-znh9.json","https://opendata.rdw.nl/resource/kmfi-hrps.json"
"VJ471P","Bedrijfsauto","VOLKSWAGEN","CRAFTER 2EKE2 DC","20220821",,"13292","gesloten opbouw","7","N.v.t.","N.v.t.","4","1968","2267","3500","2367","750",,"20140626","20140626","Geen verstrekking in Open Data","55079","Nee",,"1233",,"2000","2000",,"0","4","0","0",,"591","199","N1",,,"r. motorruimte","3500","2EKE2",,"e4*NKS*0067*06","LM4B1350N","MEB25UA7","0","0.03","367","Ja","Nee",,"Nee","5500","0","0.00","2022","Logisch","00","Nee","2022-08-21T00:00:00.000",,"2014-06-26T00:00:00.000","2014-06-26T00:00:00.000",,"0",,,,,,,,,,,,,,,,,,,,,,,,,,"https://opendata.rdw.nl/resource/3huj-srit.json","https://opendata.rdw.nl/resource/8ys7-d773.json","https://opendata.rdw.nl/resource/vezc-m2t6.json","https://opendata.rdw.nl/resource/jhie-znh9.json","https://opendata.rdw.nl/resource/kmfi-hrps.json"
"VK793K","Bedrijfsauto","VOLKSWAGEN","CRAFTER 2EKE2 DC","20221006",,"11792","gesloten opbouw","7","N.v.t.","N.v.t.","4","1968","2128","3200","2228","750",,"20141001","20141001","Geen verstrekking in Open Data","48763","Nee",,"1072",,"2000","2000",,"0","4","0","0",,"525","199","N1",,,"r. motorruimte","3200","2EKE2",,"e4*NKS*0067*07","LN4B1320N","NEC24TA7","0","0.04","325","Ja","Nee",,"Nee","5200","0",,"2022","Logisch","00","Nee","2022-10-06T00:00:00.000",,"2014-10-01T00:00:00.000","2014-10-01T00:00:00.000",,"0",,,,,,,,,,,,,,,,,,,,,,,,,,"https://opendata.rdw.nl/resource/3huj-srit.json","https://opendata.rdw.nl/resource/8ys7-d773.json","https://opendata.rdw.nl/resource/vezc-m2t6.json","https://opendata.rdw.nl/resource/jhie-znh9.json","https://opendata.rdw.nl/resource/kmfi-hrps.json"
"VL173L","Bedrijfsauto","VOLKSWAGEN","CRAFTER 2EKE2 DC","20241102","20231218","13797","gesloten opbouw","7","N.v.t.","N.v.t.","4","1968","2236","3500","2336","750",,"20150126","20150126","Geen verstrekking in Open Data","57205","Ja",,"1264",,"3500","3500",,"0","4","0","0",,"591","199","N1",,,"r. motorruimte","3500","2EKE2",,"e4*NKS*0067*07","LM4C1350N","MED24UD7","0","0.04","367","Ja","Nee",,"Nee","7000","0",,"2024","Logisch","00","Nee","2024-11-02T00:00:00.000","2023-12-18T00:00:00.000","2015-01-26T00:00:00.000","2015-01-26T00:00:00.000",,"0",,,,,,,,,,,,,,,,,,,,,,,,,,"https://opendata.rdw.nl/resource/3huj-srit.json","https://opendata.rdw.nl/resource/8ys7-d773.json","https://opendata.rdw.nl/resource/vezc-m2t6.json","https://opendata.rdw.nl/resource/jhie-znh9.json","https://opendata.rdw.nl/resource/kmfi-hrps.json"
"VR830N","Bedrijfsauto","VOLKSWAGEN","CRAFTER 2EKE2 DC","20240221","20240320","13954","gesloten opbouw","7","N.v.t.","N.v.t.","4","1968","2213","3500","2313","750",,"20151016","20151016","Geen verstrekking in Open Data","57864","Ja",,"1287",,"3500","3500",,"0","4","0","0",,"591","199","N1",,,"r. motorruimte","3500","2EKE2",,"e4*NKS*0067*08","LM4C1350E","MED24UD7","0","0.04","367","Ja","Nee",,"Nee","7000","0",,"2024","Logisch","03","Nee","2024-02-21T00:00:00.000","2024-03-20T00:00:00.000","2015-10-16T00:00:00.000","2015-10-16T00:00:00.000",,"0",,,,,,,,,,,,,,,,,,,,,,,,,,"https://opendata.rdw.nl/resource/3huj-srit.json","https://opendata.rdw.nl/resource/8ys7-d773.json","https://opendata.rdw.nl/resource/vezc-m2t6.json","https://opendata.rdw.nl/resource/jhie-znh9.json","https://opendata.rdw.nl/resource/kmfi-hrps.json"
"VT789K","Bedrijfsauto","VOLKSWAGEN","CRAFTER 2EKE2 DC","20230225",,"15002","gesloten opbouw","7","N.v.t.","N.v.t.","4","1968","2239","3500","2339","750",,"20160225","20160225","Geen verstrekking in Open Data","62277","Nee",,"1261",,"3500","3500",,"0","4","0","0",,"591","199","N1",,,"in motorruimte a.","3500","2EKE2",,"e4*NKS*0067*09","LM4D1350N","MEC24UD7","0","0.05","367","Ja","Nee",,"Nee","7000","0","0.00","2023","Niet geregistreerd","NG","Nee","2023-02-25T00:00:00.000",,"2016-02-25T00:00:00.000","2016-02-25T00:00:00.000",,,,,,,,,,,,,,,,,,,,,,,,,,,,"https://opendata.rdw.nl/resource/3huj-srit.json","https://opendata.rdw.nl/resource/8ys7-d773.json","https://opendata.rdw.nl/resource/vezc-m2t6.json","https://opendata.rdw.nl/resource/jhie-znh9.json","https://opendata.rdw.nl/resource/kmfi-hrps.json"
"VV876D","Bedrijfsauto","VOLKSWAGEN","CRAFTER 2EKE2 DC","20230527",,"14287","gesloten opbouw","7","N.v.t.","N.v.t.","4","1968","2226","3500","2326","750",,"20160630","20160630","Geen verstrekking in Open Data","59269","Nee",,"1274",,"2800","2800",,"0","4","0","0",,"591","199","N1",,,"in motorruimte a.","3500","2EKE2",,"e4*NKS*0067*09","LM4C1350E","MED24UB7","0","0.04","367","Ja","Nee",,"Nee","6300","0","0.00","2022","Logisch","00","Nee","2023-05-27T00:00:00.000",,"2016-06-30T00:00:00.000","2016-06-30T00:00:00.000",,,,,,,,,,,,,,,,,,,,,,,,,,,,"https://opendata.rdw.nl/resource/3huj-srit.json","https://opendata.rdw.nl/resource/8ys7-d773.json","https://opendata.rdw.nl/resource/vezc-m2t6.json","https://opendata.rdw.nl/resource/jhie-znh9.json","https://opendata.rdw.nl/resource/kmfi-hrps.json"
"VX385K","Bedrijfsauto","VOLKSWAGEN","CRAFTER 2EKE2 DC","20230310",,"13533","gesloten opbouw","7","N.v.t.","N.v.t.","4","1968","2206","3500","2306","750",,"20160715","20160715","Geen verstrekking in Open Data","56095","Nee",,"1294",,"3500","3500",,"0","4","0","0",,"591","199","N1",,,"in motorruimte a.","3500","2EKE2",,"e4*NKS*0067*09","LN4D1350N","MEC24UD7","0","0.05","367","Ja","Nee",,"Nee","7000","0","0.00","2023","Logisch","00","Nee","2023-03-10T00:00:00.000",,"2016-07-15T00:00:00.000","2016-07-15T00:00:00.000",,,,,,,,,,,,,,,,,,,,,,,,,,,,"https://opendata.rdw.nl/resource/3huj-srit.json","https://opendata.rdw.nl/resource/8ys7-d773.json","https://opendata.rdw.nl/resource/vezc-m2t6.json","https://opendata.rdw.nl/resource/jhie-znh9.json","https://opendata.rdw.nl/resource/kmfi-hrps.json"
