"kenteken","voertuigsoort","merk","handelsbenaming","vervaldatum_apk","datum_tenaamstelling","bruto_bpm","inrichting","aantal_zitplaatsen","eerste_kleur","tweede_kleur","aantal_cilinders","cilinderinhoud","massa_ledig_voertuig","toegestane_maximum_massa_voertuig","massa_rijklaar","maximum_massa_trekken_ongeremd","maximum_trekken_massa_geremd","datum_eerste_toelating","datum_eerste_tenaamstelling_in_nederland","wacht_op_keuren","catalogusprijs","wam_verzekerd","maximale_constructiesnelheid","laadvermogen","oplegger_geremd","aanhangwagen_autonoom_geremd","aanhangwagen_middenas_geremd","aantal_staanplaatsen","aantal_deuren","aantal_wielen","afstand_hart_koppeling_tot_achterzijde_voertuig","afstand_voorzijde_voertuig_tot_hart_koppeling","afwijkende_maximum_snelheid","lengte","breedte","europese_voertuigcategorie","europese_voertuigcategorie_toevoeging","europese_uitvoeringcategorie_toevoeging","plaats_chassisnummer","technische_max_massa_voertuig","type","type_gasinstallatie","typegoedkeuringsnummer","variant","uitvoering","volgnummer_wijziging_eu_typegoedkeuring","vermogen_massarijklaar","wielbasis","export_indicator","openstaande_terugroepactie_indicator","vervaldatum_tachograaf","taxi_indicator","maximum_massa_samenstelling","aantal_rolstoelplaatsen","maximum_ondersteunende_snelheid","jaar_laatste_registratie_tellerstand","tellerstandoordeel","code_toelichting_tellerstandoordeel","tenaamstellen_mogelijk","vervaldatum_apk_dt","datum_tenaamstelling_dt","datum_eerste_toelating_dt","datum_eerste_tenaamstelling_in_nederland_dt","vervaldatum_tachograaf_dt","maximum_last_onder_de_vooras_sen_tezamen_koppeling","type_remsysteem_voertuig_code","rupsonderstelconfiguratiecode","wielbasis_voertuig_minimum","wielbasis_voertuig_maximum","lengte_voertuig_minimum","lengte_voertuig_maximum","breedte_voertuig_minimum","breedte_voertuig_maximum","hoogte_voertuig","hoogte_voertuig_minimum","hoogte_voertuig_maximum","massa_bedrijfsklaar_minimaal","massa_bedrijfsklaar_maximaal","technisch_toelaatbaar_massa_koppelpunt","maximum_massa_technisch_maximaal","maximum_massa_technisch_minimaal","subcategorie_nederland","verticale_belasting_koppelpunt_getrokken_voertuig","zuinigheidsclassificatie","registratie_datum_goedkeuring_afschrijvingsmoment_bpm","registratie_datum_goedkeuring_afschrijvingsmoment_bpm_dt","gem_lading_wrde","aerodyn_voorz","massa_alt_aandr","verl_cab_ind","api_gekentekende_voertuigen_assen","api_gekentekende_voertuigen_brandstof","api_gekentekende_voertuigen_carrosserie","api_gekentekende_voertuigen_carrosserie_specifiek","api_gekentekende_voertuigen_voertuigklasse"
"G984SN","Personenauto","TESLA MOTORS","MODEL X","20230628",,,"hatchback","6","ZWART","Niet geregistreerd",,,"2374","3021","2474","750","2250","20170628","20191227","Geen verstrekking in Open Data","143850","Nee","250",,,,,,"5","4","0","0",,"505","200","M1",,,,"3021","002",,"e4*2007/46*0667*14","90X","B20B6T","0","0.03","297","Ja","Nee",,"Nee","5271","0","0.00","2022","Geen oordeel","05","Nee","2023-06-28T00:00:00.000",,"2017-06-28T00:00:00.000","2019-12-27T00:00:00.000",,,,,,,,,,,"168",,,,,,,,,,,,,,,,,"https://opendata.rdw.nl/resource/3huj-srit.json","https://opendata.rdw.nl/resource/8ys7-d773.json","https://opendata.rdw.nl/resource/vezc-m2t6.json","https://opendata.rdw.nl/resource/jhie-znh9.json","https://opendata.rdw.nl/resource/kmfi-hrps.json"
"H095LR","Personenauto","TESLA MOTORS","MODEL X",,,,"hatchback","6","WIT","Niet geregistreerd",,,"2414","3071","2514","750","2250","20161102","20200511","Geen verstrekking in Open Data","154099","Nee","250",,,,,,"5","4","0","0",,"505","200","M1",,,,"3071","002",,"e4*2007/46*0667*10","90X","P22B6T","0","0.04","297","Ja","Ja",,"Nee","5321","0","0.00","2023","Geen oordeel","05","Nee",,,"2016-11-02T00:00:00.000","2020-05-11T00:00:00.000",,,,,,,,,,,"168",,,,,,,,,,,,,,,,,"https://opendata.rdw.nl/resource/3huj-srit.json","https://opendata.rdw.nl/resource/8ys7-d773.json","https://opendata.rdw.nl/resource/vezc-m2t6.json","https://opendata.rdw.nl/resource/jhie-znh9.json","https://opendata.rdw.nl/resource/kmfi-hrps.json"
"KD900R","Personenauto","TESLA MOTORS","MODEL X 90D","20240810",,,"stationwagen","7","ROOD","Niet geregistreerd","0",,"2462","3020","2562",,,"20160802","20160802","Geen verstrekking in Open Data","132850","Ja",,,,,,,"4","4",,,,,,"M1",,,"r. deurdorpel a.","3020",,,,,,,"0.03","298","Ja","Ja",,"Nee",,,,"2023","Logisch","00","Nee","2024-08-10T00:00:00.000",,"2016-08-02T00:00:00.000","2016-08-02T00:00:00.000",,,,,,,,,,,,,,,,,,,,,,,,,,,,"https://opendata.rdw.nl/resource/3huj-srit.json","https://opendata.rdw.nl/resource/8ys7-d773.json","https://opendata.rdw.nl/resource/vezc-m2t6.json","https://opendata.rdw.nl/resource/jhie-znh9.json","https://opendata.rdw.nl/resource/kmfi-hrps.json"
"KF694K","Personenauto","TESLA MOTORS","MODEL X","20240824",,,"hatchback","7","ZWART","Niet geregistreerd",,,"2364","3021","2464",,,"20160818","20160818","Geen verstrekking in Open Data","131200","Nee",,,,,,,"5","4","0","0",,"505","200","M1",,,"op r. balk","3021","002",,"e4*2007/46*0667*10","90X","B20B7N","0","0.03","297","Ja","Nee",,"Nee","0","0","0.00","2023","Logisch","00","Nee","2024-08-24T00:00:00.000",,"2016-08-18T00:00:00.000","2016-08-18T00:00:00.000",,,,,,,,,,,"168",,,,,,,,,,,,,,,,,"https://opendata.rdw.nl/resource/3huj-srit.json","https://opendata.rdw.nl/resource/8ys7-d773.json","https://opendata.rdw.nl/resource/vezc-m2t6.json","https://opendata.rdw.nl/resource/jhie-znh9.json","https://opendata.rdw.nl/resource/kmfi-hrps.json"
"KG345P","Personenauto","TESLA MOTORS","MODEL X","20240902","20240118",,"hatchback","6","BLAUW","Niet geregistreerd",,,"2364","3021","2464",,,"20160902","20160902","Geen verstrekking in Open Data","132300","Ja",,,,,,,"5","4","0","0",,"505","200","M1",,,"op r. balk","3021","002",,"e4*2007/46*0667*10","90X","B22B6N","0","0.03","297","Ja","Nee",,"Nee","0","0","0.00","2024","Logisch","00","Nee","2024-09-02T00:00:00.000","2024-01-18T00:00:00.000","2016-09-02T00:00:00.000","2016-09-02T00:00:00.000",,,,,,,,,,,"168",,,,,,,,,,,,,,,,,"https://opendata.rdw.nl/resource/3huj-srit.json","https://opendata.rdw.nl/resource/8ys7-d773.json","https://opendata.rdw.nl/resource/vezc-m2t6.json","https://opendata.rdw.nl/resource/jhie-znh9.json","https://opendata.rdw.nl/resource/kmfi-hrps.json"
"KH162J","Personenauto","TESLA MOTORS","MODEL X","20240928","20240207",,"hatchback","7","GRIJS","Niet geregistreerd",,,"2364","3021","2464","750","2250","20160910","20160910","Geen verstrekking in Open Data","134250","Ja",,,,,,,"5","4","0","0",,"505","200","M1",,,"op r. balk","3021","002",,"e4*2007/46*0667*10","90X","B22B7T","0","0.03","297","Ja","Nee",,"Nee","5271","0","0.00","2024","Logisch","00","Nee","2024-09-28T00:00:00.000","2024-02-07T00:00:00.000","2016-09-10T00:00:00.000","2016-09-10T00:00:00.000",,,,,,,,,,,"168",,,,,,,,,,,,,,,,,"https://opendata.rdw.nl/resource/3huj-srit.json","https://opendata.rdw.nl/resource/8ys7-d773.json","https://opendata.rdw.nl/resource/vezc-m2t6.json","https://opendata.rdw.nl/resource/jhie-znh9.json","https://opendata.rdw.nl/resource/kmfi-hrps.json"
"KH441F","Personenauto","TESLA MOTORS","MODEL X","20240901",,,"hatchback","7","GRIJS","Niet geregistreerd",,,"2364","3021","2464",,,"20160901","20160901","Geen verstrekking in Open Data","139000","Nee",,,,,,,"5","4","0","0",,"505","200","M1",,,"op r. balk","3021","002",,"e4*2007/46*0667*10","90X","B22B7N","0","0.03","297","Ja","Nee",,"Nee","0","0","0.00","2023","Logisch","00","Nee","2024-09-01T00:00:00.000",,"2016-09-01T00:00:00.000","2016-09-01T00:00:00.000",,,,,,,,,,,"168",,,,,,,,,,,,,,,,,"https://opendata.rdw.nl/resource/3huj-srit.json","https://opendata.rdw.nl/resource/8ys7-d773.json","https://opendata.rdw.nl/resource/vezc-m2t6.json","https://opendata.rdw.nl/resource/jhie-znh9.json","https://opendata.rdw.nl/resource/kmfi-hrps.json"
"KH567R","Personenauto","TESLA MOTORS","MODEL X","20240916",,,"hatchback","6","BLAUW","Niet geregistreerd",,,"2414","3071","2514","750","2250","20160915","20160915","Geen verstrekking in Open Data","163250","Nee",,,,,,,"5","4","0","0",,"505","0","M1",,,"op r. balk","3071","002",,"e4*2007/46*0667*10","90X","P20B6T","0","0.03","297","Ja","Nee",,"Nee","5321","0","0.00","2022","Logisch","00","Nee","2024-09-16T00:00:00.000",,"2016-09-15T00:00:00.000","2016-09-15T00:00:00.000",,,,,,,,,,,,,,,,,,,,,,,,,,,,"https://opendata.rdw.nl/resource/3huj-srit.json","https://opendata.rdw.nl/resource/8ys7-d773.json","https://opendata.rdw.nl/resource/vezc-m2t6.json","https://opendata.rdw.nl/resource/jhie-znh9.json","https://opendata.rdw.nl/resource/kmfi-hrps.json"
"KH993B","Personenauto","TESLA MOTORS","MODEL X",,,,"hatchback","6","WIT","Niet geregistreerd",,,"2364","3021","2464",,,"20160908","20160908","Geen verstrekking in Open Data","135050","Nee",,,,,,,"5","4","0","0",,"505","200","M1",,,"op r. balk","3021","002",,"e4*2007/46*0667*10","90X","B22B6N","0","0.03","297","Ja","Nee",,"Nee","0","0","0.00","2023","Logisch","00","Nee",,,"2016-09-08T00:00:00.000","2016-09-08T00:00:00.000",,,,,,,,,,,"168",,,,,,,,,,,,,,,,,"https://opendata.rdw.nl/resource/3huj-srit.json","https://opendata.rdw.nl/resource/8ys7-d773.json","https://opendata.rdw.nl/resource/vezc-m2t6.json","https://opendata.rdw.nl/resource/jhie-znh9.json","https://opendata.rdw.nl/resource/kmfi-hrps.json"
"KJ368F","Personenauto","TESLA MOTORS","MODEL X","20240919",,,"hatchback","7","ZWART","Niet geregistreerd",,,"2364","3021","2464",,,"20160919","20160919","Geen verstrekking in Open Data","134000","Ja",,,,,,,"5","4","0","0",,"505","200","M1",,,"op r. balk","3021","002",,"e4*2007/46*0667*10","90X","B20B7N","0","0.03","297","Ja","Nee",,"Nee","0","0","0.00","2023","Logisch","00","Nee","2024-09-19T00:00:00.000",,"2016-09-19T00:00:00.000","2016-09-19T00:00:00.000",,,,,,,,,,,"168",,,,,,,,,,,,,,,,,"https://opendata.rdw.nl/resource/3huj-srit.json","https://opendata.rdw.nl/resource/8ys7-d773.json","https://opendata.rdw.nl/resource/vezc-m2t6.json","https://opendata.rdw.nl/resource/jhie-znh9.json","https://opendata.rdw.nl/resource/kmfi-hrps.json"
"KJ572V","Personenauto","TESLA MOTORS","MODEL X","20241221",,,"hatchback","7","BLAUW","Niet geregistreerd",,,"2364","3021","2464","750","2250","20160924","20160924","Geen verstrekking in Open Data","132900","Ja",,,,,,,"5","4","0","0",,"505","200","M1",,,"op r. balk","3021","002",,"e4*2007/46*0667*10","90X","B20B7T","0","0.03","297","Ja","Nee",,"Nee","5271","0","0.00","2023","Logisch","00","Nee","2024-12-21T00:00:00.000",,"2016-09-24T00:00:00.000","2016-09-24T00:00:00.000",,,,,,,,,,,"168",,,,,,,,,,,,,,,,,"https://opendata.rdw.nl/resource/3huj-srit.json","https://opendata.rdw.nl/resource/8ys7-d773.json","https://opendata.rdw.nl/resource/vezc-m2t6.json","https://opendata.rdw.nl/resource/jhie-znh9.json","https://opendata.rdw.nl/resource/kmfi-hrps.json"
"KK450N","Personenauto","TESLA MOTORS","MODEL X","20240929",,,"hatchback","6","GRIJS","Niet geregistreerd",,,"2364","3021","2464","750","2250","20160929","20160929","Geen verstrekking in Open Data","128150","Nee",,,,,,,"5","4","0","0",,"505","0","M1",,,"op r. balk","3021","002",,"e4*2007/46*0667*10","90X","B20B6T","0","0.03","297","Ja","Ja",,"Nee","5271","0","0.00","2022","Logisch","00","Nee","2024-09-29T00:00:00.000",,"2016-09-29T00:00:00.000","2016-09-29T00:00:00.000",,,,,,,,,,,,,,,,,,,,,,,,,,,,"https://opendata.rdw.nl/resource/3huj-srit.json","https://opendata.rdw.nl/resource/8ys7-d773.json","https://opendata.rdw.nl/resource/vezc-m2t6.json","https://opendata.rdw.nl/resource/jhie-znh9.json","https://opendata.rdw.nl/resource/kmfi-hrps.json"
"KK461N","Personenauto","TESLA MOTORS","MODEL X",,,,"hatchback","7","GRIJS","Niet geregistreerd",,,"2327","2985","2427","750","2250","20160929","20160929","Geen verstrekking in Open Data","112550","Nee",,,,,,,"5","4","0","0",,"505","200","M1",,,"op r. balk","2985","002",,"e4*2007/46*0667*10","75X","B20B7T","0","0.03","297","Ja","Ja",,"Nee","5235","0","0.00","2022","Logisch","00","Nee",,,"2016-09-29T00:00:00.000","2016-09-29T00:00:00.000",,,,,,,,,,,"168",,,,,,,,,,,,,,,,,"https://opendata.rdw.nl/resource/3huj-srit.json","https://opendata.rdw.nl/resource/8ys7-d773.json","https://opendata.rdw.nl/resource/vezc-m2t6.json","https://opendata.rdw.nl/resource/jhie-znh9.json","https://opendata.rdw.nl/resource/kmfi-hrps.json"
"KK847K","Personenauto","TESLA MOTORS","MODEL X",,,,"hatchback","6","ZWART","Niet geregistreerd",,,"2364","3021","2464",,,"20160929","20160929","Geen verstrekking in Open Data","136400","Nee",,,,,,,"5","4","0","0",,"505","200","M1",,,"op r. balk","3021","002",,"e4*2007/46*0667*10","90X","B22B6N","0","0.03","297","Ja","Nee",,"Nee","0","0","0.00","2022","Logisch","00","Nee",,,"2016-09-29T00:00:00.000","2016-09-29T00:00:00.000",,,,,,,,,,,"168",,,,,,,,,,,,,,,,,"https://opendata.rdw.nl/resource/3huj-srit.json","https://opendata.rdw.nl/resource/8ys7-d773.json","https://opendata.rdw.nl/resource/vezc-m2t6.json","https://opendata.rdw.nl/resource/jhie-znh9.json","https://opendata.rdw.nl/resource/kmfi-hrps.json"
"KK853F","Personenauto","TESLA MOTORS","MODEL X","20241230",,,"hatchback","7","GRIJS","Niet geregistreerd",,,"2414","3071","2514",,,"20160930","20160930","Geen verstrekking in Open Data","173250","Nee",,,,,,,"5","4","0","0",,"505","200","M1",,,"op r. balk","3071","002",,"e4*2007/46*0667*10","90X","P22B7N","0","0.03","297","Ja","Nee",,"Nee","0","0","0.00","2023","Logisch","00","Nee","2024-12-30T00:00:00.000",,"2016-09-30T00:00:00.000","2016-09-30T00:00:00.000",,,,,,,,,,,"168",,,,,,,,,,,,,,,,,"https://opendata.rdw.nl/resource/3huj-srit.json","https://opendata.rdw.nl/resource/8ys7-d773.json","https://opendata.rdw.nl/resource/vezc-m2t6.json","https://opendata.rdw.nl/resource/jhie-znh9.json","https://opendata.rdw.nl/resource/kmfi-hrps.json"
"KK853L","Personenauto","TESLA MOTORS","MODEL X","20240419",,,"hatchback","6","ZWART","Niet geregistreerd",,,"2364","3021","2464","750","2250","20160929","20160929","Geen verstrekking in Open Data","128150","Nee",,,,,,,"5","4","0","0",,"505","0","M1",,,"op r. balk","3021","002",,"e4*2007/46*0667*10","90X","B20B6T","0","0.03","297","Ja","Nee",,"Nee","5271","0","0.00","2022","Onlogisch","04","Nee","2024-04-19T00:00:00.000",,"2016-09-29T00:00:00.000","2016-09-29T00:00:00.000",,,,,,,,,,,,,,,,,,,,,,,,,,,,"https://opendata.rdw.nl/resource/3huj-srit.json","https://opendata.rdw.nl/resource/8ys7-d773.json","https://opendata.rdw.nl/resource/vezc-m2t6.json","https://opendata.rdw.nl/resource/jhie-znh9.json","https://opendata.rdw.nl/resource/kmfi-hrps.json"
"KS141D","Personenauto","TESLA MOTORS","MODEL X",,,,"hatchback","6","GRIJS","Niet geregistreerd",,,"2472","3120","2572",,,"20161118","20161118","Geen verstrekking in Open Data","180700","Nee",,,,,,,"5","4","0","0",,"505","0","M1",,,"op r. balk","3120","002",,"e4*2007/46*0667*11","100X","P20B6N","0","0.03","297","Ja","Nee",,"Nee","0","0","0.00","2022","Logisch","00","Nee",,,"2016-11-18T00:00:00.000","2016-11-18T00:00:00.000",,,,,,,,,,,,,,,,,,,,,,,,,,,,"https://opendata.rdw.nl/resource/3huj-srit.json","https://opendata.rdw.nl/resource/8ys7-d773.json","https://opendata.rdw.nl/resource/vezc-m2t6.json","https://opendata.rdw.nl/resource/jhie-znh9.json","https://opendata.rdw.nl/resource/kmfi-hrps.json"
"KT951T","Personenauto","TESLA MOTORS","MODEL X",,,,"hatchback","7","ROOD","Niet geregistreerd",,,"2327","2985","2427","750","2250","20161203","20161203","Geen verstrekking in Open Data","100350","Nee",,,,,,,"5","4","0","0",,"505","0","M1",,,"op r. balk","2985","002",,"e4*2007/46*0667*11","60X","B20B7T","0","0.03","297","Ja","Nee",,"Nee","5235","0","0.00","2022","Onlogisch","04","Nee",,,"2016-12-03T00:00:00.000","2016-12-03T00:00:00.000",,,,,,,,,,,,,,,,,,,,,,,,,,,,"https://opendata.rdw.nl/resource/3huj-srit.json","https://opendata.rdw.nl/resource/8ys7-d773.json","https://opendata.rdw.nl/resource/vezc-m2t6.json","https://opendata.rdw.nl/resource/jhie-znh9.json","https://opendata.rdw.nl/resource/kmfi-hrps.json"
"KV946Z","Personenauto","TESLA MOTORS","MODEL X",,,,"hatchback","6","GRIJS","Niet geregistreerd",,,"2364","3021","2464","750","2250","20161212","20161212","Geen verstrekking in Open Data","133500","Nee",,,,,,,"5","4","0","0",,"505","0","M1",,,"op r. balk","3021","002",,"e4*2007/46*0667*10","90X","B20B6T","0","0.03","297","Ja","Nee",,"Nee","5271","0","0.00","2022","Logisch","00","Nee",,,"2016-12-12T00:00:00.000","2016-12-12T00:00:00.000",,,,,,,,,,,,,,,,,,,,,,,,,,,,"https://opendata.rdw.nl/resource/3huj-srit.json","https://opendata.rdw.nl/resource/8ys7-d773.json","https://opendata.rdw.nl/resource/vezc-m2t6.json","https://opendata.rdw.nl/resource/jhie-znh9.json","https://opendata.rdw.nl/resource/kmfi-hrps.json"
"KV947Z","Personenauto","TESLA MOTORS","MODEL X",,,,"hatchback","7","ZWART","Niet geregistreerd",,,"2374","3021","2474","750","2250","20161217","20161217","Geen verstrekking in Open Data","139000","Nee",,,,,,,"5","4","0","0",,"505","200","M1",,,"op r. balk","3021","002",,"e4*2007/46*0667*11","90X","B20B7T","0","0.03","297","Ja","Nee",,"Nee","5271","0","0.00","2022","Logisch","00","Nee",,,"2016-12-17T00:00:00.000","2016-12-17T00:00:00.000",,,,,,,,,,,"168",,,,,,,,,,,,,,,,,"https://opendata.rdw.nl/resource/3huj-srit.json","https://opendata.rdw.nl/resource/8ys7-d773.json","https://opendata.rdw.nl/resource/vezc-m2t6.json","https://opendata.rdw.nl/resource/jhie-znh9.json","https://opendata.rdw.nl/resource/kmfi-hrps.json"
"KX207K","Personenauto","TESLA MOTORS","MODEL X","20240728",,,"hatchback","6","ROOD","Niet geregistreerd",,,"2472","3120","2572",,,"20161215","20161215","Geen verstrekking in Open Data","189950","Nee",,,,,,,"5","4","0","0",,"505","0","M1",,,"op r. balk","3120","002",,"e4*2007/46*0667*12","100X","P20B6N","0","0.03","297","Ja","Nee",,"Nee","0","0","0.00","2022","Logisch","00","Nee","2024-07-28T00:00:00.000",,"2016-12-15T00:00:00.000","2016-12-15T00:00:00.000",,,,,,,,,,,,,,,,,,,,,,,,,,,,"https://opendata.rdw.nl/resource/3huj-srit.json","https://opendata.rdw.nl/resource/8ys7-d773.json","https://opendata.rdw.nl/resource/vezc-m2t6.json","https://opendata.rdw.nl/resource/jhie-znh9.json","https://opendata.rdw.nl/resource/kmfi-hrps.json"
"KX327B","Personenauto","TESLA MOTORS","MODEL X","20240906",,,"hatchback","6","GRIJS","Niet geregistreerd",,,"2374","3021","2474",,,"20161212","20161212","Geen verstrekking in Open Data","135100","Nee",,,,,,,"5","4","0","0",,"505","0","M1",,,"op r. balk","3021","002",,"e4*2007/46*0667*12","90X","B20B6N","0","0.03","297","Ja","Nee",,"Nee","0","0","0.00","2022","Logisch","00","Nee","2024-09-06T00:00:00.000",,"2016-12-12T00:00:00.000","2016-12-12T00:00:00.000",,,,,,,,,,,,,,,,,,,,,,,,,,,,"https://opendata.rdw.nl/resource/3huj-srit.json","https://opendata.rdw.nl/resource/8ys7-d773.json","https://opendata.rdw.nl/resource/vezc-m2t6.json","https://opendata.rdw.nl/resource/jhie-znh9.json","https://opendata.rdw.nl/resource/kmfi-hrps.json"
"KX683Z","Personenauto","TESLA MOTORS","MODEL X","20250103",,,"hatchback","7","ZWART","Niet geregistreerd",,,"2327","2985","2427",,,"20170103","20170103","Geen verstrekking in Open Data","101450","Ja",,,,,,,"5","4","0","0",,"505","200","M1",,,"op r. balk","2985","002",,"e4*2007/46*0667*11","60X","B20B7N","0","0.03","297","Ja","Nee",,"Nee","0","0","0.00","2023","Logisch","00","Nee","2025-01-03T00:00:00.000",,"2017-01-03T00:00:00.000","2017-01-03T00:00:00.000",,,,,,,,,,,"168",,,,,,,,,,,,,,,,,"https://opendata.rdw.nl/resource/3huj-srit.json","https://opendata.rdw.nl/resource/8ys7-d773.json","https://opendata.rdw.nl/resource/vezc-m2t6.json","https://opendata.rdw.nl/resource/jhie-znh9.json","https://opendata.rdw.nl/resource/kmfi-hrps.json"
"KX748R","Personenauto","TESLA MOTORS","MODEL X","20250510",,,"hatchback","7","ZWART","Niet geregistreerd",,,"2472","3120","2572",,,"20161220","20161220","Geen verstrekking in Open Data","180700","Nee",,,,,,,"5","4","0","0",,"505","200","M1",,,"op r. balk","3120","002",,"e4*2007/46*0667*12","100X","P20B7N","0","0.03","297","Ja","Nee",,"Nee","0","0","0.00","2023","Logisch","00","Nee","2025-05-10T00:00:00.000",,"2016-12-20T00:00:00.000","2016-12-20T00:00:00.000",,,,,,,,,,,"168",,,,,,,,,,,,,,,,,"https://opendata.rdw.nl/resource/3huj-srit.json","https://opendata.rdw.nl/resource/8ys7-d773.json","https://opendata.rdw.nl/resource/vezc-m2t6.json","https://opendata.rdw.nl/resource/jhie-znh9.json","https://opendata.rdw.nl/resource/kmfi-hrps.json"
"KX954D","Personenauto","TESLA MOTORS","MODEL X","20241221",,,"hatchback","6","GRIJS","Niet geregistreerd",,,"2374","3021","2474",,,"20161213","20161213","Geen verstrekking in Open Data","122050","Nee",,,,,,,"5","4","0","0",,"505","200","M1",,,"op r. balk","3021","002",,"e4*2007/46*0667*12","90X","B20B6N","0","0.03","297","Ja","Nee",,"Nee","0","0","0.00","2023","Logisch","00","Nee","2024-12-21T00:00:00.000",,"2016-12-13T00:00:00.000","2016-12-13T00:00:00.000",,,,,,,,,,,"168",,,,,,,,,,,,,,,,,"https://opendata.rdw.nl/resource/3huj-srit.json","https://opendata.rdw.nl/resource/8ys7-d773.json","https://opendata.rdw.nl/resource/vezc-m2t6.json","https://opendata.rdw.nl/resource/jhie-znh9.json","https://opendata.rdw.nl/resource/kmfi-hrps.json"
"KZ319D","Personenauto","TESLA MOTORS","MODEL X",,,,"hatchback","7","ROOD","Niet geregistreerd",,,"2414","3071","2514","750","2250","20161219","20161219","Geen verstrekking in Open Data","174950","Nee",,,,,,,"5","4","0","0",,"505","0","M1",,,"op r. balk","3071","002",,"e4*2007/46*0667*10","90X","P22B7T","0","0.03","297","Ja","Nee",,"Nee","5321","0","0.00","2022","Logisch","00","Nee",,,"2016-12-19T00:00:00.000","2016-12-19T00:00:00.000",,,,,,,,,,,,,,,,,,,,,,,,,,,,"https://opendata.rdw.nl/resource/3huj-srit.json","https://opendata.rdw.nl/resource/8ys7-d773.json","https://opendata.rdw.nl/resource/vezc-m2t6.json","https://opendata.rdw.nl/resource/jhie-znh9.json","https://opendata.rdw.nl/resource/kmfi-hrps.json"
"KZ589R","Personenauto","TESLA MOTORS","MODEL X","20241230",,,"hatchback","7","ZWART","Niet geregistreerd",,,"2374","3021","2474","750","2250","20161230","20161230","Geen verstrekking in Open Data","131800","Nee",,,,,,,"5","4","0","0",,"505","200","M1",,,"op r. balk","3021","002",,"e4*2007/46*0667*12","90X","B20B7T","0","0.03","297","Ja","Nee",,"Nee","5271","0","0.00","2024","Logisch","00","Nee","2024-12-30T00:00:00.000",,"2016-12-30T00:00:00.000","2016-12-30T00:00:00.000",,,,,,,,,,,"168",,,,,,,,,,,,,,,,,"https://opendata.rdw.nl/resource/3huj-srit.json","https://opendata.rdw.nl/resource/8ys7-d773.json","https://opendata.rdw.nl/resource/vezc-m2t6.json","https://opendata.rdw.nl/resource/jhie-znh9.json","https://opendata.rdw.nl/resource/kmfi-hrps.json"
"N154JD","Personenauto","TESLA MOTORS","MODEL X","20231104",,,"hatchback","7","ZWART","Niet geregistreerd",,,"2364","3021","2464","750","2250","20160907","20211020","Geen verstrekking in Open Data","139150","Nee","250",,,,,,"5","4",,,,"505","200","M1",,,"r. deurdorpel by voorzitting","3021","002",,"e4*2007/46*0667*09","90X","B20B7T","0","0.03","297","Ja","Nee",,"Nee","5271",,,"2021","Geen oordeel","05","Nee","2023-11-04T00:00:00.000",,"2016-09-07T00:00:00.000","2021-10-20T00:00:00.000",,,,,,,,,,,"168",,,,,,,,,,,"20211019","2021-10-19T00:00:00.000",,,,,"https://opendata.rdw.nl/resource/3huj-srit.json","https://opendata.rdw.nl/resource/8ys7-d773.json","https://opendata.rdw.nl/resource/vezc-m2t6.json","https://opendata.rdw.nl/resource/jhie-znh9.json","https://opendata.rdw.nl/resource/kmfi-hrps.json"