"kenteken","voertuigsoort","merk","handelsbenaming","vervaldatum_apk","datum_tenaamstelling","bruto_bpm","inrichting","aantal_zitplaatsen","eerste_kleur","tweede_kleur","aantal_cilinders","cilinderinhoud","massa_ledig_voertuig","toegestane_maximum_massa_voertuig","massa_rijklaar","maximum_massa_trekken_ongeremd","maximum_trekken_massa_geremd","datum_eerste_toelating","datum_eerste_tenaamstelling_in_nederland","wacht_op_keuren","catalogusprijs","wam_verzekerd","maximale_constructiesnelheid","laadvermogen","oplegger_geremd","aanhangwagen_autonoom_geremd","aanhangwagen_middenas_geremd","aantal_staanplaatsen","aantal_deuren","aantal_wielen","afstand_hart_koppeling_tot_achterzijde_voertuig","afstand_voorzijde_voertuig_tot_hart_koppeling","afwijkende_maximum_snelheid","lengte","breedte","europese_voertuigcategorie","europese_voertuigcategorie_toevoeging","europese_uitvoeringcategorie_toevoeging","plaats_chassisnummer","technische_max_massa_voertuig","type","type_gasinstallatie","typegoedkeuringsnummer","variant","uitvoering","volgnummer_wijziging_eu_typegoedkeuring","vermogen_massarijklaar","wielbasis","export_indicator","openstaande_terugroepactie_indicator","vervaldatum_tachograaf","taxi_indicator","maximum_massa_samenstelling","aantal_rolstoelplaatsen","maximum_ondersteunende_snelheid","jaar_laatste_registratie_tellerstand","tellerstandoordeel","code_toelichting_tellerstandoordeel","tenaamstellen_mogelijk","vervaldatum_apk_dt","datum_tenaamstelling_dt","datum_eerste_toelating_dt","datum_eerste_tenaamstelling_in_nederland_dt","vervaldatum_tachograaf_dt","maximum_last_onder_de_vooras_sen_tezamen_koppeling","type_remsysteem_voertuig_code","rupsonderstelconfiguratiecode","wielbasis_voertuig_minimum","wielbasis_voertuig_maximum","lengte_voertuig_minimum","lengte_voertuig_maximum","breedte_voertuig_minimum","breedte_voertuig_maximum","hoogte_voertuig","hoogte_voertuig_minimum","hoogte_voertuig_maximum","massa_bedrijfsklaar_minimaal","massa_bedrijfsklaar_maximaal","technisch_toelaatbaar_massa_koppelpunt","maximum_massa_technisch_maximaal","maximum_massa_technisch_minimaal","subcategorie_nederland","verticale_belasting_koppelpunt_getrokken_voertuig","zuinigheidsclassificatie","registratie_datum_goedkeuring_afschrijvingsmoment_bpm","registratie_datum_goedkeuring_afschrijvingsmoment_bpm_dt","gem_lading_wrde","aerodyn_voorz","massa_alt_aandr","verl_cab_ind","api_gekentekende_voertuigen_assen","api_gekentekende_voertuigen_brandstof","api_gekentekende_voertuigen_carrosserie","api_gekentekende_voertuigen_carrosserie_specifiek","api_gekentekende_voertuigen_voertuigklasse"
"8ZTK50","Personenauto","SUZUKI","VITARA",,,"4055","hatchback","5","ZWART","Niet geregistreerd","4","1586","1050","1730","1150","400","1200","20150328","20150328","Geen verstrekking in Open Data","25498","Nee",,,,,,,"5","4","0","0",,"0","0","M1",,,"r. motorruimte","1730","LY",,"e4*2007/46*0928*01","D21S","MT2","0","0.08","250","Ja","Nee",,"Nee","2930","0",,"2021","Logisch","00","Nee",,,"2015-03-28T00:00:00.000","2015-03-28T00:00:00.000",,,,,,,,,,,,,,,,,,,,,"B",,,,,,,"https://opendata.rdw.nl/resource/3huj-srit.json","https://opendata.rdw.nl/resource/8ys7-d773.json","https://opendata.rdw.nl/resource/vezc-m2t6.json","https://opendata.rdw.nl/resource/jhie-znh9.json","https://opendata.rdw.nl/resource/kmfi-hrps.json"
"G247PG","Personenauto","SUZUKI","VITARA","20230912",,"5846","hatchback","5","BRUIN","ZWART","4","1373","1185","1730","1285","400","1200","20170912","20191101","Geen verstrekking in Open Data","39726","Nee","200",,,,,,"5","4","0","0",,"0","0","M1",,,,"1730","LY",,"e4*2007/46*0928*02","EA1S","MT2","3","0.08","250","Ja","Ja",,"Nee","2930","0","0.00","2021","Geen oordeel","05","Nee","2023-09-12T00:00:00.000",,"2017-09-12T00:00:00.000","2019-11-01T00:00:00.000",,,,,,,,,,,"161",,,,,,,,,,"D",,,,,,,"https://opendata.rdw.nl/resource/3huj-srit.json","https://opendata.rdw.nl/resource/8ys7-d773.json","https://opendata.rdw.nl/resource/vezc-m2t6.json","https://opendata.rdw.nl/resource/jhie-znh9.json","https://opendata.rdw.nl/resource/kmfi-hrps.json"
"G751HG","Personenauto","SUZUKI","VITARA","20251003","20240221","6920","hatchback","5","WIT","Niet geregistreerd","4","1373","1120","1730","1220","400","1200","20191003","20191003","Geen verstrekking in Open Data","29243","Ja","200",,,,,,"5","4","0","0",,"417","178","M1",,,,"1730","LY",,"e4*2007/46*0928*04","DA1S","AT2","0","0.08","250","Ja","Nee",,"Nee","2930","0","0.00","2024","Logisch","00","Nee","2025-10-03T00:00:00.000","2024-02-21T00:00:00.000","2019-10-03T00:00:00.000","2019-10-03T00:00:00.000",,,,,,,,,,,"160",,,,,,,,,,"E",,,,,,,"https://opendata.rdw.nl/resource/3huj-srit.json","https://opendata.rdw.nl/resource/8ys7-d773.json","https://opendata.rdw.nl/resource/vezc-m2t6.json","https://opendata.rdw.nl/resource/jhie-znh9.json","https://opendata.rdw.nl/resource/kmfi-hrps.json"
"G835LX","Personenauto","SUZUKI","VITARA",,,"6658","hatchback","5","ZWART","Niet geregistreerd","4","1373","1095","1730","1195","400","1200","20191028","20191028","Geen verstrekking in Open Data","27243","Nee","200",,,,,,"5","4","0","0",,"417","178","M1",,,,"1730","LY",,"e4*2007/46*0928*04","DA1S","MT2/L","0","0.09","250","Ja","Nee",,"Nee","2930","0","0.00","2023","Niet geregistreerd","NG","Nee",,,"2019-10-28T00:00:00.000","2019-10-28T00:00:00.000",,,,,,,,,,,"160",,,,,,,,,,"D",,,,,,,"https://opendata.rdw.nl/resource/3huj-srit.json","https://opendata.rdw.nl/resource/8ys7-d773.json","https://opendata.rdw.nl/resource/vezc-m2t6.json","https://opendata.rdw.nl/resource/jhie-znh9.json","https://opendata.rdw.nl/resource/kmfi-hrps.json"
"GD469S","Personenauto","SUZUKI","VITARA","20240424","20240122","4055","hatchback","5","ZWART","Niet geregistreerd","4","1586","1050","1730","1150","400","1200","20150424","20150424","Geen verstrekking in Open Data","21998","Ja",,,,,,,"5","4","0","0",,"0","0","M1",,,"r. motorruimte","1730","LY",,"e4*2007/46*0928*01","D21S","MT2","0","0.08","250","Ja","Nee",,"Nee","2930","0",,"2024","Logisch","00","Nee","2024-04-24T00:00:00.000","2024-01-22T00:00:00.000","2015-04-24T00:00:00.000","2015-04-24T00:00:00.000",,,,,,,,,,,,,,,,,,,,,"B",,,,,,,"https://opendata.rdw.nl/resource/3huj-srit.json","https://opendata.rdw.nl/resource/8ys7-d773.json","https://opendata.rdw.nl/resource/vezc-m2t6.json","https://opendata.rdw.nl/resource/jhie-znh9.json","https://opendata.rdw.nl/resource/kmfi-hrps.json"
"GD815F","Personenauto","SUZUKI","VITARA","20230416",,"5419","hatchback","5","WIT","Niet geregistreerd","4","1598","1205","1870","1305","600","1500","20150416","20150416","Geen verstrekking in Open Data","25498","Nee",,,,,,,"5","4","0","0",,"0","0","M1",,,"r. motorruimte","1870","LY",,"e4*2007/46*0928*01","D81S","MT2","0","0.07","250","Ja","Nee",,"Nee","3370","0",,"2022","Logisch","00","Nee","2023-04-16T00:00:00.000",,"2015-04-16T00:00:00.000","2015-04-16T00:00:00.000",,,,,,,,,,,,,,,,,,,,,"D",,,,,,,"https://opendata.rdw.nl/resource/3huj-srit.json","https://opendata.rdw.nl/resource/8ys7-d773.json","https://opendata.rdw.nl/resource/vezc-m2t6.json","https://opendata.rdw.nl/resource/jhie-znh9.json","https://opendata.rdw.nl/resource/kmfi-hrps.json"
"GG167V","Personenauto","SUZUKI","VITARA",,,"4839","hatchback","5","GRIJS","Niet geregistreerd","4","1586","1135","1730","1235","400","1200","20150520","20150520","Geen verstrekking in Open Data","25298","Nee",,,,,,,"5","4","0","0",,"0","0","M1",,,"r. motorruimte","1730","LY",,"e4*2007/46*0928*01","E21S","MT2","0","0.07","250","Ja","Nee",,"Nee","2930","0",,"2022","Logisch","00","Nee",,,"2015-05-20T00:00:00.000","2015-05-20T00:00:00.000",,,,,,,,,,,,,,,,,,,,,"C",,,,,,,"https://opendata.rdw.nl/resource/3huj-srit.json","https://opendata.rdw.nl/resource/8ys7-d773.json","https://opendata.rdw.nl/resource/vezc-m2t6.json","https://opendata.rdw.nl/resource/jhie-znh9.json","https://opendata.rdw.nl/resource/kmfi-hrps.json"
"GG828H","Personenauto","SUZUKI","VITARA","20230515",,"5419","hatchback","5","GRIJS","Niet geregistreerd","4","1598","1205","1870","1305","600","1500","20150515","20150515","Geen verstrekking in Open Data","28998","Nee",,,,,,,"5","4","0","0",,"0","0","M1",,,"r. motorruimte","1870","LY",,"e4*2007/46*0928*01","D81S","MT2","0","0.07","250","Ja","Nee",,"Nee","3370","0",,"2023","Logisch","00","Nee","2023-05-15T00:00:00.000",,"2015-05-15T00:00:00.000","2015-05-15T00:00:00.000",,,,,,,,,,,,,,,,,,,,,"D",,,,,,,"https://opendata.rdw.nl/resource/3huj-srit.json","https://opendata.rdw.nl/resource/8ys7-d773.json","https://opendata.rdw.nl/resource/vezc-m2t6.json","https://opendata.rdw.nl/resource/jhie-znh9.json","https://opendata.rdw.nl/resource/kmfi-hrps.json"
"GG928F","Personenauto","SUZUKI","VITARA",,,"4055","hatchback","5","WIT","Niet geregistreerd","4","1586","1050","1730","1150","400","1200","20150509","20150509","Geen verstrekking in Open Data","21998","Nee",,,,,,,"5","4","0","0",,"0","0","M1",,,"r. motorruimte","1730","LY",,"e4*2007/46*0928*01","D21S","MT2","0","0.08","250","Ja","Nee",,"Nee","2930","0",,"2021","Logisch","00","Nee",,,"2015-05-09T00:00:00.000","2015-05-09T00:00:00.000",,,,,,,,,,,,,,,,,,,,,"B",,,,,,,"https://opendata.rdw.nl/resource/3huj-srit.json","https://opendata.rdw.nl/resource/8ys7-d773.json","https://opendata.rdw.nl/resource/vezc-m2t6.json","https://opendata.rdw.nl/resource/jhie-znh9.json","https://opendata.rdw.nl/resource/kmfi-hrps.json"
"GH353G","Personenauto","SUZUKI","VITARA",,,"4055","hatchback","5","WIT","Niet geregistreerd","4","1586","1050","1730","1150","400","1200","20150523","20150523","Geen verstrekking in Open Data","25498","Nee",,,,,,,"5","4","0","0",,"0","0","M1",,,"r. motorruimte","1730","LY",,"e4*2007/46*0928*01","D21S","MT2","0","0.08","250","Ja","Nee",,"Nee","2930","0",,"2023","Onlogisch","04","Nee",,,"2015-05-23T00:00:00.000","2015-05-23T00:00:00.000",,,,,,,,,,,,,,,,,,,,,"B",,,,,,,"https://opendata.rdw.nl/resource/3huj-srit.json","https://opendata.rdw.nl/resource/8ys7-d773.json","https://opendata.rdw.nl/resource/vezc-m2t6.json","https://opendata.rdw.nl/resource/jhie-znh9.json","https://opendata.rdw.nl/resource/kmfi-hrps.json"
"GJ713V","Personenauto","SUZUKI","VITARA","20230220",,"5419","hatchback","5","GRIJS","Niet geregistreerd","4","1598","1205","1870","1305","600","1500","20150610","20150610","Geen verstrekking in Open Data","25498","Nee",,,,,,,"5","4","0","0",,"0","0","M1",,,"r. motorruimte","1870","LY",,"e4*2007/46*0928*01","D81S","MT2","0","0.07","250","Ja","Nee",,"Nee","3370","0",,"2022","Logisch","00","Nee","2023-02-20T00:00:00.000",,"2015-06-10T00:00:00.000","2015-06-10T00:00:00.000",,,,,,,,,,,,,,,,,,,,,"D",,,,,,,"https://opendata.rdw.nl/resource/3huj-srit.json","https://opendata.rdw.nl/resource/8ys7-d773.json","https://opendata.rdw.nl/resource/vezc-m2t6.json","https://opendata.rdw.nl/resource/jhie-znh9.json","https://opendata.rdw.nl/resource/kmfi-hrps.json"
"GJ868Z","Personenauto","SUZUKI","VITARA","20240630",,"5419","hatchback","5","GRIJS","Niet geregistreerd","4","1598","1205","1870","1305","600","1500","20150629","20150629","Geen verstrekking in Open Data","25498","Nee",,,,,,,"5","4","0","0",,"0","0","M1",,,"r. motorruimte","1870","LY",,"e4*2007/46*0928*01","D81S","MT2","0","0.07","250","Ja","Nee",,"Nee","3370","0",,"2023","Logisch","00","Nee","2024-06-30T00:00:00.000",,"2015-06-29T00:00:00.000","2015-06-29T00:00:00.000",,,,,,,,,,,,,,,,,,,,,"D",,,,,,,"https://opendata.rdw.nl/resource/3huj-srit.json","https://opendata.rdw.nl/resource/8ys7-d773.json","https://opendata.rdw.nl/resource/vezc-m2t6.json","https://opendata.rdw.nl/resource/jhie-znh9.json","https://opendata.rdw.nl/resource/kmfi-hrps.json"
"GJ925Z","Personenauto","SUZUKI","VITARA","20240320",,"4055","hatchback","5","CREME","Niet geregistreerd","4","1586","1050","1730","1150","400","1200","20150611","20150611","Geen verstrekking in Open Data","22198","Nee",,,,,,,"5","4","0","0",,"0","0","M1",,,"r. motorruimte","1730","LY",,"e4*2007/46*0928*01","D21S","MT2","0","0.08","250","Ja","Nee",,"Nee","2930","0",,"2023","Onlogisch","04","Nee","2024-03-20T00:00:00.000",,"2015-06-11T00:00:00.000","2015-06-11T00:00:00.000",,,,,,,,,,,,,,,,,,,,,"B",,,,,,,"https://opendata.rdw.nl/resource/3huj-srit.json","https://opendata.rdw.nl/resource/8ys7-d773.json","https://opendata.rdw.nl/resource/vezc-m2t6.json","https://opendata.rdw.nl/resource/jhie-znh9.json","https://opendata.rdw.nl/resource/kmfi-hrps.json"
"GL649H","Personenauto","SUZUKI","VITARA","20240317",,"4055","hatchback","5","BLAUW","Niet geregistreerd","4","1586","1050","1730","1150","400","1200","20150626","20150626","Geen verstrekking in Open Data","25698","Nee",,,,,,,"5","4","0","0",,"0","0","M1",,,"r. motorruimte","1730","LY",,"e4*2007/46*0928*01","D21S","MT2","0","0.08","250","Ja","Nee",,"Nee","2930","0",,"2023","Logisch","00","Nee","2024-03-17T00:00:00.000",,"2015-06-26T00:00:00.000","2015-06-26T00:00:00.000",,,,,,,,,,,,,,,,,,,,,"B",,,,,,,"https://opendata.rdw.nl/resource/3huj-srit.json","https://opendata.rdw.nl/resource/8ys7-d773.json","https://opendata.rdw.nl/resource/vezc-m2t6.json","https://opendata.rdw.nl/resource/jhie-znh9.json","https://opendata.rdw.nl/resource/kmfi-hrps.json"
"GL650H","Personenauto","SUZUKI","VITARA","20240129",,"5419","hatchback","5","GRIJS","Niet geregistreerd","4","1598","1205","1870","1305","600","1500","20150626","20150626","Geen verstrekking in Open Data","28998","Nee",,,,,,,"5","4","0","0",,"0","0","M1",,,"r. motorruimte","1870","LY",,"e4*2007/46*0928*01","D81S","MT2","0","0.07","250","Ja","Nee",,"Nee","3370","0",,"2023","Logisch","00","Nee","2024-01-29T00:00:00.000",,"2015-06-26T00:00:00.000","2015-06-26T00:00:00.000",,,,,,,,,,,,,,,,,,,,,"D",,,,,,,"https://opendata.rdw.nl/resource/3huj-srit.json","https://opendata.rdw.nl/resource/8ys7-d773.json","https://opendata.rdw.nl/resource/vezc-m2t6.json","https://opendata.rdw.nl/resource/jhie-znh9.json","https://opendata.rdw.nl/resource/kmfi-hrps.json"
"GN403J","Personenauto","SUZUKI","VITARA","20230715",,"4055","hatchback","5","GRIJS","Niet geregistreerd","4","1586","1050","1730","1150","400","1200","20150715","20150715","Geen verstrekking in Open Data","22198","Nee",,,,,,,"5","4","0","0",,"0","0","M1",,,"r. motorruimte","1730","LY",,"e4*2007/46*0928*01","D21S","MT2","0","0.08","250","Ja","Nee",,"Nee","2930","0",,"2022","Logisch","00","Nee","2023-07-15T00:00:00.000",,"2015-07-15T00:00:00.000","2015-07-15T00:00:00.000",,,,,,,,,,,,,,,,,,,,,"B",,,,,,,"https://opendata.rdw.nl/resource/3huj-srit.json","https://opendata.rdw.nl/resource/8ys7-d773.json","https://opendata.rdw.nl/resource/vezc-m2t6.json","https://opendata.rdw.nl/resource/jhie-znh9.json","https://opendata.rdw.nl/resource/kmfi-hrps.json"
"GT119G","Personenauto","SUZUKI","VITARA",,,"4839","hatchback","5","WIT","Niet geregistreerd","4","1586","1135","1730","1235","400","1200","20150815","20150815","Geen verstrekking in Open Data","25698","Nee",,,,,,,"5","4","0","0",,"0","0","M1",,,"r. motorruimte","1730","LY",,"e4*2007/46*0928*01","E21S","MT2","0","0.07","250","Ja","Nee",,"Nee","2930","0",,"2023","Logisch","00","Nee",,,"2015-08-15T00:00:00.000","2015-08-15T00:00:00.000",,,,,,,,,,,,,,,,,,,,,"C",,,,,,,"https://opendata.rdw.nl/resource/3huj-srit.json","https://opendata.rdw.nl/resource/8ys7-d773.json","https://opendata.rdw.nl/resource/vezc-m2t6.json","https://opendata.rdw.nl/resource/jhie-znh9.json","https://opendata.rdw.nl/resource/kmfi-hrps.json"
"GZ808N","Personenauto","SUZUKI","VITARA","20230921",,"4503","hatchback","5","GRIJS","Niet geregistreerd","4","1586","1095","1730","1195","400","1200","20150921","20150921","Geen verstrekking in Open Data","28098","Nee",,,,,,,"5","4","0","0",,"418","178","M1",,,"in motorruimte a.","1730","LY",,"e4*2007/46*0928*01","D21S","AT2","0","0.07","250","Ja","Nee",,"Nee","2930","0",,"2023","Logisch","00","Nee","2023-09-21T00:00:00.000",,"2015-09-21T00:00:00.000","2015-09-21T00:00:00.000",,,,,,,,,,,"161",,,,,,,,,,"C",,,,,,,"https://opendata.rdw.nl/resource/3huj-srit.json","https://opendata.rdw.nl/resource/8ys7-d773.json","https://opendata.rdw.nl/resource/vezc-m2t6.json","https://opendata.rdw.nl/resource/jhie-znh9.json","https://opendata.rdw.nl/resource/kmfi-hrps.json"
"H179FJ","Personenauto","SUZUKI","VITARA","20240110",,"2778","hatchback","5","BRUIN","Niet geregistreerd","4","1586","1050","1730","1150","400","1200","20160331","20200114","Geen verstrekking in Open Data","23111","Nee","180",,,,,,"5","4","0","0",,"418","178","M1",,,"r. motorruimte","1730","LY",,"e4*2007/46*0928*02","D21S","MT2","0","0.08","250","Ja","Nee",,"Nee","2930","0","0.00","2023","Geen oordeel","05","Nee","2024-01-10T00:00:00.000",,"2016-03-31T00:00:00.000","2020-01-14T00:00:00.000",,,,,,,,,,,"161",,,,,,,,,,"C",,,,,,,"https://opendata.rdw.nl/resource/3huj-srit.json","https://opendata.rdw.nl/resource/8ys7-d773.json","https://opendata.rdw.nl/resource/vezc-m2t6.json","https://opendata.rdw.nl/resource/jhie-znh9.json","https://opendata.rdw.nl/resource/kmfi-hrps.json"
"HH918R","Personenauto","SUZUKI","VITARA","20231115",,"4503","hatchback","5","GRIJS","Niet geregistreerd","4","1586","1095","1730","1195","400","1200","20151104","20151104","Geen verstrekking in Open Data","24598","Nee",,,,,,,"5","4","0","0",,"0","0","M1",,,"in motorruimte a.","1730","LY",,"e4*2007/46*0928*02","D21S","AT2","0","0.07","250","Ja","Nee",,"Nee","2930","0","0.00","2022","Logisch","00","Nee","2023-11-15T00:00:00.000",,"2015-11-04T00:00:00.000","2015-11-04T00:00:00.000",,,,,,,,,,,,,,,,,,,,,"C",,,,,,,"https://opendata.rdw.nl/resource/3huj-srit.json","https://opendata.rdw.nl/resource/8ys7-d773.json","https://opendata.rdw.nl/resource/vezc-m2t6.json","https://opendata.rdw.nl/resource/jhie-znh9.json","https://opendata.rdw.nl/resource/kmfi-hrps.json"
"HP486L","Personenauto","SUZUKI","VITARA","20240616","20240425","4839","hatchback","5","BLAUW","Niet geregistreerd","4","1586","1135","1730","1235","400","1200","20151211","20151211","Geen verstrekking in Open Data","29398","Ja",,,,,,,"5","4","0","0",,"418","178","M1",,,"in motorruimte a.","1730","LY",,"e4*2007/46*0928*02","E21S","MT2","0","0.07","250","Ja","Nee",,"Nee","2930","0","0.00","2024","Logisch","00","Nee","2024-06-16T00:00:00.000","2024-04-25T00:00:00.000","2015-12-11T00:00:00.000","2015-12-11T00:00:00.000",,,,,,,,,,,"161",,,,,,,,,,"C",,,,,,,"https://opendata.rdw.nl/resource/3huj-srit.json","https://opendata.rdw.nl/resource/8ys7-d773.json","https://opendata.rdw.nl/resource/vezc-m2t6.json","https://opendata.rdw.nl/resource/jhie-znh9.json","https://opendata.rdw.nl/resource/kmfi-hrps.json"
"HR341G","Personenauto","SUZUKI","VITARA","20221215",,"6237","hatchback","5","ZWART","Niet geregistreerd","4","1598","1270","1870","1370","600","1500","20151215","20151215","Geen verstrekking in Open Data","32898","Nee",,,,,,,"5","4","0","0",,"418","178","M1",,,"in motorruimte a.","1870","LY",,"e4*2007/46*0928*02","E81S","MT2","0","0.06","250","Ja","Nee",,"Nee","3370","0","0.00","2023","Niet geregistreerd","NG","Nee","2022-12-15T00:00:00.000",,"2015-12-15T00:00:00.000","2015-12-15T00:00:00.000",,,,,,,,,,,"161",,,,,,,,,,"D",,,,,,,"https://opendata.rdw.nl/resource/3huj-srit.json","https://opendata.rdw.nl/resource/8ys7-d773.json","https://opendata.rdw.nl/resource/vezc-m2t6.json","https://opendata.rdw.nl/resource/jhie-znh9.json","https://opendata.rdw.nl/resource/kmfi-hrps.json"
"HR885T","Personenauto","SUZUKI","VITARA","20240120",,"5419","hatchback","5","WIT","Niet geregistreerd","4","1598","1205","1870","1305","600","1500","20151221","20151221","Geen verstrekking in Open Data","26098","Nee",,,,,,,"5","4","0","0",,"418","178","M1",,,"in motorruimte a.","1870","LY",,"e4*2007/46*0928*02","D81S","MT2","0","0.07","250","Ja","Nee",,"Nee","3370","0","0.00","2024","Logisch","00","Nee","2024-01-20T00:00:00.000",,"2015-12-21T00:00:00.000","2015-12-21T00:00:00.000",,,,,,,,,,,"161",,,,,,,,,,"D",,,,,,,"https://opendata.rdw.nl/resource/3huj-srit.json","https://opendata.rdw.nl/resource/8ys7-d773.json","https://opendata.rdw.nl/resource/vezc-m2t6.json","https://opendata.rdw.nl/resource/jhie-znh9.json","https://opendata.rdw.nl/resource/kmfi-hrps.json"
"HS017D","Personenauto","SUZUKI","VITARA","20240428",,"4615","hatchback","5","GRIJS","Niet geregistreerd","4","1373","1210","1730","1310","400","1200","20151218","20151218","Geen verstrekking in Open Data","33198","Nee",,,,,,,"5","4","0","0",,"418","178","M1",,,"in motorruimte a.","1730","LY",,"e4*2007/46*0928*02","EA1S","AT2","0","0.08","250","Ja","Nee",,"Nee","2930","0","0.00","2023","Logisch","00","Nee","2024-04-28T00:00:00.000",,"2015-12-18T00:00:00.000","2015-12-18T00:00:00.000",,,,,,,,,,,"161",,,,,,,,,,"C",,,,,,,"https://opendata.rdw.nl/resource/3huj-srit.json","https://opendata.rdw.nl/resource/8ys7-d773.json","https://opendata.rdw.nl/resource/vezc-m2t6.json","https://opendata.rdw.nl/resource/jhie-znh9.json","https://opendata.rdw.nl/resource/kmfi-hrps.json"
"HS193K","Personenauto","SUZUKI","VITARA","20230716",,"5419","hatchback","5","ORANJE","Niet geregistreerd","4","1598","1205","1870","1305","600","1500","20160128","20160128","Geen verstrekking in Open Data","29798","Nee",,,,,,,"5","4","0","0",,"418","178","M1",,,"in motorruimte a.","1870","LY",,"e4*2007/46*0928*02","D81S","MT2","0","0.07","250","Ja","Nee",,"Nee","3370","0","0.00","2023","Logisch","00","Nee","2023-07-16T00:00:00.000",,"2016-01-28T00:00:00.000","2016-01-28T00:00:00.000",,,,,,,,,,,"161",,,,,,,,,,"E",,,,,,,"https://opendata.rdw.nl/resource/3huj-srit.json","https://opendata.rdw.nl/resource/8ys7-d773.json","https://opendata.rdw.nl/resource/vezc-m2t6.json","https://opendata.rdw.nl/resource/jhie-znh9.json","https://opendata.rdw.nl/resource/kmfi-hrps.json"
"HT471G","Personenauto","SUZUKI","VITARA","20230105",,"5419","hatchback","5","GRIJS","Niet geregistreerd","4","1598","1205","1870","1305","600","1500","20160105","20160105","Geen verstrekking in Open Data","29798","Nee",,,,,,,"5","4","0","0",,"0","0","M1",,,"in motorruimte a.","1870","LY",,"e4*2007/46*0928*02","D81S","MT2","0","0.07","250","Ja","Nee",,"Nee","3370","0","0.00","2022","Logisch","00","Nee","2023-01-05T00:00:00.000",,"2016-01-05T00:00:00.000","2016-01-05T00:00:00.000",,,,,,,,,,,,,,,,,,,,,"E",,,,,,,"https://opendata.rdw.nl/resource/3huj-srit.json","https://opendata.rdw.nl/resource/8ys7-d773.json","https://opendata.rdw.nl/resource/vezc-m2t6.json","https://opendata.rdw.nl/resource/jhie-znh9.json","https://opendata.rdw.nl/resource/kmfi-hrps.json"
"HT528G","Personenauto","SUZUKI","VITARA","20240202",,"4055","hatchback","5","WIT","Niet geregistreerd","4","1586","1050","1730","1150","400","1200","20160111","20160111","Geen verstrekking in Open Data","22598","Nee",,,,,,,"5","4","0","0",,"418","178","M1",,,"in motorruimte a.","1730","LY",,"e4*2007/46*0928*02","D21S","MT2","0","0.08","250","Ja","Nee",,"Nee","2930","0","0.00","2023","Logisch","00","Nee","2024-02-02T00:00:00.000",,"2016-01-11T00:00:00.000","2016-01-11T00:00:00.000",,,,,,,,,,,"161",,,,,,,,,,"C",,,,,,,"https://opendata.rdw.nl/resource/3huj-srit.json","https://opendata.rdw.nl/resource/8ys7-d773.json","https://opendata.rdw.nl/resource/vezc-m2t6.json","https://opendata.rdw.nl/resource/jhie-znh9.json","https://opendata.rdw.nl/resource/kmfi-hrps.json"
"HV349T","Personenauto","SUZUKI","VITARA","20231017",,"4951","hatchback","5","ORANJE","Niet geregistreerd","4","1586","1160","1730","1260","400","1200","20160108","20160108","Geen verstrekking in Open Data","27898","Nee",,,,,,,"5","4","0","0",,"418","178","M1",,,"in motorruimte a.","1730","LY",,"e4*2007/46*0928*02","E21S","AT2","0","0.07","250","Ja","Nee",,"Nee","2930","0","0.00","2023","Logisch","00","Nee","2023-10-17T00:00:00.000",,"2016-01-08T00:00:00.000","2016-01-08T00:00:00.000",,,,,,,,,,,"161",,,,,,,,,,"D",,,,,,,"https://opendata.rdw.nl/resource/3huj-srit.json","https://opendata.rdw.nl/resource/8ys7-d773.json","https://opendata.rdw.nl/resource/vezc-m2t6.json","https://opendata.rdw.nl/resource/jhie-znh9.json","https://opendata.rdw.nl/resource/kmfi-hrps.json"