"kenteken","voertuigsoort","merk","handelsbenaming","vervaldatum_apk","datum_tenaamstelling","bruto_bpm","inrichting","aantal_zitplaatsen","eerste_kleur","tweede_kleur","aantal_cilinders","cilinderinhoud","massa_ledig_voertuig","toegestane_maximum_massa_voertuig","massa_rijklaar","maximum_massa_trekken_ongeremd","maximum_trekken_massa_geremd","datum_eerste_toelating","datum_eerste_tenaamstelling_in_nederland","wacht_op_keuren","catalogusprijs","wam_verzekerd","maximale_constructiesnelheid","laadvermogen","oplegger_geremd","aanhangwagen_autonoom_geremd","aanhangwagen_middenas_geremd","aantal_staanplaatsen","aantal_deuren","aantal_wielen","afstand_hart_koppeling_tot_achterzijde_voertuig","afstand_voorzijde_voertuig_tot_hart_koppeling","afwijkende_maximum_snelheid","lengte","breedte","europese_voertuigcategorie","europese_voertuigcategorie_toevoeging","europese_uitvoeringcategorie_toevoeging","plaats_chassisnummer","technische_max_massa_voertuig","type","type_gasinstallatie","typegoedkeuringsnummer","variant","uitvoering","volgnummer_wijziging_eu_typegoedkeuring","vermogen_massarijklaar","wielbasis","export_indicator","openstaande_terugroepactie_indicator","vervaldatum_tachograaf","taxi_indicator","maximum_massa_samenstelling","aantal_rolstoelplaatsen","maximum_ondersteunende_snelheid","jaar_laatste_registratie_tellerstand","tellerstandoordeel","code_toelichting_tellerstandoordeel","tenaamstellen_mogelijk","vervaldatum_apk_dt","datum_tenaamstelling_dt","datum_eerste_toelating_dt","datum_eerste_tenaamstelling_in_nederland_dt","vervaldatum_tachograaf_dt","maximum_last_onder_de_vooras_sen_tezamen_koppeling","type_remsysteem_voertuig_code","rupsonderstelconfiguratiecode","wielbasis_voertuig_minimum","wielbasis_voertuig_maximum","lengte_voertuig_minimum","lengte_voertuig_maximum","breedte_voertuig_minimum","breedte_voertuig_maximum","hoogte_voertuig","hoogte_voertuig_minimum","hoogte_voertuig_maximum","massa_bedrijfsklaar_minimaal","massa_bedrijfsklaar_maximaal","technisch_toelaatbaar_massa_koppelpunt","maximum_massa_technisch_maximaal","maximum_massa_technisch_minimaal","subcategorie_nederland","verticale_belasting_koppelpunt_getrokken_voertuig","zuinigheidsclassificatie","registratie_datum_goedkeuring_afschrijvingsmoment_bpm","registratie_datum_goedkeuring_afschrijvingsmoment_bpm_dt","gem_lading_wrde","aerodyn_voorz","massa_alt_aandr","verl_cab_ind","api_gekentekende_voertuigen_assen","api_gekentekende_voertuigen_brandstof","api_gekentekende_voertuigen_carrosserie","api_gekentekende_voertuigen_carrosserie_specifiek","api_gekentekende_voertuigen_voertuigklasse"
"2ZPG84","Personenauto","SUZUKI","CELERIO","20230830",,"805","hatchback","5","GRIJS","Niet geregistreerd","3","998","790","1260","890","400","400","20150220","20150220","Geen verstrekking in Open Data","11329","Nee",,,,,,,"5","4","0","0",,"0","0","M1",,,"r. motorruimte","1260","LF",,"e6*2007/46*0119*01","E62S","MT25S","0","0.06","243","Ja","Nee",,"Nee","1660","0",,"2023","Logisch","00","Nee","2023-08-30T00:00:00.000",,"2015-02-20T00:00:00.000","2015-02-20T00:00:00.000",,,,,,,,,,,,,,,,,,,,,"A",,,,,,,"https://opendata.rdw.nl/resource/3huj-srit.json","https://opendata.rdw.nl/resource/8ys7-d773.json","https://opendata.rdw.nl/resource/vezc-m2t6.json","https://opendata.rdw.nl/resource/jhie-znh9.json","https://opendata.rdw.nl/resource/kmfi-hrps.json"
"3ZJX72","Personenauto","SUZUKI","CELERIO","20240726",,"1155","hatchback","5","WIT","Niet geregistreerd","3","998","780","1260","880","400","400","20150121","20150121","Geen verstrekking in Open Data","11999","Nee",,,,,,,"5","4","0","0",,"0","0","M1",,,"r. motorruimte","1260","LF",,"e6*2007/46*0119*00","E42S","MT5S","0","0.06","243","Ja","Nee",,"Nee","1660","0",,"2023","Logisch","00","Nee","2024-07-26T00:00:00.000",,"2015-01-21T00:00:00.000","2015-01-21T00:00:00.000",,,,,,,,,,,,,,,,,,,,,"B",,,,,,,"https://opendata.rdw.nl/resource/3huj-srit.json","https://opendata.rdw.nl/resource/8ys7-d773.json","https://opendata.rdw.nl/resource/vezc-m2t6.json","https://opendata.rdw.nl/resource/jhie-znh9.json","https://opendata.rdw.nl/resource/kmfi-hrps.json"
"4ZSG87","Personenauto","SUZUKI","CELERIO","20240301",,"805","hatchback","5","ZWART","Niet geregistreerd","3","998","790","1260","890","400","400","20150318","20150318","Geen verstrekking in Open Data","11329","Nee",,,,,,,"5","4","0","0",,"0","0","M1",,,"r. motorruimte","1260","LF",,"e6*2007/46*0119*01","E62S","MT25S","0","0.06","243","Ja","Nee",,"Nee","1660","0",,"2023","Logisch","00","Nee","2024-03-01T00:00:00.000",,"2015-03-18T00:00:00.000","2015-03-18T00:00:00.000",,,,,,,,,,,,,,,,,,,,,"A",,,,,,,"https://opendata.rdw.nl/resource/3huj-srit.json","https://opendata.rdw.nl/resource/8ys7-d773.json","https://opendata.rdw.nl/resource/vezc-m2t6.json","https://opendata.rdw.nl/resource/jhie-znh9.json","https://opendata.rdw.nl/resource/kmfi-hrps.json"
"6ZPB39","Personenauto","SUZUKI","CELERIO","20231111",,"805","hatchback","5","GRIJS","Niet geregistreerd","3","998","790","1260","890","400","400","20150213","20150213","Geen verstrekking in Open Data","11329","Nee",,,,,,,"5","4","0","0",,"0","0","M1",,,"r. motorruimte","1260","LF",,"e6*2007/46*0119*01","E62S","MT25S","0","0.06","243","Ja","Nee",,"Nee","1660","0",,"2022","Logisch","00","Nee","2023-11-11T00:00:00.000",,"2015-02-13T00:00:00.000","2015-02-13T00:00:00.000",,,,,,,,,,,,,,,,,,,,,"A",,,,,,,"https://opendata.rdw.nl/resource/3huj-srit.json","https://opendata.rdw.nl/resource/8ys7-d773.json","https://opendata.rdw.nl/resource/vezc-m2t6.json","https://opendata.rdw.nl/resource/jhie-znh9.json","https://opendata.rdw.nl/resource/kmfi-hrps.json"
"G127KL","Personenauto","SUZUKI","CELERIO","20250712",,"1582","hatchback","5","ZWART","Niet geregistreerd","3","998","790","1260","890","400","400","20191016","20191016","Geen verstrekking in Open Data","12643","Nee","155",,,,,,"5","4","0","0",,"360","160","M1",,,,"1260","LF",,"e6*2007/46*0119*03","E62S","MT25S/L","0","0.06","243","Ja","Nee",,"Nee","1660","0","0.00","2023","Logisch","00","Nee","2025-07-12T00:00:00.000",,"2019-10-16T00:00:00.000","2019-10-16T00:00:00.000",,,,,,,,,,,"153",,,,,,,,,,"B",,,,,,,"https://opendata.rdw.nl/resource/3huj-srit.json","https://opendata.rdw.nl/resource/8ys7-d773.json","https://opendata.rdw.nl/resource/vezc-m2t6.json","https://opendata.rdw.nl/resource/jhie-znh9.json","https://opendata.rdw.nl/resource/kmfi-hrps.json"
"G133LJ","Personenauto","SUZUKI","CELERIO",,,"1582","hatchback","5","ZWART","Niet geregistreerd","3","998","790","1260","890","400","400","20191024","20191024","Geen verstrekking in Open Data","12643","Nee","155",,,,,,"5","4","0","0",,"0","0","M1",,,,"1260","LF",,"e6*2007/46*0119*03","E62S","MT25S/L","0","0.06","243","Ja","Nee",,"Nee","1660","0","0.00","2022","Logisch","00","Nee",,,"2019-10-24T00:00:00.000","2019-10-24T00:00:00.000",,,,,,,,,,,,,,,,,,,,,"B",,,,,,,"https://opendata.rdw.nl/resource/3huj-srit.json","https://opendata.rdw.nl/resource/8ys7-d773.json","https://opendata.rdw.nl/resource/vezc-m2t6.json","https://opendata.rdw.nl/resource/jhie-znh9.json","https://opendata.rdw.nl/resource/kmfi-hrps.json"
"G263RF","Personenauto","SUZUKI","CELERIO",,,"1582","hatchback","5","GRIJS","Niet geregistreerd","3","998","790","1260","890","400","400","20191114","20191114","Geen verstrekking in Open Data","12643","Nee","155",,,,,,"5","4","0","0",,"360","160","M1",,,,"1260","LF",,"e6*2007/46*0119*03","E62S","MT25S/L","0","0.06","243","Ja","Nee",,"Nee","1660","0","0.00","2023","Logisch","00","Nee",,,"2019-11-14T00:00:00.000","2019-11-14T00:00:00.000",,,,,,,,,,,"153",,,,,,,,,,"B",,,,,,,"https://opendata.rdw.nl/resource/3huj-srit.json","https://opendata.rdw.nl/resource/8ys7-d773.json","https://opendata.rdw.nl/resource/vezc-m2t6.json","https://opendata.rdw.nl/resource/jhie-znh9.json","https://opendata.rdw.nl/resource/kmfi-hrps.json"
"G264RF","Personenauto","SUZUKI","CELERIO",,,"1582","hatchback","5","GRIJS","Niet geregistreerd","3","998","790","1260","890","400","400","20191114","20191114","Geen verstrekking in Open Data","12643","Nee","155",,,,,,"5","4","0","0",,"360","160","M1",,,,"1260","LF",,"e6*2007/46*0119*03","E62S","MT25S/L","0","0.06","243","Ja","Nee",,"Nee","1660","0","0.00","2023","Logisch","00","Nee",,,"2019-11-14T00:00:00.000","2019-11-14T00:00:00.000",,,,,,,,,,,"153",,,,,,,,,,"B",,,,,,,"https://opendata.rdw.nl/resource/3huj-srit.json","https://opendata.rdw.nl/resource/8ys7-d773.json","https://opendata.rdw.nl/resource/vezc-m2t6.json","https://opendata.rdw.nl/resource/jhie-znh9.json","https://opendata.rdw.nl/resource/kmfi-hrps.json"
"G316DN","Personenauto","SUZUKI","CELERIO",,,"1582","hatchback","5","GRIJS","Niet geregistreerd","3","998","790","1260","890","400","400","20190905","20190905","Geen verstrekking in Open Data","12643","Nee","155",,,,,,"5","4","0","0",,"360","160","M1",,,,"1260","LF",,"e6*2007/46*0119*03","E62S","MT25S/L","0","0.06","243","Ja","Nee",,"Nee","1660","0","0.00","2022","Logisch","00","Nee",,,"2019-09-05T00:00:00.000","2019-09-05T00:00:00.000",,,,,,,,,,,"153",,,,,,,,,,"B",,,,,,,"https://opendata.rdw.nl/resource/3huj-srit.json","https://opendata.rdw.nl/resource/8ys7-d773.json","https://opendata.rdw.nl/resource/vezc-m2t6.json","https://opendata.rdw.nl/resource/jhie-znh9.json","https://opendata.rdw.nl/resource/kmfi-hrps.json"
"G552PK","Personenauto","SUZUKI","CELERIO",,,"1582","hatchback","5","GRIJS","Niet geregistreerd","3","998","790","1260","890","400","400","20191106","20191106","Geen verstrekking in Open Data","12643","Nee","155",,,,,,"5","4","0","0",,"360","160","M1",,,,"1260","LF",,"e6*2007/46*0119*03","E62S","MT25S/L","0","0.06","243","Ja","Nee",,"Nee","1660","0","0.00","2023","Logisch","00","Nee",,,"2019-11-06T00:00:00.000","2019-11-06T00:00:00.000",,,,,,,,,,,"153",,,,,,,,,,"B",,,,,,,"https://opendata.rdw.nl/resource/3huj-srit.json","https://opendata.rdw.nl/resource/8ys7-d773.json","https://opendata.rdw.nl/resource/vezc-m2t6.json","https://opendata.rdw.nl/resource/jhie-znh9.json","https://opendata.rdw.nl/resource/kmfi-hrps.json"
"G559PK","Personenauto","SUZUKI","CELERIO","20251114","20240307","1582","hatchback","5","GRIJS","Niet geregistreerd","3","998","790","1260","890","400","400","20191106","20191106","Geen verstrekking in Open Data","12643","Nee","155",,,,,,"5","4","0","0",,"360","160","M1",,,,"1260","LF",,"e6*2007/46*0119*03","E62S","MT25S/L","0","0.06","243","Ja","Nee",,"Nee","1660","0","0.00","2024","Logisch","00","Nee","2025-11-14T00:00:00.000","2024-03-07T00:00:00.000","2019-11-06T00:00:00.000","2019-11-06T00:00:00.000",,,,,,,,,,,"153",,,,,,,,,,"B",,,,,,,"https://opendata.rdw.nl/resource/3huj-srit.json","https://opendata.rdw.nl/resource/8ys7-d773.json","https://opendata.rdw.nl/resource/vezc-m2t6.json","https://opendata.rdw.nl/resource/jhie-znh9.json","https://opendata.rdw.nl/resource/kmfi-hrps.json"
"GB035R","Personenauto","SUZUKI","CELERIO","20240131",,"805","hatchback","5","ZWART","Niet geregistreerd","3","998","790","1260","890","400","400","20150416","20150416","Geen verstrekking in Open Data","11329","Nee",,,,,,,"5","4","0","0",,"0","0","M1",,,"r. motorruimte","1260","LF",,"e6*2007/46*0119*01","E62S","MT25S","0","0.06","243","Ja","Nee",,"Nee","1660","0",,"2023","Logisch","00","Nee","2024-01-31T00:00:00.000",,"2015-04-16T00:00:00.000","2015-04-16T00:00:00.000",,,,,,,,,,,,,,,,,,,,,"A",,,,,,,"https://opendata.rdw.nl/resource/3huj-srit.json","https://opendata.rdw.nl/resource/8ys7-d773.json","https://opendata.rdw.nl/resource/vezc-m2t6.json","https://opendata.rdw.nl/resource/jhie-znh9.json","https://opendata.rdw.nl/resource/kmfi-hrps.json"
"GG086R","Personenauto","SUZUKI","CELERIO",,,"805","hatchback","5","ZWART","Niet geregistreerd","3","998","790","1260","890","400","400","20150519","20150519","Geen verstrekking in Open Data","12329","Nee",,,,,,,"5","4","0","0",,"0","0","M1",,,"r. motorruimte","1260","LF",,"e6*2007/46*0119*01","E62S","MT25S","0","0.06","243","Ja","Nee",,"Nee","1660","0",,"2022","Logisch","00","Nee",,,"2015-05-19T00:00:00.000","2015-05-19T00:00:00.000",,,,,,,,,,,,,,,,,,,,,"A",,,,,,,"https://opendata.rdw.nl/resource/3huj-srit.json","https://opendata.rdw.nl/resource/8ys7-d773.json","https://opendata.rdw.nl/resource/vezc-m2t6.json","https://opendata.rdw.nl/resource/jhie-znh9.json","https://opendata.rdw.nl/resource/kmfi-hrps.json"
"GJ898Z","Personenauto","SUZUKI","CELERIO",,,"805","hatchback","5","ZWART","Niet geregistreerd","3","998","790","1260","890","400","400","20150611","20150611","Geen verstrekking in Open Data","11329","Nee",,,,,,,"5","4","0","0",,"0","0","M1",,,"r. motorruimte","1260","LF",,"e6*2007/46*0119*02","E62S","MT25S","0","0.06","243","Ja","Nee",,"Nee","1660","0",,"2020","Logisch","00","Nee",,,"2015-06-11T00:00:00.000","2015-06-11T00:00:00.000",,,,,,,,,,,,,,,,,,,,,"A",,,,,,,"https://opendata.rdw.nl/resource/3huj-srit.json","https://opendata.rdw.nl/resource/8ys7-d773.json","https://opendata.rdw.nl/resource/vezc-m2t6.json","https://opendata.rdw.nl/resource/jhie-znh9.json","https://opendata.rdw.nl/resource/kmfi-hrps.json"
"GR680T","Personenauto","SUZUKI","CELERIO","20240310",,"805","hatchback","5","ZWART","Niet geregistreerd","3","998","790","1260","890","400","400","20150731","20150731","Geen verstrekking in Open Data","11598","Nee",,,,,,,"5","4","0","0",,"0","0","M1",,,"r. motorruimte","1260","LF",,"e6*2007/46*0119*02","E62S","MT25S","0","0.06","243","Ja","Nee",,"Nee","1660","0",,"2023","Logisch","00","Nee","2024-03-10T00:00:00.000",,"2015-07-31T00:00:00.000","2015-07-31T00:00:00.000",,,,,,,,,,,,,,,,,,,,,"A",,,,,,,"https://opendata.rdw.nl/resource/3huj-srit.json","https://opendata.rdw.nl/resource/8ys7-d773.json","https://opendata.rdw.nl/resource/vezc-m2t6.json","https://opendata.rdw.nl/resource/jhie-znh9.json","https://opendata.rdw.nl/resource/kmfi-hrps.json"
"HF700P","Personenauto","SUZUKI","CELERIO","20240207",,"805","hatchback","5","ZWART","Niet geregistreerd","3","998","790","1260","890","400","400","20151016","20151016","Geen verstrekking in Open Data","11598","Nee",,,,,,,"5","4","0","0",,"360","160","M1",,,"in motorruimte a.","1260","LF",,"e6*2007/46*0119*02","E62S","MT25S","0","0.06","243","Ja","Nee",,"Nee","1660","0",,"2023","Logisch","00","Nee","2024-02-07T00:00:00.000",,"2015-10-16T00:00:00.000","2015-10-16T00:00:00.000",,,,,,,,,,,"153",,,,,,,,,,"A",,,,,,,"https://opendata.rdw.nl/resource/3huj-srit.json","https://opendata.rdw.nl/resource/8ys7-d773.json","https://opendata.rdw.nl/resource/vezc-m2t6.json","https://opendata.rdw.nl/resource/jhie-znh9.json","https://opendata.rdw.nl/resource/kmfi-hrps.json"
"HT644R","Personenauto","SUZUKI","CELERIO","20240104",,"805","hatchback","5","GRIJS","Niet geregistreerd","3","998","790","1260","890","400","400","20160104","20160104","Geen verstrekking in Open Data","11598","Nee",,,,,,,"5","4","0","0",,"360","160","M1",,,"in motorruimte a.","1260","LF",,"e6*2007/46*0119*02","E62S","MT25S","0","0.06","243","Ja","Nee",,"Nee","1660","0",,"2022","Logisch","00","Nee","2024-01-04T00:00:00.000",,"2016-01-04T00:00:00.000","2016-01-04T00:00:00.000",,,,,,,,,,,"153",,,,,,,,,,"A",,,,,,,"https://opendata.rdw.nl/resource/3huj-srit.json","https://opendata.rdw.nl/resource/8ys7-d773.json","https://opendata.rdw.nl/resource/vezc-m2t6.json","https://opendata.rdw.nl/resource/jhie-znh9.json","https://opendata.rdw.nl/resource/kmfi-hrps.json"
"HT717R","Personenauto","SUZUKI","CELERIO","20241221","20160106","1840","hatchback","5","WIT","Niet geregistreerd","3","998","785","1260","885","400","400","20160106","20160106","Geen verstrekking in Open Data","12999","Nee",,,,,,,"5","4","0","0",,"360","160","M1",,,"in motorruimte a.","1260","LF",,"e6*2007/46*0119*02","E42S","AMT5S","0","0.06","243","Ja","Nee",,"Nee","1660","0",,"2024","Logisch","00","Nee","2024-12-21T00:00:00.000","2016-01-06T00:00:00.000","2016-01-06T00:00:00.000","2016-01-06T00:00:00.000",,,,,,,,,,,"154",,,,,,,,,,"C",,,,,,,"https://opendata.rdw.nl/resource/3huj-srit.json","https://opendata.rdw.nl/resource/8ys7-d773.json","https://opendata.rdw.nl/resource/vezc-m2t6.json","https://opendata.rdw.nl/resource/jhie-znh9.json","https://opendata.rdw.nl/resource/kmfi-hrps.json"
"HT745R","Personenauto","SUZUKI","CELERIO","20240113",,"805","hatchback","5","BLAUW","Niet geregistreerd","3","998","790","1260","890","400","400","20160104","20160104","Geen verstrekking in Open Data","11598","Nee",,,,,,,"5","4","0","0",,"0","0","M1",,,"in motorruimte a.","1260","LF",,"e6*2007/46*0119*02","E62S","MT25S","0","0.06","243","Ja","Nee",,"Nee","1660","0",,"2022","Logisch","00","Nee","2024-01-13T00:00:00.000",,"2016-01-04T00:00:00.000","2016-01-04T00:00:00.000",,,,,,,,,,,,,,,,,,,,,"A",,,,,,,"https://opendata.rdw.nl/resource/3huj-srit.json","https://opendata.rdw.nl/resource/8ys7-d773.json","https://opendata.rdw.nl/resource/vezc-m2t6.json","https://opendata.rdw.nl/resource/jhie-znh9.json","https://opendata.rdw.nl/resource/kmfi-hrps.json"
"JB070Z","Personenauto","SUZUKI","CELERIO","20240206",,"994","hatchback","5","WIT","Niet geregistreerd","3","998","790","1260","890","400","400","20160206","20160206","Geen verstrekking in Open Data","11399","Nee",,,,,,,"5","4","0","0",,"0","0","M1",,,"in motorruimte a.","1260","LF",,"e6*2007/46*0119*02","E62S","MT25S","0","0.06","243","Ja","Nee",,"Nee","1660","0",,"2022","Logisch","00","Nee","2024-02-06T00:00:00.000",,"2016-02-06T00:00:00.000","2016-02-06T00:00:00.000",,,,,,,,,,,,,,,,,,,,,"A",,,,,,,"https://opendata.rdw.nl/resource/3huj-srit.json","https://opendata.rdw.nl/resource/8ys7-d773.json","https://opendata.rdw.nl/resource/vezc-m2t6.json","https://opendata.rdw.nl/resource/jhie-znh9.json","https://opendata.rdw.nl/resource/kmfi-hrps.json"
"JD429G","Personenauto","SUZUKI","CELERIO","20240221",,"994","hatchback","5","ZWART","Niet geregistreerd","3","998","790","1260","890","400","400","20160211","20160211","Geen verstrekking in Open Data","12798","Nee",,,,,,,"5","4","0","0",,"360","160","M1",,,"in motorruimte a.","1260","LF",,"e6*2007/46*0119*02","E62S","MT25S","0","0.06","243","Ja","Nee",,"Nee","1660","0",,"2022","Logisch","00","Nee","2024-02-21T00:00:00.000",,"2016-02-11T00:00:00.000","2016-02-11T00:00:00.000",,,,,,,,,,,"153",,,,,,,,,,"A",,,,,,,"https://opendata.rdw.nl/resource/3huj-srit.json","https://opendata.rdw.nl/resource/8ys7-d773.json","https://opendata.rdw.nl/resource/vezc-m2t6.json","https://opendata.rdw.nl/resource/jhie-znh9.json","https://opendata.rdw.nl/resource/kmfi-hrps.json"
"JH585S","Personenauto","SUZUKI","CELERIO","20240926",,"994","hatchback","5","BLAUW","Niet geregistreerd","3","998","790","1260","890","400","400","20160331","20160331","Geen verstrekking in Open Data","11798","Nee",,,,,,,"5","4","0","0",,"360","160","M1",,,"in motorruimte a.","1260","LF",,"e6*2007/46*0119*02","E62S","MT25S","0","0.06","243","Ja","Nee",,"Nee","1660","0",,"2023","Logisch","00","Nee","2024-09-26T00:00:00.000",,"2016-03-31T00:00:00.000","2016-03-31T00:00:00.000",,,,,,,,,,,"153",,,,,,,,,,"A",,,,,,,"https://opendata.rdw.nl/resource/3huj-srit.json","https://opendata.rdw.nl/resource/8ys7-d773.json","https://opendata.rdw.nl/resource/vezc-m2t6.json","https://opendata.rdw.nl/resource/jhie-znh9.json","https://opendata.rdw.nl/resource/kmfi-hrps.json"
"JJ955Z","Personenauto","SUZUKI","CELERIO","20231222",,"994","hatchback","5","ZWART","Niet geregistreerd","3","998","790","1260","890","400","400","20160408","20160408","Geen verstrekking in Open Data","11798","Nee",,,,,,,"5","4","0","0",,"360","160","M1",,,"in motorruimte a.","1260","LF",,"e6*2007/46*0119*02","E62S","MT25S","0","0.06","243","Ja","Nee",,"Nee","1660","0",,"2023","Logisch","00","Nee","2023-12-22T00:00:00.000",,"2016-04-08T00:00:00.000","2016-04-08T00:00:00.000",,,,,,,,,,,"153",,,,,,,,,,"A",,,,,,,"https://opendata.rdw.nl/resource/3huj-srit.json","https://opendata.rdw.nl/resource/8ys7-d773.json","https://opendata.rdw.nl/resource/vezc-m2t6.json","https://opendata.rdw.nl/resource/jhie-znh9.json","https://opendata.rdw.nl/resource/kmfi-hrps.json"
"JJ961Z","Personenauto","SUZUKI","CELERIO","20240524",,"994","hatchback","5","ZWART","Niet geregistreerd","3","998","790","1260","890","400","400","20160408","20160408","Geen verstrekking in Open Data","11798","Nee",,,,,,,"5","4","0","0",,"360","160","M1",,,"in motorruimte a.","1260","LF",,"e6*2007/46*0119*02","E62S","MT25S","0","0.06","243","Ja","Nee",,"Nee","1660","0",,"2023","Onlogisch","04","Nee","2024-05-24T00:00:00.000",,"2016-04-08T00:00:00.000","2016-04-08T00:00:00.000",,,,,,,,,,,"153",,,,,,,,,,"A",,,,,,,"https://opendata.rdw.nl/resource/3huj-srit.json","https://opendata.rdw.nl/resource/8ys7-d773.json","https://opendata.rdw.nl/resource/vezc-m2t6.json","https://opendata.rdw.nl/resource/jhie-znh9.json","https://opendata.rdw.nl/resource/kmfi-hrps.json"
"JK917S","Personenauto","SUZUKI","CELERIO","20240416",,"994","hatchback","5","ZWART","Niet geregistreerd","3","998","790","1260","890","400","400","20160416","20160416","Geen verstrekking in Open Data","11798","Nee",,,,,,,"5","4","0","0",,"360","160","M1",,,"in motorruimte a.","1260","LF",,"e6*2007/46*0119*02","E62S","MT25S","0","0.06","243","Ja","Nee",,"Nee","1660","0",,"2024","Logisch","00","Nee","2024-04-16T00:00:00.000",,"2016-04-16T00:00:00.000","2016-04-16T00:00:00.000",,,,,,,,,,,"153",,,,,,,,,,"A",,,,,,,"https://opendata.rdw.nl/resource/3huj-srit.json","https://opendata.rdw.nl/resource/8ys7-d773.json","https://opendata.rdw.nl/resource/vezc-m2t6.json","https://opendata.rdw.nl/resource/jhie-znh9.json","https://opendata.rdw.nl/resource/kmfi-hrps.json"
"JK921S","Personenauto","SUZUKI","CELERIO","20240422",,"994","hatchback","5","WIT","Niet geregistreerd","3","998","790","1260","890","400","400","20160422","20160422","Geen verstrekking in Open Data","11399","Nee",,,,,,,"5","4","0","0",,"360","160","M1",,,"in motorruimte a.","1260","LF",,"e6*2007/46*0119*02","E62S","MT25S","0","0.06","243","Ja","Nee",,"Nee","1660","0",,"2022","Logisch","00","Nee","2024-04-22T00:00:00.000",,"2016-04-22T00:00:00.000","2016-04-22T00:00:00.000",,,,,,,,,,,"153",,,,,,,,,,"A",,,,,,,"https://opendata.rdw.nl/resource/3huj-srit.json","https://opendata.rdw.nl/resource/8ys7-d773.json","https://opendata.rdw.nl/resource/vezc-m2t6.json","https://opendata.rdw.nl/resource/jhie-znh9.json","https://opendata.rdw.nl/resource/kmfi-hrps.json"
"JP622R","Personenauto","SUZUKI","CELERIO","20240623",,"994","hatchback","5","GRIJS","Niet geregistreerd","3","998","790","1260","890","400","400","20160623","20160623","Geen verstrekking in Open Data","11798","Nee",,,,,,,"5","4","0","0",,"360","160","M1",,,"in motorruimte a.","1260","LF",,"e6*2007/46*0119*02","E62S","MT25S","0","0.06","243","Ja","Nee",,"Nee","1660","0",,"2023","Logisch","00","Nee","2024-06-23T00:00:00.000",,"2016-06-23T00:00:00.000","2016-06-23T00:00:00.000",,,,,,,,,,,"153",,,,,,,,,,"A",,,,,,,"https://opendata.rdw.nl/resource/3huj-srit.json","https://opendata.rdw.nl/resource/8ys7-d773.json","https://opendata.rdw.nl/resource/vezc-m2t6.json","https://opendata.rdw.nl/resource/jhie-znh9.json","https://opendata.rdw.nl/resource/kmfi-hrps.json"
"JR852Z","Personenauto","SUZUKI","CELERIO",,,"994","hatchback","5","ROOD","Niet geregistreerd","3","998","790","1260","890","400","400","20160601","20160601","Geen verstrekking in Open Data","11798","Nee",,,,,,,"5","4","0","0",,"0","0","M1",,,"in motorruimte a.","1260","LF",,"e6*2007/46*0119*02","E62S","MT25S","0","0.06","243","Ja","Nee",,"Nee","1660","0",,"2022","Logisch","00","Nee",,,"2016-06-01T00:00:00.000","2016-06-01T00:00:00.000",,,,,,,,,,,,,,,,,,,,,"A",,,,,,,"https://opendata.rdw.nl/resource/3huj-srit.json","https://opendata.rdw.nl/resource/8ys7-d773.json","https://opendata.rdw.nl/resource/vezc-m2t6.json","https://opendata.rdw.nl/resource/jhie-znh9.json","https://opendata.rdw.nl/resource/kmfi-hrps.json"