"kenteken","voertuigsoort","merk","handelsbenaming","vervaldatum_apk","datum_tenaamstelling","bruto_bpm","inrichting","aantal_zitplaatsen","eerste_kleur","tweede_kleur","aantal_cilinders","cilinderinhoud","massa_ledig_voertuig","toegestane_maximum_massa_voertuig","massa_rijklaar","maximum_massa_trekken_ongeremd","maximum_trekken_massa_geremd","datum_eerste_toelating","datum_eerste_tenaamstelling_in_nederland","wacht_op_keuren","catalogusprijs","wam_verzekerd","maximale_constructiesnelheid","laadvermogen","oplegger_geremd","aanhangwagen_autonoom_geremd","aanhangwagen_middenas_geremd","aantal_staanplaatsen","aantal_deuren","aantal_wielen","afstand_hart_koppeling_tot_achterzijde_voertuig","afstand_voorzijde_voertuig_tot_hart_koppeling","afwijkende_maximum_snelheid","lengte","breedte","europese_voertuigcategorie","europese_voertuigcategorie_toevoeging","europese_uitvoeringcategorie_toevoeging","plaats_chassisnummer","technische_max_massa_voertuig","type","type_gasinstallatie","typegoedkeuringsnummer","variant","uitvoering","volgnummer_wijziging_eu_typegoedkeuring","vermogen_massarijklaar","wielbasis","export_indicator","openstaande_terugroepactie_indicator","vervaldatum_tachograaf","taxi_indicator","maximum_massa_samenstelling","aantal_rolstoelplaatsen","maximum_ondersteunende_snelheid","jaar_laatste_registratie_tellerstand","tellerstandoordeel","code_toelichting_tellerstandoordeel","tenaamstellen_mogelijk","vervaldatum_apk_dt","datum_tenaamstelling_dt","datum_eerste_toelating_dt","datum_eerste_tenaamstelling_in_nederland_dt","vervaldatum_tachograaf_dt","maximum_last_onder_de_vooras_sen_tezamen_koppeling","type_remsysteem_voertuig_code","rupsonderstelconfiguratiecode","wielbasis_voertuig_minimum","wielbasis_voertuig_maximum","lengte_voertuig_minimum","lengte_voertuig_maximum","breedte_voertuig_minimum","breedte_voertuig_maximum","hoogte_voertuig","hoogte_voertuig_minimum","hoogte_voertuig_maximum","massa_bedrijfsklaar_minimaal","massa_bedrijfsklaar_maximaal","technisch_toelaatbaar_massa_koppelpunt","maximum_massa_technisch_maximaal","maximum_massa_technisch_minimaal","subcategorie_nederland","verticale_belasting_koppelpunt_getrokken_voertuig","zuinigheidsclassificatie","registratie_datum_goedkeuring_afschrijvingsmoment_bpm","registratie_datum_goedkeuring_afschrijvingsmoment_bpm_dt","gem_lading_wrde","aerodyn_voorz","massa_alt_aandr","verl_cab_ind","api_gekentekende_voertuigen_assen","api_gekentekende_voertuigen_brandstof","api_gekentekende_voertuigen_carrosserie","api_gekentekende_voertuigen_carrosserie_specifiek","api_gekentekende_voertuigen_voertuigklasse"
"01DXXR","Personenauto","SAAB","SAAB 9-5","20240504",,"13675","stationwagen","5","ZWART","Niet geregistreerd","4","2290","1632","2160","1732","750","1800","20000111","20000111","Geen verstrekking in Open Data",,"Nee",,,,,,,"4","4",,,,"481",,"M1",,,"midden tegen schutbord onder motorkap","2160",,"G3 gasinstallatie",,,,,"0.10","270","Ja","Nee",,"Nee","3960",,,"2023","Logisch","00","Nee","2024-05-04T00:00:00.000",,"2000-01-11T00:00:00.000","2000-01-11T00:00:00.000",,,,,,,,,,,,,,,,,,,,,,,,,,,,"https://opendata.rdw.nl/resource/3huj-srit.json","https://opendata.rdw.nl/resource/8ys7-d773.json","https://opendata.rdw.nl/resource/vezc-m2t6.json","https://opendata.rdw.nl/resource/jhie-znh9.json","https://opendata.rdw.nl/resource/kmfi-hrps.json"
"01LHFX","Personenauto","SAAB","SAAB 9-5","20221026",,"12298","sedan","5","GRIJS","Niet geregistreerd","4","2290","1530","2090","1630","750","1800","20030115","20030115","Geen verstrekking in Open Data",,"Nee",,,,,,,"4","4","0","0",,"483","0","M1",,,"midden tegen schutbord onder motorkap","2090",,,"e11*96/27*0073*15","E4E","A08","0","0.08","270","Ja","Nee",,"Nee","3890","0",,"2022","Onlogisch","04","Nee","2022-10-26T00:00:00.000",,"2003-01-15T00:00:00.000","2003-01-15T00:00:00.000",,,,,,,,,,,,,,,,,,,,,"E",,,,,,,"https://opendata.rdw.nl/resource/3huj-srit.json","https://opendata.rdw.nl/resource/8ys7-d773.json","https://opendata.rdw.nl/resource/vezc-m2t6.json","https://opendata.rdw.nl/resource/jhie-znh9.json","https://opendata.rdw.nl/resource/kmfi-hrps.json"
"01NND1","Personenauto","SAAB","SAAB 9-5","20240512",,"14931","sedan","5","GRIJS","Niet geregistreerd","4","1956","1650","2280","1750","750","1700","20101012","20101012","Geen verstrekking in Open Data","54549","Nee",,,,,,,"4","4","0","0",,"501","0","M1",,,"r. schutbord","2280","YS3G",,"e4*2007/46*0137*03","G4LAA","A6F01","0","0.07","284","Ja","Nee",,"Nee","4080","0","0.00","2023","Logisch","00","Nee","2024-05-12T00:00:00.000",,"2010-10-12T00:00:00.000","2010-10-12T00:00:00.000",,,,,,,,,,,,,,,,,,,,,"C",,,,,,,"https://opendata.rdw.nl/resource/3huj-srit.json","https://opendata.rdw.nl/resource/8ys7-d773.json","https://opendata.rdw.nl/resource/vezc-m2t6.json","https://opendata.rdw.nl/resource/jhie-znh9.json","https://opendata.rdw.nl/resource/kmfi-hrps.json"
"01RZXP","Personenauto","SAAB","SAAB 9-5","20240322",,"14626","stationwagen","5","ZWART","Niet geregistreerd","4","2290","1545","2110","1645","750","1800","20051101","20051101","Geen verstrekking in Open Data",,"Nee",,,,,,,"4","4","0","0",,"483","0","M1",,,"midden tegen schutbord onder motorkap","2110",,,"e11*96/27*0073*21","E5G/TK","M03","0","0.11","270","Ja","Nee",,"Nee","3910","0",,"2023","Logisch","00","Nee","2024-03-22T00:00:00.000",,"2005-11-01T00:00:00.000","2005-11-01T00:00:00.000",,,,,,,,,,,,,,,,,,,,,"D",,,,,,,"https://opendata.rdw.nl/resource/3huj-srit.json","https://opendata.rdw.nl/resource/8ys7-d773.json","https://opendata.rdw.nl/resource/vezc-m2t6.json","https://opendata.rdw.nl/resource/jhie-znh9.json","https://opendata.rdw.nl/resource/kmfi-hrps.json"
"02SPDK","Personenauto","SAAB","SAAB 9-5","20230504",,"12116","sedan","5","GRIJS","Niet geregistreerd","4","1910","1500","2090","1600","750","1800","20060324","20060324","Geen verstrekking in Open Data","44736","Nee",,,,,,,"4","4","0","0",,"484","0","M1",,,"r. tegen schutbord onder motorkap","2090",,,"e4*2001/116*0096*00","E4W","M5 01","0","0.07","270","Ja","Nee",,"Nee","3890","0",,"2023","Logisch","00","Nee","2023-05-04T00:00:00.000",,"2006-03-24T00:00:00.000","2006-03-24T00:00:00.000",,,,,,,,,,,,,,,,,,,,,"D",,,,,,,"https://opendata.rdw.nl/resource/3huj-srit.json","https://opendata.rdw.nl/resource/8ys7-d773.json","https://opendata.rdw.nl/resource/vezc-m2t6.json","https://opendata.rdw.nl/resource/jhie-znh9.json","https://opendata.rdw.nl/resource/kmfi-hrps.json"
"03HXJV","Personenauto","SAAB","SAAB 9-5",,,"12546","sedan","5","GRIJS","Niet geregistreerd","4","2290","1510","2060","1610","750","1800","20020108","20020108","Geen verstrekking in Open Data",,"Nee",,,,,,,"4","4","0","0",,"483","0","M1",,,"midden tegen schutbord onder motorkap","2060",,,"e11*96/27*0073*11","E4G/TK","M01","0","0.11","270","Ja","Nee",,"Nee","3860","0",,"2022","Logisch","00","Nee",,,"2002-01-08T00:00:00.000","2002-01-08T00:00:00.000",,,,,,,,,,,,,,,,,,,,,"C",,,,,,,"https://opendata.rdw.nl/resource/3huj-srit.json","https://opendata.rdw.nl/resource/8ys7-d773.json","https://opendata.rdw.nl/resource/vezc-m2t6.json","https://opendata.rdw.nl/resource/jhie-znh9.json","https://opendata.rdw.nl/resource/kmfi-hrps.json"
"03LGJR","Personenauto","SAAB","SAAB 9-5","20230412",,"13673","stationwagen","5","GRIJS","Niet geregistreerd","4","2290","1610","2170","1710","750","1800","20030103","20030103","Geen verstrekking in Open Data",,"Nee",,,,,,,"4","4","0","0",,"483","0","M1",,,"midden tegen schutbord onder motorkap","2170",,,"e11*96/27*0073*13","E5G/TK","A01","0","0.11","270","Ja","Nee",,"Nee","3970","0",,"2022","Logisch","00","Nee","2023-04-12T00:00:00.000",,"2003-01-03T00:00:00.000","2003-01-03T00:00:00.000",,,,,,,,,,,,,,,,,,,,,"E",,,,,,,"https://opendata.rdw.nl/resource/3huj-srit.json","https://opendata.rdw.nl/resource/8ys7-d773.json","https://opendata.rdw.nl/resource/vezc-m2t6.json","https://opendata.rdw.nl/resource/jhie-znh9.json","https://opendata.rdw.nl/resource/kmfi-hrps.json"
"04NDT8","Personenauto","SAAB","SAAB 9-5","20230917",,"22805","sedan","5","BLAUW","Niet geregistreerd","6","2792","1845","2440","1945","750","2000","20100819","20100819","Geen verstrekking in Open Data","82219","Nee",,,,,,,"4","4","0","0",,"501","0","M1",,,"r. schutbord","2440","YS3G",,"e4*2007/46*0137*02","G4J","A6A01","0","0.11","284","Ja","Nee",,"Nee","4440","0","0.00","2023","Logisch","00","Nee","2023-09-17T00:00:00.000",,"2010-08-19T00:00:00.000","2010-08-19T00:00:00.000",,,,,,,,,,,,,,,,,,,,,"E",,,,,,,"https://opendata.rdw.nl/resource/3huj-srit.json","https://opendata.rdw.nl/resource/8ys7-d773.json","https://opendata.rdw.nl/resource/vezc-m2t6.json","https://opendata.rdw.nl/resource/jhie-znh9.json","https://opendata.rdw.nl/resource/kmfi-hrps.json"
"04NLXF","Personenauto","SAAB","SAAB 9-5","20240407","20240330","12367","sedan","5","GRIJS","Niet geregistreerd","4","2290","1530","2090","1630","750","1800","20031205","20031205","Geen verstrekking in Open Data",,"Ja",,,,,,,"4","4","0","0",,"483","0","M1",,,"midden tegen schutbord onder motorkap","2090",,,"e11*96/27*0073*17","E4E","A08","0","0.08","270","Ja","Nee",,"Nee","3890","0",,"2024","Logisch","00","Nee","2024-04-07T00:00:00.000","2024-03-30T00:00:00.000","2003-12-05T00:00:00.000","2003-12-05T00:00:00.000",,,,,,,,,,,,,,,,,,,,,"E",,,,,,,"https://opendata.rdw.nl/resource/3huj-srit.json","https://opendata.rdw.nl/resource/8ys7-d773.json","https://opendata.rdw.nl/resource/vezc-m2t6.json","https://opendata.rdw.nl/resource/jhie-znh9.json","https://opendata.rdw.nl/resource/kmfi-hrps.json"
"07LFJH","Personenauto","SAAB","SAAB 9-5",,,"13784","stationwagen","5","GRIJS","Niet geregistreerd","4","2290","1647","2170","1747","750","1800","20021129","20021129","Geen verstrekking in Open Data",,"Nee",,,,,,,"4","4","0","0",,"483","0","M1",,,"midden tegen schutbord onder motorkap","2170",,"G3 gasinstallatie","e11*96/27*0073*14","E5E","A04","0","0.08","270","Ja","Nee",,"Nee","3970","0",,"2018","Logisch","00","Nee",,,"2002-11-29T00:00:00.000","2002-11-29T00:00:00.000",,"0",,,,,,,,,,,,,,,,,,,"E",,,,,,,"https://opendata.rdw.nl/resource/3huj-srit.json","https://opendata.rdw.nl/resource/8ys7-d773.json","https://opendata.rdw.nl/resource/vezc-m2t6.json","https://opendata.rdw.nl/resource/jhie-znh9.json","https://opendata.rdw.nl/resource/kmfi-hrps.json"
"07NZKD","Personenauto","SAAB","SAAB 9-5","20230114",,"10857","sedan","5","BLAUW","Niet geregistreerd","4","2290","1603","2100","1703","750","1800","20040409","20040409","Geen verstrekking in Open Data",,"Nee",,,,,,,"4","4","0","0",,"483","0","M1",,,"midden tegen schutbord onder motorkap","2100",,"G3 gasinstallatie","e11*96/27*0073*19","E4E","A09","0","0.08","270","Ja","Nee",,"Nee","3900","0",,"2022","Logisch","00","Nee","2023-01-14T00:00:00.000",,"2004-04-09T00:00:00.000","2004-04-09T00:00:00.000",,"0",,,,,,,,,,,,,,,,,,,"E",,,,,,,"https://opendata.rdw.nl/resource/3huj-srit.json","https://opendata.rdw.nl/resource/8ys7-d773.json","https://opendata.rdw.nl/resource/vezc-m2t6.json","https://opendata.rdw.nl/resource/jhie-znh9.json","https://opendata.rdw.nl/resource/kmfi-hrps.json"
"08SBXX","Personenauto","SAAB","SAAB 9-5","20230509",,"10949","stationwagen","5","ZWART","Niet geregistreerd","4","2290","1585","2160","1685","750","1800","20010716","20051115","Geen verstrekking in Open Data",,"Nee",,,,,,,"4","4","0","0",,"481","0","M1",,,"midden tegen schutbord onder motorkap","2160",,,"e11*96/27*0073*08","E5E","A03","1","0.08","270","Ja","Nee",,"Nee","3960","0","0.00","2022","Onlogisch","04","Nee","2023-05-09T00:00:00.000",,"2001-07-16T00:00:00.000","2005-11-15T00:00:00.000",,,,,,,,,,,,,,,,,,,,,"E",,,,,,,"https://opendata.rdw.nl/resource/3huj-srit.json","https://opendata.rdw.nl/resource/8ys7-d773.json","https://opendata.rdw.nl/resource/vezc-m2t6.json","https://opendata.rdw.nl/resource/jhie-znh9.json","https://opendata.rdw.nl/resource/kmfi-hrps.json"
"09FJPH","Personenauto","SAAB","SAAB 9-5","20230216",,"12925","stationwagen","5","ZWART","Niet geregistreerd","4","2290","1580","2150","1680","750","1800","19990301","20000405","Geen verstrekking in Open Data",,"Nee",,,,,,,"4","4","0","0",,"481","0","M1",,,"midden tegen schutbord onder motorkap","2150",,,"e11*96/27*0073*04","E5E","A01","1","0.07","270","Ja","Nee",,"Nee","3950","0",,"2022","Geen oordeel","05","Nee","2023-02-16T00:00:00.000",,"1999-03-01T00:00:00.000","2000-04-05T00:00:00.000",,,,,,,,,,,,,,,,,,,,,,,,,,,,"https://opendata.rdw.nl/resource/3huj-srit.json","https://opendata.rdw.nl/resource/8ys7-d773.json","https://opendata.rdw.nl/resource/vezc-m2t6.json","https://opendata.rdw.nl/resource/jhie-znh9.json","https://opendata.rdw.nl/resource/kmfi-hrps.json"
"09PVR6","Personenauto","SAAB","SAAB 9-5","20240112",,"17635","sedan","5","GRIJS","Niet geregistreerd","4","1998","1650","2280","1750","750","1800","20110404","20110404","Geen verstrekking in Open Data","58561","Ja",,,,,,,"4","4","0","0",,"501","0","M1",,,"r. schutbord","2280","YS3G",,"e4*2007/46*0137*02","G4Z","A6F01","0","0.09","284","Ja","Nee",,"Nee","4080","0","0.00","2024","Logisch","00","Nee","2024-01-12T00:00:00.000",,"2011-04-04T00:00:00.000","2011-04-04T00:00:00.000",,,,,,,,,,,,,,,,,,,,,"D",,,,,,,"https://opendata.rdw.nl/resource/3huj-srit.json","https://opendata.rdw.nl/resource/8ys7-d773.json","https://opendata.rdw.nl/resource/vezc-m2t6.json","https://opendata.rdw.nl/resource/jhie-znh9.json","https://opendata.rdw.nl/resource/kmfi-hrps.json"
"10GBPL","Personenauto","SAAB","SAAB 9-5","20240508",,"13896","stationwagen","5","BLAUW","Niet geregistreerd","4","2290","1560","2130","1660","750","1800","20000922","20000922","Geen verstrekking in Open Data",,"Nee",,,,,,,"4","4","0","0",,"481","0","M1",,,"midden tegen schutbord onder motorkap","2130",,,"e11*96/27*0073*08","E5G","M02","1","0.10","270","Ja","Nee",,"Nee","3930","0","0.00","2023","Logisch","00","Nee","2024-05-08T00:00:00.000",,"2000-09-22T00:00:00.000","2000-09-22T00:00:00.000",,,,,,,,,,,,,,,,,,,,,,,,,,,,"https://opendata.rdw.nl/resource/3huj-srit.json","https://opendata.rdw.nl/resource/8ys7-d773.json","https://opendata.rdw.nl/resource/vezc-m2t6.json","https://opendata.rdw.nl/resource/jhie-znh9.json","https://opendata.rdw.nl/resource/kmfi-hrps.json"
"10GDHL","Personenauto","SAAB","SAAB 9-5","20240303",,"8815","sedan","5","ZWART","Niet geregistreerd","4","1985","1495","2060","1595","750","1800","20000922","20000922","Geen verstrekking in Open Data",,"Nee",,,,,,,"4","4","0","0",,"481","0","M1",,,"midden tegen schutbord onder motorkap","2060",,,"e11*96/27*0073*08","E4C","M06","1","0.07","270","Ja","Nee",,"Nee","3860","0","0.00","2023","Onlogisch","04","Nee","2024-03-03T00:00:00.000",,"2000-09-22T00:00:00.000","2000-09-22T00:00:00.000",,,,,,,,,,,,,,,,,,,,,,,,,,,,"https://opendata.rdw.nl/resource/3huj-srit.json","https://opendata.rdw.nl/resource/8ys7-d773.json","https://opendata.rdw.nl/resource/vezc-m2t6.json","https://opendata.rdw.nl/resource/jhie-znh9.json","https://opendata.rdw.nl/resource/kmfi-hrps.json"
"10HSRH","Personenauto","SAAB","SAAB 9-5",,,"12527","stationwagen","5","GRIJS","Niet geregistreerd","4","2290","1636","2170","1736","750","1800","20011109","20011109","Geen verstrekking in Open Data",,"Nee",,,,,,,"4","4","0","0",,"483","0","M1",,,"midden tegen schutbord onder motorkap","2170",,"G3 gasinstallatie","e11*96/27*0073*10","E5E","A04","0","0.08","270","Ja","Nee",,"Nee","3970","0",,"2017","Logisch","00","Nee",,,"2001-11-09T00:00:00.000","2001-11-09T00:00:00.000",,"0",,,,,,,,,,,,,,,,,,,"E",,,,,,,"https://opendata.rdw.nl/resource/3huj-srit.json","https://opendata.rdw.nl/resource/8ys7-d773.json","https://opendata.rdw.nl/resource/vezc-m2t6.json","https://opendata.rdw.nl/resource/jhie-znh9.json","https://opendata.rdw.nl/resource/kmfi-hrps.json"
"10LHHN","Personenauto","SAAB","SAAB 9-5","20230905",,"9753","stationwagen","5","GRIJS","Niet geregistreerd","4","1985","1560","2130","1660","750","1800","20030106","20030106","Geen verstrekking in Open Data",,"Nee",,,,,,,"4","4","0","0",,"483","0","M1",,,"midden tegen schutbord onder motorkap","2130",,,"e11*96/27*0073*13","E5C","M06","0","0.07","270","Ja","Nee",,"Nee","3930","0",,"2022","Logisch","00","Nee","2023-09-05T00:00:00.000",,"2003-01-06T00:00:00.000","2003-01-06T00:00:00.000",,,,,,,,,,,,,,,,,,,,,"D",,,,,,,"https://opendata.rdw.nl/resource/3huj-srit.json","https://opendata.rdw.nl/resource/8ys7-d773.json","https://opendata.rdw.nl/resource/vezc-m2t6.json","https://opendata.rdw.nl/resource/jhie-znh9.json","https://opendata.rdw.nl/resource/kmfi-hrps.json"
"10NBHT","Personenauto","SAAB","SAAB 9-5","20230915",,"9504","stationwagen","5","GRIJS","Niet geregistreerd","4","1985","1560","2130","1660","750","1800","20030709","20030709","Geen verstrekking in Open Data",,"Nee",,,,,,,"4","4","0","0",,"483","0","M1",,,"midden tegen schutbord onder motorkap","2130",,,"e11*96/27*0073*17","E5C","M06","0","0.07","270","Ja","Nee",,"Nee","3930","0",,"2022","Logisch","00","Nee","2023-09-15T00:00:00.000",,"2003-07-09T00:00:00.000","2003-07-09T00:00:00.000",,,,,,,,,,,,,,,,,,,,,"D",,,,,,,"https://opendata.rdw.nl/resource/3huj-srit.json","https://opendata.rdw.nl/resource/8ys7-d773.json","https://opendata.rdw.nl/resource/vezc-m2t6.json","https://opendata.rdw.nl/resource/jhie-znh9.json","https://opendata.rdw.nl/resource/kmfi-hrps.json"
"11GVSJ","Personenauto","SAAB","SAAB 9-5","20240406","20230707","9061","sedan","5","GROEN","Niet geregistreerd","4","1985","1490","2060","1590","750","1800","20010406","20010406","Geen verstrekking in Open Data",,"Nee",,,,,,,"4","4","0","0",,"481","0","M1",,,"midden tegen schutbord onder motorkap","2060",,,"e11*96/27*0073*07","E4C","M05","1","0.07","270","Ja","Nee",,"Nee","3860","0",,"2024","Niet geregistreerd","NG","Nee","2024-04-06T00:00:00.000","2023-07-07T00:00:00.000","2001-04-06T00:00:00.000","2001-04-06T00:00:00.000",,,,,,,,,,,,,,,,,,,,,"D",,,,,,,"https://opendata.rdw.nl/resource/3huj-srit.json","https://opendata.rdw.nl/resource/8ys7-d773.json","https://opendata.rdw.nl/resource/vezc-m2t6.json","https://opendata.rdw.nl/resource/jhie-znh9.json","https://opendata.rdw.nl/resource/kmfi-hrps.json"
"12FFLD","Personenauto","SAAB","SAAB 9-5","20230603",,"9849","sedan","5","ZWART","Niet geregistreerd","4","2290","1490","2060","1590","750","1800","20000302","20000302","Geen verstrekking in Open Data",,"Nee",,,,,,,"4","4","0","0",,"481","0","M1",,,"midden tegen schutbord onder motorkap","2060",,,"e11*96/27*0073*07","E4E","M06","1","0.08","270","Ja","Nee",,"Nee","3860","0",,"2022","Onlogisch","04","Nee","2023-06-03T00:00:00.000",,"2000-03-02T00:00:00.000","2000-03-02T00:00:00.000",,,,,,,,,,,,,,,,,,,,,,,,,,,,"https://opendata.rdw.nl/resource/3huj-srit.json","https://opendata.rdw.nl/resource/8ys7-d773.json","https://opendata.rdw.nl/resource/vezc-m2t6.json","https://opendata.rdw.nl/resource/jhie-znh9.json","https://opendata.rdw.nl/resource/kmfi-hrps.json"
"13DPSV","Personenauto","SAAB","SAAB 9-5",,,"8638","sedan","5","ROOD","Niet geregistreerd","4","1985","1455","2020","1555","750","1800","19991022","19991022","Geen verstrekking in Open Data",,"Nee",,,,,,,"4","4","0","0",,"481","0","M1",,,"midden tegen schutbord onder motorkap","2020",,,"e11*96/27*0073*01","E4C","M01","1","0.07","270","Ja","Nee",,"Nee","3820","0",,"2022","Logisch","00","Nee",,,"1999-10-22T00:00:00.000","1999-10-22T00:00:00.000",,,,,,,,,,,,,,,,,,,,,,,,,,,,"https://opendata.rdw.nl/resource/3huj-srit.json","https://opendata.rdw.nl/resource/8ys7-d773.json","https://opendata.rdw.nl/resource/vezc-m2t6.json","https://opendata.rdw.nl/resource/jhie-znh9.json","https://opendata.rdw.nl/resource/kmfi-hrps.json"
"13SBB4","Personenauto","SAAB","SAAB 9-5","20240214",,"12885","sedan","5","GRIJS","Niet geregistreerd","4","1998","1625","2260","1725","750","1800","20110901","20110901","Geen verstrekking in Open Data","54425","Nee",,,,,,,"4","4","0","0",,"501","0","M1",,,"r. schutbord","2260","YS3G",,"e4*2007/46*0137*02","G4Z","M6F01","0","0.09","284","Ja","Nee",,"Nee","4060","0","0.00","2023","Logisch","00","Nee","2024-02-14T00:00:00.000",,"2011-09-01T00:00:00.000","2011-09-01T00:00:00.000",,,,,,,,,,,,,,,,,,,,,"C",,,,,,,"https://opendata.rdw.nl/resource/3huj-srit.json","https://opendata.rdw.nl/resource/8ys7-d773.json","https://opendata.rdw.nl/resource/vezc-m2t6.json","https://opendata.rdw.nl/resource/jhie-znh9.json","https://opendata.rdw.nl/resource/kmfi-hrps.json"
"14HDD1","Personenauto","SAAB","SAAB 9-5",,,"13208","sedan","5","ZWART","Niet geregistreerd","4","1910","1535","2130","1635","750","1800","20081017","20081017","Geen verstrekking in Open Data","49357","Nee",,,,,,,"4","4","0","0",,"484","0","M1",,,"r. tegen schutbord onder motorkap","2130",,,"e4*2001/116*0096*02","E4W","A5 01","0","0.07","270","Ja","Nee",,"Nee","3930","0",,"2022","Logisch","00","Nee",,,"2008-10-17T00:00:00.000","2008-10-17T00:00:00.000",,,,,,,,,,,,,,,,,,,,,"E",,,,,,,"https://opendata.rdw.nl/resource/3huj-srit.json","https://opendata.rdw.nl/resource/8ys7-d773.json","https://opendata.rdw.nl/resource/vezc-m2t6.json","https://opendata.rdw.nl/resource/jhie-znh9.json","https://opendata.rdw.nl/resource/kmfi-hrps.json"
"14PLFD","Personenauto","SAAB","SAAB 9-5","20240703",,"9687","stationwagen","5","ZWART","Niet geregistreerd","4","1985","1560","2140","1660","750","1800","20040813","20040813","Geen verstrekking in Open Data",,"Nee",,,,,,,"4","4","0","0",,"483","0","M1",,,"midden tegen schutbord onder motorkap","2140",,,"e11*96/27*0073*19","E5C","M07","0","0.07","270","Ja","Nee",,"Nee","3940","0",,"2023","Logisch","00","Nee","2024-07-03T00:00:00.000",,"2004-08-13T00:00:00.000","2004-08-13T00:00:00.000",,,,,,,,,,,,,,,,,,,,,"D",,,,,,,"https://opendata.rdw.nl/resource/3huj-srit.json","https://opendata.rdw.nl/resource/8ys7-d773.json","https://opendata.rdw.nl/resource/vezc-m2t6.json","https://opendata.rdw.nl/resource/jhie-znh9.json","https://opendata.rdw.nl/resource/kmfi-hrps.json"
"15DPSV","Personenauto","SAAB","SAAB 9-5","20220923",,"11424","stationwagen","5","ZWART","Niet geregistreerd","4","1985","1555","2130","1655","750","1800","19991029","19991029","Geen verstrekking in Open Data",,"Nee",,,,,,,"4","4","0","0",,"481","0","M1",,,"midden tegen schutbord onder motorkap","2130",,,"e11*96/27*0073*05","E5C","M01","1","0.07","270","Ja","Nee",,"Nee","3930","0",,"2022","Logisch","00","Nee","2022-09-23T00:00:00.000",,"1999-10-29T00:00:00.000","1999-10-29T00:00:00.000",,,,,,,,,,,,,,,,,,,,,,,,,,,,"https://opendata.rdw.nl/resource/3huj-srit.json","https://opendata.rdw.nl/resource/8ys7-d773.json","https://opendata.rdw.nl/resource/vezc-m2t6.json","https://opendata.rdw.nl/resource/jhie-znh9.json","https://opendata.rdw.nl/resource/kmfi-hrps.json"
"15HBN3","Personenauto","SAAB","SAAB 9-5","20241102",,"10598","sedan","5","BLAUW","Niet geregistreerd","4","2290","1470","2050","1570","750","1800","20081010","20081010","Geen verstrekking in Open Data","43344","Nee",,,,,,,"4","4","0","0",,"484","0","M1",,,"midden tegen schutbord onder motorkap","2050","YS3E",,"e4*2001/116*0096*06","E4E","M5 02","0","0.09","270","Ja","Nee",,"Nee","3850","0",,"2024","Logisch","00","Nee","2024-11-02T00:00:00.000",,"2008-10-10T00:00:00.000","2008-10-10T00:00:00.000",,,,,,,,,,,,,,,,,,,,,"D",,,,,,,"https://opendata.rdw.nl/resource/3huj-srit.json","https://opendata.rdw.nl/resource/8ys7-d773.json","https://opendata.rdw.nl/resource/vezc-m2t6.json","https://opendata.rdw.nl/resource/jhie-znh9.json","https://opendata.rdw.nl/resource/kmfi-hrps.json"