"kenteken","voertuigsoort","merk","handelsbenaming","vervaldatum_apk","datum_tenaamstelling","bruto_bpm","inrichting","aantal_zitplaatsen","eerste_kleur","tweede_kleur","aantal_cilinders","cilinderinhoud","massa_ledig_voertuig","toegestane_maximum_massa_voertuig","massa_rijklaar","maximum_massa_trekken_ongeremd","maximum_trekken_massa_geremd","datum_eerste_toelating","datum_eerste_tenaamstelling_in_nederland","wacht_op_keuren","catalogusprijs","wam_verzekerd","maximale_constructiesnelheid","laadvermogen","oplegger_geremd","aanhangwagen_autonoom_geremd","aanhangwagen_middenas_geremd","aantal_staanplaatsen","aantal_deuren","aantal_wielen","afstand_hart_koppeling_tot_achterzijde_voertuig","afstand_voorzijde_voertuig_tot_hart_koppeling","afwijkende_maximum_snelheid","lengte","breedte","europese_voertuigcategorie","europese_voertuigcategorie_toevoeging","europese_uitvoeringcategorie_toevoeging","plaats_chassisnummer","technische_max_massa_voertuig","type","type_gasinstallatie","typegoedkeuringsnummer","variant","uitvoering","volgnummer_wijziging_eu_typegoedkeuring","vermogen_massarijklaar","wielbasis","export_indicator","openstaande_terugroepactie_indicator","vervaldatum_tachograaf","taxi_indicator","maximum_massa_samenstelling","aantal_rolstoelplaatsen","maximum_ondersteunende_snelheid","jaar_laatste_registratie_tellerstand","tellerstandoordeel","code_toelichting_tellerstandoordeel","tenaamstellen_mogelijk","vervaldatum_apk_dt","datum_tenaamstelling_dt","datum_eerste_toelating_dt","datum_eerste_tenaamstelling_in_nederland_dt","vervaldatum_tachograaf_dt","maximum_last_onder_de_vooras_sen_tezamen_koppeling","type_remsysteem_voertuig_code","rupsonderstelconfiguratiecode","wielbasis_voertuig_minimum","wielbasis_voertuig_maximum","lengte_voertuig_minimum","lengte_voertuig_maximum","breedte_voertuig_minimum","breedte_voertuig_maximum","hoogte_voertuig","hoogte_voertuig_minimum","hoogte_voertuig_maximum","massa_bedrijfsklaar_minimaal","massa_bedrijfsklaar_maximaal","technisch_toelaatbaar_massa_koppelpunt","maximum_massa_technisch_maximaal","maximum_massa_technisch_minimaal","subcategorie_nederland","verticale_belasting_koppelpunt_getrokken_voertuig","zuinigheidsclassificatie","registratie_datum_goedkeuring_afschrijvingsmoment_bpm","registratie_datum_goedkeuring_afschrijvingsmoment_bpm_dt","gem_lading_wrde","aerodyn_voorz","massa_alt_aandr","verl_cab_ind","api_gekentekende_voertuigen_assen","api_gekentekende_voertuigen_brandstof","api_gekentekende_voertuigen_carrosserie","api_gekentekende_voertuigen_carrosserie_specifiek","api_gekentekende_voertuigen_voertuigklasse"
"01DPFT","Personenauto","SAAB","SAAB 9-3",,,"6949","hatchback","5","GROEN","Niet geregistreerd","4","1985","1336","1850","1436","695","1600","19991013","19991013","Geen verstrekking in Open Data",,"Nee",,,,,,,"4","4","0","0",,"463","0","M1",,,"r. op schutbord onder motorkap","1850",,"G3 gasinstallatie","e4*98/14*0012*09","5J","M05 5D B204I FF FM53","1","0.07","261","Ja","Nee",,"Nee","3450","0",,"2016","Logisch","00","Nee",,,"1999-10-13T00:00:00.000","1999-10-13T00:00:00.000",,"0",,,,,,,,,,,,,,,,,,,,,,,,,,"https://opendata.rdw.nl/resource/3huj-srit.json","https://opendata.rdw.nl/resource/8ys7-d773.json","https://opendata.rdw.nl/resource/vezc-m2t6.json","https://opendata.rdw.nl/resource/jhie-znh9.json","https://opendata.rdw.nl/resource/kmfi-hrps.json"
"01RPGR","Personenauto","SAAB","SAAB 9-3","20220831",,"7250","sedan","5","ZWART","Niet geregistreerd","4","1796","1340","1910","1440","720","1400","20050630","20050630","Geen verstrekking in Open Data",,"Nee",,,,,,,"4","4","0","0",,"464","0","M1",,,"r. op schutbord onder motorkap","1910",,,"e4*2001/116*0065*08","F4B","M5 03","0","0.06","268","Ja","Nee",,"Nee","3310","0",,"2021","Logisch","00","Nee","2022-08-31T00:00:00.000",,"2005-06-30T00:00:00.000","2005-06-30T00:00:00.000",,,,,,,,,,,,,,,,,,,,,"C",,,,,,,"https://opendata.rdw.nl/resource/3huj-srit.json","https://opendata.rdw.nl/resource/8ys7-d773.json","https://opendata.rdw.nl/resource/vezc-m2t6.json","https://opendata.rdw.nl/resource/jhie-znh9.json","https://opendata.rdw.nl/resource/kmfi-hrps.json"
"01TJXF","Personenauto","SAAB","SAAB 9-3","20250129","20191202","11618","cabriolet","4","BLAUW","Niet geregistreerd","4","1985","1375","1840","1475","735","1600","20010706","20061007","Geen verstrekking in Open Data",,"Nee",,,,,,,"2","4","0","0",,"463","0","M1",,,"r. op schutbord onder motorkap","1840",,,"e4*98/14*0012*13","7C","M01 2D B205E FF FM55","1","0.07","261","Ja","Nee",,"Nee","3440","0",,"2024","Niet geregistreerd","NG","Nee","2025-01-29T00:00:00.000","2019-12-02T00:00:00.000","2001-07-06T00:00:00.000","2006-10-07T00:00:00.000",,,,,,,,,,,,,,,,,,,,,"D",,,,,,,"https://opendata.rdw.nl/resource/3huj-srit.json","https://opendata.rdw.nl/resource/8ys7-d773.json","https://opendata.rdw.nl/resource/vezc-m2t6.json","https://opendata.rdw.nl/resource/jhie-znh9.json","https://opendata.rdw.nl/resource/kmfi-hrps.json"
"01TVLT","Personenauto","SAAB","SAAB 9-3","20221126",,"11368","cabriolet","4","ZWART","Niet geregistreerd","4","1985","1375","1840","1475","735","1600","20010426","20070516","Geen verstrekking in Open Data",,"Nee",,,,,,,"2","4","0","0",,"463","0","M1",,,"r. op schutbord onder motorkap","1840",,,"e4*98/14*0012*12","7C","M01 2D B205E FF FM55","1","0.07","261","Ja","Nee",,"Nee","3440","0",,"2022","Geen oordeel","05","Nee","2022-11-26T00:00:00.000",,"2001-04-26T00:00:00.000","2007-05-16T00:00:00.000",,,,,,,,,,,,,,,,,,,,,"D",,,,,,,"https://opendata.rdw.nl/resource/3huj-srit.json","https://opendata.rdw.nl/resource/8ys7-d773.json","https://opendata.rdw.nl/resource/vezc-m2t6.json","https://opendata.rdw.nl/resource/jhie-znh9.json","https://opendata.rdw.nl/resource/kmfi-hrps.json"
"01ZRFT","Personenauto","SAAB","SAAB 9-3","20230609",,"13359","stationwagen","5","GROEN","Niet geregistreerd","4","1910","1545","2150","1645","750","1600","20080509","20080509","Geen verstrekking in Open Data","47767","Nee",,,,,,,"4","4","0","0",,"467","0","M1",,,"r. op schutbord onder motorkap","2150","YS3F",,"e4*2001/116*0065*18","F5P","A6 01","0","0.08","268","Ja","Nee",,"Nee","3750","0",,"2022","Logisch","00","Nee","2023-06-09T00:00:00.000",,"2008-05-09T00:00:00.000","2008-05-09T00:00:00.000",,,,,,,,,,,,,,,,,,,,,"E",,,,,,,"https://opendata.rdw.nl/resource/3huj-srit.json","https://opendata.rdw.nl/resource/8ys7-d773.json","https://opendata.rdw.nl/resource/vezc-m2t6.json","https://opendata.rdw.nl/resource/jhie-znh9.json","https://opendata.rdw.nl/resource/kmfi-hrps.json"
"02JSZ5","Personenauto","SAAB","SAAB 9-3","20240602",,"11501","cabriolet","4","GRIJS","Niet geregistreerd","4","1998","1580","2050","1680","750","1600","20050908","20090820","Geen verstrekking in Open Data",,"Nee",,,,,,,"2","4","0","0",,"464","0","M1",,,"midden tegen schutbord onder motorkap","2050",,,"e4*2001/116*0077*03","F7S","A5 02","0","0.08","268","Ja","Nee",,"Nee","3650","0",,"2023","Geen oordeel","05","Nee","2024-06-02T00:00:00.000",,"2005-09-08T00:00:00.000","2009-08-20T00:00:00.000",,"0",,,,,,,,,,,,,,,,,,,"E",,,,,,,"https://opendata.rdw.nl/resource/3huj-srit.json","https://opendata.rdw.nl/resource/8ys7-d773.json","https://opendata.rdw.nl/resource/vezc-m2t6.json","https://opendata.rdw.nl/resource/jhie-znh9.json","https://opendata.rdw.nl/resource/kmfi-hrps.json"
"02NLGP","Personenauto","SAAB","SAAB 9-3","20221126",,"10995","sedan","5","GRIJS","Niet geregistreerd","4","1985","1440","2000","1540","750","1600","20031114","20031114","Geen verstrekking in Open Data",,"Nee",,,,,,,"4","4","0","0",,"464","0","M1",,,"r. op schutbord onder motorkap","2000",,,"e4*2001/116*0065*04","F4F","A5 02","0","0.07","268","Ja","Nee",,"Nee","3600","0",,"2022","Logisch","00","Nee","2022-11-26T00:00:00.000",,"2003-11-14T00:00:00.000","2003-11-14T00:00:00.000",,,,,,,,,,,,,,,,,,,,,"E",,,,,,,"https://opendata.rdw.nl/resource/3huj-srit.json","https://opendata.rdw.nl/resource/8ys7-d773.json","https://opendata.rdw.nl/resource/vezc-m2t6.json","https://opendata.rdw.nl/resource/jhie-znh9.json","https://opendata.rdw.nl/resource/kmfi-hrps.json"
"02SBVP","Personenauto","SAAB","SAAB 9-3","20220601",,"8100","stationwagen","5","BLAUW","Niet geregistreerd","4","1796","1428","1970","1528","735","1400","20051119","20051119","Geen verstrekking in Open Data",,"Nee",,,,,,,"4","4","0","0",,"465","0","M1",,,"r. op schutbord onder motorkap","1970",,"G3 gasinstallatie","e4*2001/116*0065*10","F5B","M5 01","0","0.06","267","Ja","Nee",,"Nee","3370","0",,"2022","Onlogisch","04","Nee","2022-06-01T00:00:00.000",,"2005-11-19T00:00:00.000","2005-11-19T00:00:00.000",,"0",,,,,,,,,,,,,,,,,,,"C",,,,,,,"https://opendata.rdw.nl/resource/3huj-srit.json","https://opendata.rdw.nl/resource/8ys7-d773.json","https://opendata.rdw.nl/resource/vezc-m2t6.json","https://opendata.rdw.nl/resource/jhie-znh9.json","https://opendata.rdw.nl/resource/kmfi-hrps.json"
"02STB9","Personenauto","SAAB","SAAB 9-3","20240126",,"5530","sedan","5","WIT","Niet geregistreerd","4","1998","1453","1960","1553","750","1600","20100507","20120307","Geen verstrekking in Open Data","36150","Nee",,,,,,,"4","4","0","0",,"465","0","M1",,,"r. op schutbord onder motorkap","1960","YS3F","G3 gasinstallatie","e4*2001/116*0065*26","F4SBP","M6 02","0","0.08","268","Ja","Nee",,"Nee","3560","0",,"2023","Geen oordeel","05","Nee","2024-01-26T00:00:00.000",,"2010-05-07T00:00:00.000","2012-03-07T00:00:00.000",,"0",,,,,,,,,,,,,,,,,,,"C",,,,,,,"https://opendata.rdw.nl/resource/3huj-srit.json","https://opendata.rdw.nl/resource/8ys7-d773.json","https://opendata.rdw.nl/resource/vezc-m2t6.json","https://opendata.rdw.nl/resource/jhie-znh9.json","https://opendata.rdw.nl/resource/kmfi-hrps.json"
"03FLBF","Personenauto","SAAB","SAAB 9-3","20230803",,"6256","hatchback","5","ZWART","Niet geregistreerd","4","1985","1310","1870","1410","705","1600","20000501","20000501","Geen verstrekking in Open Data",,"Nee",,,,,,,"4","4","0","0",,"463","0","M1",,,"r. op schutbord onder motorkap","1870",,,"e4*98/14*0012*10","5T","M02 5D B204E FF FM55","1","0.08","261","Ja","Nee",,"Nee","3470","0","0.00","2023","Logisch","00","Nee","2023-08-03T00:00:00.000",,"2000-05-01T00:00:00.000","2000-05-01T00:00:00.000",,,,,,,,,,,,,,,,,,,,,,,,,,,,"https://opendata.rdw.nl/resource/3huj-srit.json","https://opendata.rdw.nl/resource/8ys7-d773.json","https://opendata.rdw.nl/resource/vezc-m2t6.json","https://opendata.rdw.nl/resource/jhie-znh9.json","https://opendata.rdw.nl/resource/kmfi-hrps.json"
"03NTTN","Personenauto","SAAB","SAAB 9-3","20230408",,"8880","sedan","5","GRIJS","Niet geregistreerd","4","1998","1440","2000","1540","750","1600","20040220","20040220","Geen verstrekking in Open Data",,"Nee",,,,,,,"4","4","0","0",,"464","0","M1",,,"r. op schutbord onder motorkap","2000",,,"e4*2001/116*0065*05","F4F","A5 02","0","0.07","268","Ja","Nee",,"Nee","3600","0",,"2023","Geen oordeel","07","Nee","2023-04-08T00:00:00.000",,"2004-02-20T00:00:00.000","2004-02-20T00:00:00.000",,,,,,,,,,,,,,,,,,,,,"E",,,,,,,"https://opendata.rdw.nl/resource/3huj-srit.json","https://opendata.rdw.nl/resource/8ys7-d773.json","https://opendata.rdw.nl/resource/vezc-m2t6.json","https://opendata.rdw.nl/resource/jhie-znh9.json","https://opendata.rdw.nl/resource/kmfi-hrps.json"
"03SGLK","Personenauto","SAAB","SAAB 9-3","20240508",,"7909","stationwagen","5","BLAUW","Niet geregistreerd","4","1796","1428","1970","1528","735","1400","20060102","20060102","Geen verstrekking in Open Data","32788","Nee",,,,,,,"4","4","0","0",,"465","0","M1",,,"r. op schutbord onder motorkap","1970",,"G3 gasinstallatie","e4*2001/116*0065*10","F5B","M5 01","0","0.06","267","Ja","Nee",,"Nee","3370","0",,"2023","Logisch","00","Nee","2024-05-08T00:00:00.000",,"2006-01-02T00:00:00.000","2006-01-02T00:00:00.000",,"0",,,,,,,,,,,,,,,,,,,"C",,,,,,,"https://opendata.rdw.nl/resource/3huj-srit.json","https://opendata.rdw.nl/resource/8ys7-d773.json","https://opendata.rdw.nl/resource/vezc-m2t6.json","https://opendata.rdw.nl/resource/jhie-znh9.json","https://opendata.rdw.nl/resource/kmfi-hrps.json"
"04JHJX","Personenauto","SAAB","SAAB 9-3","20230526",,"11408","cabriolet","4","ZWART","Niet geregistreerd","4","1985","1360","1810","1460","730","1600","20000531","20020403","Geen verstrekking in Open Data",,"Nee",,,,,,,"2","4","0","0",,"463","0","M1",,,"r. op schutbord onder motorkap","1810",,,"e4*98/14*0012*10","7T","M02 2D B204E FF FM55","1","0.08","261","Ja","Nee",,"Nee","3410","0","0.00","2022","Geen oordeel","05","Nee","2023-05-26T00:00:00.000",,"2000-05-31T00:00:00.000","2002-04-03T00:00:00.000",,,,,,,,,,,,,,,,,,,,,,,,,,,,"https://opendata.rdw.nl/resource/3huj-srit.json","https://opendata.rdw.nl/resource/8ys7-d773.json","https://opendata.rdw.nl/resource/vezc-m2t6.json","https://opendata.rdw.nl/resource/jhie-znh9.json","https://opendata.rdw.nl/resource/kmfi-hrps.json"
"04KJJ1","Personenauto","SAAB","SAAB 9-3","20220624",,"10903","sedan","5","ZWART","Niet geregistreerd","4","1910","1495","2060","1595","750","1600","20080624","20091204","Geen verstrekking in Open Data",,"Ja",,,,,,,"4","4","0","0",,"465","0","M1",,,"r. op schutbord onder motorkap","2060","YS3F",,"e4*2001/116*0065*18","F4W","A6 04","0","0.07","268","Ja","Nee",,"Nee","3660","0",,"2023","Geen oordeel","05","Nee","2022-06-24T00:00:00.000",,"2008-06-24T00:00:00.000","2009-12-04T00:00:00.000",,,,,,,,,,,,,,,,,,,,,"D",,,,,,,"https://opendata.rdw.nl/resource/3huj-srit.json","https://opendata.rdw.nl/resource/8ys7-d773.json","https://opendata.rdw.nl/resource/vezc-m2t6.json","https://opendata.rdw.nl/resource/jhie-znh9.json","https://opendata.rdw.nl/resource/kmfi-hrps.json"
"04PTXN","Personenauto","SAAB","SAAB 9-3","20240824","20151015","7355","sedan","5","ZWART","Niet geregistreerd","4","1998","1410","1970","1510","750","1600","20041203","20041203","Geen verstrekking in Open Data",,"Ja",,,,,,,"4","4","0","0",,"464","0","M1",,,"r. op schutbord onder motorkap","1970",,,"e4*2001/116*0065*05","F4F","M5 03","0","0.07","268","Ja","Nee",,"Nee","3570","0",,"2024","Onlogisch","04","Nee","2024-08-24T00:00:00.000","2015-10-15T00:00:00.000","2004-12-03T00:00:00.000","2004-12-03T00:00:00.000",,,,,,,,,,,,,,,,,,,,,"D",,,,,,,"https://opendata.rdw.nl/resource/3huj-srit.json","https://opendata.rdw.nl/resource/8ys7-d773.json","https://opendata.rdw.nl/resource/vezc-m2t6.json","https://opendata.rdw.nl/resource/jhie-znh9.json","https://opendata.rdw.nl/resource/kmfi-hrps.json"
"04PZNV","Personenauto","SAAB","SAAB 9-3","20240124",,"8659","sedan","5","ZWART","Niet geregistreerd","4","1998","1430","1990","1530","750","1600","20050103","20050103","Geen verstrekking in Open Data","36896","Nee",,,,,,,"4","4","0","0",,"464","0","M1",,,"r. op schutbord onder motorkap","1990",,,"e4*2001/116*0065*06","F4F","A5 03","0","0.07","268","Ja","Nee",,"Nee","3590","0",,"2023","Logisch","00","Nee","2024-01-24T00:00:00.000",,"2005-01-03T00:00:00.000","2005-01-03T00:00:00.000",,,,,,,,,,,,,,,,,,,,,"E",,,,,,,"https://opendata.rdw.nl/resource/3huj-srit.json","https://opendata.rdw.nl/resource/8ys7-d773.json","https://opendata.rdw.nl/resource/vezc-m2t6.json","https://opendata.rdw.nl/resource/jhie-znh9.json","https://opendata.rdw.nl/resource/kmfi-hrps.json"
"04RLBB","Personenauto","SAAB","SAAB 9-3","20230320",,"8831","sedan","5","ZWART","Niet geregistreerd","4","1998","1430","1990","1530","750","1600","20050615","20050615","Geen verstrekking in Open Data",,"Nee",,,,,,,"4","4","0","0",,"464","0","M1",,,"r. op schutbord onder motorkap","1990",,,"e4*2001/116*0065*08","F4F","A5 03","0","0.07","268","Ja","Nee",,"Nee","3590","0",,"2022","Logisch","03","Nee","2023-03-20T00:00:00.000",,"2005-06-15T00:00:00.000","2005-06-15T00:00:00.000",,,,,,,,,,,,,,,,,,,,,"E",,,,,,,"https://opendata.rdw.nl/resource/3huj-srit.json","https://opendata.rdw.nl/resource/8ys7-d773.json","https://opendata.rdw.nl/resource/vezc-m2t6.json","https://opendata.rdw.nl/resource/jhie-znh9.json","https://opendata.rdw.nl/resource/kmfi-hrps.json"
"04SNLF","Personenauto","SAAB","SAAB 9-3","20230430",,"9668","stationwagen","5","GRIJS","Niet geregistreerd","4","1998","1470","2060","1570","750","1600","20060315","20060315","Geen verstrekking in Open Data","39185","Nee",,,,,,,"4","4","0","0",,"465","0","M1",,,"r. op schutbord onder motorkap","2060",,,"e4*2001/116*0065*10","F5F","A5 01","0","0.07","268","Ja","Nee",,"Nee","3660","0",,"2022","Logisch","00","Nee","2023-04-30T00:00:00.000",,"2006-03-15T00:00:00.000","2006-03-15T00:00:00.000",,,,,,,,,,,,,,,,,,,,,"E",,,,,,,"https://opendata.rdw.nl/resource/3huj-srit.json","https://opendata.rdw.nl/resource/8ys7-d773.json","https://opendata.rdw.nl/resource/vezc-m2t6.json","https://opendata.rdw.nl/resource/jhie-znh9.json","https://opendata.rdw.nl/resource/kmfi-hrps.json"
"04ZTS2","Personenauto","SAAB","SAAB 9-3","20230131",,"14806","cabriolet","4","ZWART","Niet geregistreerd","4","1998","1580","2050","1680","750","1600","20050428","20130205","Geen verstrekking in Open Data",,"Nee",,,,,,,"2","4","0","0",,"464","0","M1",,,"midden tegen schutbord onder motorkap","2050",,,"e4*2001/116*0077*02","F7F","A5 02","0","0.07","268","Ja","Nee",,"Nee","3650","0",,"2023","Geen oordeel","05","Nee","2023-01-31T00:00:00.000",,"2005-04-28T00:00:00.000","2013-02-05T00:00:00.000",,"0",,,,,,,,,,,,,,,,,,,"E",,,,,,,"https://opendata.rdw.nl/resource/3huj-srit.json","https://opendata.rdw.nl/resource/8ys7-d773.json","https://opendata.rdw.nl/resource/vezc-m2t6.json","https://opendata.rdw.nl/resource/jhie-znh9.json","https://opendata.rdw.nl/resource/kmfi-hrps.json"
"05DVTD","Personenauto","SAAB","SAAB 9-3","20240328","20240223","7517","hatchback","5","GRIJS","Niet geregistreerd","4","1985","1348","1870","1448","705","1600","20000113","20000113","Geen verstrekking in Open Data",,"Ja",,,,,,,"4","4","0","0",,"463","0","M1",,,"r. op schutbord onder motorkap","1870",,"G3 gasinstallatie","e4*98/14*0012*09","5T","M01 5D B204E FF FM55","1","0.08","261","Ja","Nee",,"Nee","3470","0",,"2024","Logisch","00","Nee","2024-03-28T00:00:00.000","2024-02-23T00:00:00.000","2000-01-13T00:00:00.000","2000-01-13T00:00:00.000",,"0",,,,,,,,,,,,,,,,,,,,,,,,,,"https://opendata.rdw.nl/resource/3huj-srit.json","https://opendata.rdw.nl/resource/8ys7-d773.json","https://opendata.rdw.nl/resource/vezc-m2t6.json","https://opendata.rdw.nl/resource/jhie-znh9.json","https://opendata.rdw.nl/resource/kmfi-hrps.json"
"05HXJX","Personenauto","SAAB","SAAB 9-3",,,"6578","hatchback","5","ZWART","Niet geregistreerd","4","1985","1315","1880","1415","705","1600","20020108","20020108","Geen verstrekking in Open Data",,"Nee",,,,,,,"4","4","0","0",,"463","0","M1",,,"r. op schutbord onder motorkap","1880",,,"e4*98/14*0012*15","5C","M02 5D B205E FF FM57","0","0.08","261","Ja","Nee",,"Nee","3480","0",,"2021","Logisch","00","Nee",,,"2002-01-08T00:00:00.000","2002-01-08T00:00:00.000",,,,,,,,,,,,,,,,,,,,,"D",,,,,,,"https://opendata.rdw.nl/resource/3huj-srit.json","https://opendata.rdw.nl/resource/8ys7-d773.json","https://opendata.rdw.nl/resource/vezc-m2t6.json","https://opendata.rdw.nl/resource/jhie-znh9.json","https://opendata.rdw.nl/resource/kmfi-hrps.json"
"05LNNT","Personenauto","SAAB","SAAB 9-3","20240309","20240302","11396","sedan","5","BLAUW","Niet geregistreerd","4","1998","1445","2000","1545","750","1600","20030314","20030314","Geen verstrekking in Open Data",,"Ja",,,,,,,"4","4","0","0",,"464","0","M1",,,"r. op schutbord onder motorkap","2000",,,"e4*2001/116*0065*02","F4S","A01","0","0.08","268","Ja","Nee",,"Nee","3600","0",,"2024","Logisch","00","Nee","2024-03-09T00:00:00.000","2024-03-02T00:00:00.000","2003-03-14T00:00:00.000","2003-03-14T00:00:00.000",,,,,,,,,,,,,,,,,,,,,"E",,,,,,,"https://opendata.rdw.nl/resource/3huj-srit.json","https://opendata.rdw.nl/resource/8ys7-d773.json","https://opendata.rdw.nl/resource/vezc-m2t6.json","https://opendata.rdw.nl/resource/jhie-znh9.json","https://opendata.rdw.nl/resource/kmfi-hrps.json"
"05NPNG","Personenauto","SAAB","SAAB 9-3",,,"6145","sedan","5","ZWART","Niet geregistreerd","4","1796","1350","1910","1450","725","1400","20040105","20040105","Geen verstrekking in Open Data",,"Nee",,,,,,,"4","4","0","0",,"464","0","M1",,,"r. op schutbord onder motorkap","1910",,,"e4*2001/116*0065*05","F4B","M5 01","0","0.06","268","Ja","Nee",,"Nee","3310","0",,"2022","Onlogisch","04","Nee",,,"2004-01-05T00:00:00.000","2004-01-05T00:00:00.000",,,,,,,,,,,,,,,,,,,,,"C",,,,,,,"https://opendata.rdw.nl/resource/3huj-srit.json","https://opendata.rdw.nl/resource/8ys7-d773.json","https://opendata.rdw.nl/resource/vezc-m2t6.json","https://opendata.rdw.nl/resource/jhie-znh9.json","https://opendata.rdw.nl/resource/kmfi-hrps.json"
"05SBPL","Personenauto","SAAB","SAAB 9-3","20231115",,"8155","stationwagen","5","BLAUW","Niet geregistreerd","4","1796","1428","1970","1528","735","1400","20051111","20051111","Geen verstrekking in Open Data",,"Nee",,,,,,,"4","4","0","0",,"465","0","M1",,,"r. op schutbord onder motorkap","1970",,"G3 gasinstallatie","e4*2001/116*0065*10","F5B","M5 01","0","0.06","267","Ja","Nee",,"Nee","3370","0",,"2022","Logisch","00","Nee","2023-11-15T00:00:00.000",,"2005-11-11T00:00:00.000","2005-11-11T00:00:00.000",,"0",,,,,,,,,,,,,,,,,,,"C",,,,,,,"https://opendata.rdw.nl/resource/3huj-srit.json","https://opendata.rdw.nl/resource/8ys7-d773.json","https://opendata.rdw.nl/resource/vezc-m2t6.json","https://opendata.rdw.nl/resource/jhie-znh9.json","https://opendata.rdw.nl/resource/kmfi-hrps.json"
"05SKHZ","Personenauto","SAAB","SAAB 9-3","20220930",,"11369","cabriolet","4","ZWART","Niet geregistreerd","4","1985","1375","1840","1475","735","1600","20011221","20060131","Geen verstrekking in Open Data",,"Nee",,,,,,,"2","4","0","0",,"463","0","M1",,,"r. op schutbord onder motorkap","1840",,,"e4*98/14*0012*14","7C","M02 2D B205E FF FM57","0","0.07","261","Ja","Nee",,"Nee","3440","0",,"2023","Geen oordeel","07","Nee","2022-09-30T00:00:00.000",,"2001-12-21T00:00:00.000","2006-01-31T00:00:00.000",,,,,,,,,,,,,,,,,,,,,"D",,,,,,,"https://opendata.rdw.nl/resource/3huj-srit.json","https://opendata.rdw.nl/resource/8ys7-d773.json","https://opendata.rdw.nl/resource/vezc-m2t6.json","https://opendata.rdw.nl/resource/jhie-znh9.json","https://opendata.rdw.nl/resource/kmfi-hrps.json"
"06HDVL","Personenauto","SAAB","SAAB 9-3","20230818",,"11622","cabriolet","4","GRIJS","Niet geregistreerd","4","1985","1375","1840","1475","735","1600","20010601","20010601","Geen verstrekking in Open Data",,"Nee",,,,,,,"2","4","0","0",,"463","0","M1",,,"r. op schutbord onder motorkap","1840",,,"e4*98/14*0012*13","7C","M01 2D B205E FF FM55","1","0.07","261","Ja","Nee",,"Nee","3440","0",,"2023","Logisch","00","Nee","2023-08-18T00:00:00.000",,"2001-06-01T00:00:00.000","2001-06-01T00:00:00.000",,,,,,,,,,,,,,,,,,,,,"D",,,,,,,"https://opendata.rdw.nl/resource/3huj-srit.json","https://opendata.rdw.nl/resource/8ys7-d773.json","https://opendata.rdw.nl/resource/vezc-m2t6.json","https://opendata.rdw.nl/resource/jhie-znh9.json","https://opendata.rdw.nl/resource/kmfi-hrps.json"
"06NSKZ","Personenauto","SAAB","SAAB 9-3","20240922","20231216","10547","sedan","5","ZWART","Niet geregistreerd","4","1998","1410","1970","1510","750","1600","20040131","20040131","Geen verstrekking in Open Data",,"Ja",,,,,,,"4","4","0","0",,"464","0","M1",,,"r. op schutbord onder motorkap","1970",,,"e4*2001/116*0065*05","F4S","M5 03","0","0.09","268","Ja","Nee",,"Nee","3570","0",,"2024","Logisch","00","Nee","2024-09-22T00:00:00.000","2023-12-16T00:00:00.000","2004-01-31T00:00:00.000","2004-01-31T00:00:00.000",,,,,,,,,,,,,,,,,,,,,"D",,,,,,,"https://opendata.rdw.nl/resource/3huj-srit.json","https://opendata.rdw.nl/resource/8ys7-d773.json","https://opendata.rdw.nl/resource/vezc-m2t6.json","https://opendata.rdw.nl/resource/jhie-znh9.json","https://opendata.rdw.nl/resource/kmfi-hrps.json"