"kenteken","voertuigsoort","merk","handelsbenaming","vervaldatum_apk","datum_tenaamstelling","bruto_bpm","inrichting","aantal_zitplaatsen","eerste_kleur","tweede_kleur","aantal_cilinders","cilinderinhoud","massa_ledig_voertuig","toegestane_maximum_massa_voertuig","massa_rijklaar","maximum_massa_trekken_ongeremd","maximum_trekken_massa_geremd","datum_eerste_toelating","datum_eerste_tenaamstelling_in_nederland","wacht_op_keuren","catalogusprijs","wam_verzekerd","maximale_constructiesnelheid","laadvermogen","oplegger_geremd","aanhangwagen_autonoom_geremd","aanhangwagen_middenas_geremd","aantal_staanplaatsen","aantal_deuren","aantal_wielen","afstand_hart_koppeling_tot_achterzijde_voertuig","afstand_voorzijde_voertuig_tot_hart_koppeling","afwijkende_maximum_snelheid","lengte","breedte","europese_voertuigcategorie","europese_voertuigcategorie_toevoeging","europese_uitvoeringcategorie_toevoeging","plaats_chassisnummer","technische_max_massa_voertuig","type","type_gasinstallatie","typegoedkeuringsnummer","variant","uitvoering","volgnummer_wijziging_eu_typegoedkeuring","vermogen_massarijklaar","wielbasis","export_indicator","openstaande_terugroepactie_indicator","vervaldatum_tachograaf","taxi_indicator","maximum_massa_samenstelling","aantal_rolstoelplaatsen","maximum_ondersteunende_snelheid","jaar_laatste_registratie_tellerstand","tellerstandoordeel","code_toelichting_tellerstandoordeel","tenaamstellen_mogelijk","vervaldatum_apk_dt","datum_tenaamstelling_dt","datum_eerste_toelating_dt","datum_eerste_tenaamstelling_in_nederland_dt","vervaldatum_tachograaf_dt","maximum_last_onder_de_vooras_sen_tezamen_koppeling","type_remsysteem_voertuig_code","rupsonderstelconfiguratiecode","wielbasis_voertuig_minimum","wielbasis_voertuig_maximum","lengte_voertuig_minimum","lengte_voertuig_maximum","breedte_voertuig_minimum","breedte_voertuig_maximum","hoogte_voertuig","hoogte_voertuig_minimum","hoogte_voertuig_maximum","massa_bedrijfsklaar_minimaal","massa_bedrijfsklaar_maximaal","technisch_toelaatbaar_massa_koppelpunt","maximum_massa_technisch_maximaal","maximum_massa_technisch_minimaal","subcategorie_nederland","verticale_belasting_koppelpunt_getrokken_voertuig","zuinigheidsclassificatie","registratie_datum_goedkeuring_afschrijvingsmoment_bpm","registratie_datum_goedkeuring_afschrijvingsmoment_bpm_dt","gem_lading_wrde","aerodyn_voorz","massa_alt_aandr","verl_cab_ind","api_gekentekende_voertuigen_assen","api_gekentekende_voertuigen_brandstof","api_gekentekende_voertuigen_carrosserie","api_gekentekende_voertuigen_carrosserie_specifiek","api_gekentekende_voertuigen_voertuigklasse"
"G296ZL","Personenauto","PORSCHE","PANAMERA TURBO S E-HYBRID",,,"10116","stationwagen","5","GRIJS","Niet geregistreerd","8","3996","2300","2900","2400",,,"20200116","20200116","Geen verstrekking in Open Data","248190","Nee","310",,,,,,"4","4","0","0",,"505","194","M1",,,,"2900","971",,"e13*2007/46*0971*09","HF22","1105100","0","0.17","295","Ja","Nee",,"Nee","0","0","0.00","2023","Onlogisch","04","Nee",,,"2020-01-16T00:00:00.000","2020-01-16T00:00:00.000",,,,,,,,,,,"142",,,,,,,,,,"A",,,,,,,"https://opendata.rdw.nl/resource/3huj-srit.json","https://opendata.rdw.nl/resource/8ys7-d773.json","https://opendata.rdw.nl/resource/vezc-m2t6.json","https://opendata.rdw.nl/resource/jhie-znh9.json","https://opendata.rdw.nl/resource/kmfi-hrps.json"
"H564HX","Personenauto","PORSCHE","PANAMERA TURBO S E-HYBRID","20230517",,"5991","hatchback","4","GRIJS","Niet geregistreerd","8","3996","2285","2795","2385",,,"20171026","20200808","Geen verstrekking in Open Data","225735","Nee","310",,,,,,"4","4","0","0",,"0","0","M1",,,,"2795","971",,"e13*2007/46*0971*04","GF22","1654100","0","0.03","295","Ja","Nee",,"Nee","0","0","0.00","2024","Geen oordeel","05","Nee","2023-05-17T00:00:00.000",,"2017-10-26T00:00:00.000","2020-08-08T00:00:00.000",,,,,,,,,,,,,,,,,,,,,"A",,,,,,,"https://opendata.rdw.nl/resource/3huj-srit.json","https://opendata.rdw.nl/resource/8ys7-d773.json","https://opendata.rdw.nl/resource/vezc-m2t6.json","https://opendata.rdw.nl/resource/jhie-znh9.json","https://opendata.rdw.nl/resource/kmfi-hrps.json"
"H775NL","Personenauto","PORSCHE","PANAMERA TURBO S E-HYBRID","20241114",,"5717","hatchback","4","GRIJS","Niet geregistreerd","8","3996","2285","2795","2385",,,"20170622","20200324","Geen verstrekking in Open Data","233031","Nee","310",,,,,,"4","4",,,,,,"M1",,,,"2795","971",,,,,,"0.03","295","Ja","Nee",,"Nee",,,,"2023","Geen oordeel","05","Nee","2024-11-14T00:00:00.000",,"2017-06-22T00:00:00.000","2020-03-24T00:00:00.000",,,,,,,,,,,,,,,,,,,,,,,,,,,,"https://opendata.rdw.nl/resource/3huj-srit.json","https://opendata.rdw.nl/resource/8ys7-d773.json","https://opendata.rdw.nl/resource/vezc-m2t6.json","https://opendata.rdw.nl/resource/jhie-znh9.json","https://opendata.rdw.nl/resource/kmfi-hrps.json"
"H902PP","Personenauto","PORSCHE","PANAMERA TURBO S E-HYBRID","20240424","20231124","6917","stationwagen","5","ZWART","Niet geregistreerd","8","3996","2300","2900","2400",,,"20180424","20200401","Geen verstrekking in Open Data","246191","Ja","310",,,,,,"4","4","0","0",,"0","0","M1",,,,"2900","971",,"e13*2007/46*0971*05","HF22","1655100","1","0.03","295","Ja","Nee",,"Nee","0","0","0.00","2024","Geen oordeel","05","Nee","2024-04-24T00:00:00.000","2023-11-24T00:00:00.000","2018-04-24T00:00:00.000","2020-04-01T00:00:00.000",,,,,,,,,,,,,,,,,,,,,"A",,,,,,,"https://opendata.rdw.nl/resource/3huj-srit.json","https://opendata.rdw.nl/resource/8ys7-d773.json","https://opendata.rdw.nl/resource/vezc-m2t6.json","https://opendata.rdw.nl/resource/jhie-znh9.json","https://opendata.rdw.nl/resource/kmfi-hrps.json"
"J476ND","Personenauto","PORSCHE","PANAMERA TURBO S E-HYBRID","20241205","20240413","6026","hatchback","4","ZWART","Niet geregistreerd","8","3996","2285","2795","2385",,,"20190305","20200910","Geen verstrekking in Open Data","241015","Ja","310",,,,,,"4","4","0","0",,"0","0","M1",,,,"2795","971",,"e13*2007/46*0971*08","GF22","1104100","0","0.03","295","Ja","Nee",,"Nee","0","0","0.00","2024","Geen oordeel","05","Nee","2024-12-05T00:00:00.000","2024-04-13T00:00:00.000","2019-03-05T00:00:00.000","2020-09-10T00:00:00.000",,,,,,,,,,,,,,,,,,,,,"A",,,,,,,"https://opendata.rdw.nl/resource/3huj-srit.json","https://opendata.rdw.nl/resource/8ys7-d773.json","https://opendata.rdw.nl/resource/vezc-m2t6.json","https://opendata.rdw.nl/resource/jhie-znh9.json","https://opendata.rdw.nl/resource/kmfi-hrps.json"
"J968PL","Personenauto","PORSCHE","PANAMERA TURBO S E-HYBRID",,,"7153","hatchback","4","BLAUW","Niet geregistreerd","8","3996","2285","2795","2385",,,"20201008","20201008","Geen verstrekking in Open Data","251732","Nee","310",,,,,,"4","4","0","0",,"505","194","M1",,,,"2795","971",,"e13*2007/46*0971*08","GF22","1104100","0","0.17","295","Ja","Nee",,"Nee","0","0","0.00","2022","Logisch","00","Nee",,,"2020-10-08T00:00:00.000","2020-10-08T00:00:00.000",,,,,,,,,,,"142",,,,,,,,,,"A",,,,,,,"https://opendata.rdw.nl/resource/3huj-srit.json","https://opendata.rdw.nl/resource/8ys7-d773.json","https://opendata.rdw.nl/resource/vezc-m2t6.json","https://opendata.rdw.nl/resource/jhie-znh9.json","https://opendata.rdw.nl/resource/kmfi-hrps.json"
"L624ZD","Personenauto","PORSCHE","PANAMERA TURBO S E-HYBRID","20231201",,"6084","hatchback","4","GRIJS","Niet geregistreerd","8","3996","2285","2795","2385",,,"20171128","20210828","Geen verstrekking in Open Data","230069","Nee","310",,,,,,"4","4","0","0",,"505","194","M1",,,"r. voorzitting","2795","971",,"e13*2007/46*0971*04","GF22","1654100","0","0.03","295","Ja","Nee",,"Nee","0","0","0.00","2022","Onlogisch","04","Nee","2023-12-01T00:00:00.000",,"2017-11-28T00:00:00.000","2021-08-28T00:00:00.000",,,,,,,,,,,"142",,,,,,,,,,,,,,,,,"https://opendata.rdw.nl/resource/3huj-srit.json","https://opendata.rdw.nl/resource/8ys7-d773.json","https://opendata.rdw.nl/resource/vezc-m2t6.json","https://opendata.rdw.nl/resource/jhie-znh9.json","https://opendata.rdw.nl/resource/kmfi-hrps.json"
"L645ZF","Personenauto","PORSCHE","PANAMERA TURBO S E-HYBRID",,,"7359","stationwagen","4","ZWART","Niet geregistreerd","8","3996","2300","2840","2400",,,"20180416","20210825","Geen verstrekking in Open Data","255938","Nee","310",,,,,,"4","4",,,,,,"M1",,,,"2840","971",,"e13*2007/46*0971*05","HF22","1654100","1","0.03","295","Ja","Nee",,"Nee",,,,"2022","Geen oordeel","05","Nee",,,"2018-04-16T00:00:00.000","2021-08-25T00:00:00.000",,,,,,,,,,,,,,,,,,,,,,,,,,,,"https://opendata.rdw.nl/resource/3huj-srit.json","https://opendata.rdw.nl/resource/8ys7-d773.json","https://opendata.rdw.nl/resource/vezc-m2t6.json","https://opendata.rdw.nl/resource/jhie-znh9.json","https://opendata.rdw.nl/resource/kmfi-hrps.json"
"N084NR","Personenauto","PORSCHE","PANAMERA TURBO S E-HYBRID","20260412","20240419","7133","stationwagen","4","WIT","Niet geregistreerd","8","3996","2300","2840","2400",,,"20180725","20211122","Geen verstrekking in Open Data","229989","Ja","310",,,,,,"4","4",,,,,,"M1",,,,"2840","971",,"e13*2007/46*0971*05","HF22","1654100","1","0.03","295","Ja","Nee",,"Nee",,,,"2024","Geen oordeel","05","Nee","2026-04-12T00:00:00.000","2024-04-19T00:00:00.000","2018-07-25T00:00:00.000","2021-11-22T00:00:00.000",,,,,,,,,,,,,,,,,,,,,,"20211116","2021-11-16T00:00:00.000",,,,,"https://opendata.rdw.nl/resource/3huj-srit.json","https://opendata.rdw.nl/resource/8ys7-d773.json","https://opendata.rdw.nl/resource/vezc-m2t6.json","https://opendata.rdw.nl/resource/jhie-znh9.json","https://opendata.rdw.nl/resource/kmfi-hrps.json"
"P051TK","Personenauto","PORSCHE","PANAMERA TURBO S E-HYBRID","20241110",,"7800","stationwagen","5","GRIJS","Niet geregistreerd","8","3996","2300","2900","2400",,,"20181003","20220603","Geen verstrekking in Open Data","207573","Nee","310",,,,,,"4","4","0","0",,"0","0","M1",,,,"2900","971",,"e13*2007/46*0971*05","HF22","1655100","1","0.03","295","Ja","Nee",,"Nee","0","0","0.00","2023","Geen oordeel","05","Nee","2024-11-10T00:00:00.000",,"2018-10-03T00:00:00.000","2022-06-03T00:00:00.000",,,,,,,,,,,,,,,,,,,,,,"20220531","2022-05-31T00:00:00.000",,,,,"https://opendata.rdw.nl/resource/3huj-srit.json","https://opendata.rdw.nl/resource/8ys7-d773.json","https://opendata.rdw.nl/resource/vezc-m2t6.json","https://opendata.rdw.nl/resource/jhie-znh9.json","https://opendata.rdw.nl/resource/kmfi-hrps.json"
"P366DS","Personenauto","PORSCHE","PANAMERA TURBO S E-HYBRID","20241107",,"7069","stationwagen","5","GRIJS","Niet geregistreerd","8","3996","2300","2900","2400",,,"20181107","20220218","Geen verstrekking in Open Data","248492","Nee","310",,,,,,"4","4","0","0",,"505","194","M1",,,,"2900","971",,"e13*2007/46*0971*05","HF22","1655100","1","0.03","295","Ja","Nee",,"Nee","0","0","0.00","2023","Geen oordeel","05","Nee","2024-11-07T00:00:00.000",,"2018-11-07T00:00:00.000","2022-02-18T00:00:00.000",,,,,,,,,,,"142",,,,,,,,,,,"20220202","2022-02-02T00:00:00.000",,,,,"https://opendata.rdw.nl/resource/3huj-srit.json","https://opendata.rdw.nl/resource/8ys7-d773.json","https://opendata.rdw.nl/resource/vezc-m2t6.json","https://opendata.rdw.nl/resource/jhie-znh9.json","https://opendata.rdw.nl/resource/kmfi-hrps.json"
"P372XN","Personenauto","PORSCHE","PANAMERA TURBO S E-HYBRID",,,"4250","stationwagen","4","GROEN","Niet geregistreerd","8","3996","2340","2840","2440",,,"20220704","20220704","Geen verstrekking in Open Data","256413","Nee","315",,,,,,"4","4","0","0",,"505","194","M1",,,,"2840","971",,"e13*2007/46*0971*16","HT22","1401100","0","0.17","295","Ja","Nee",,"Nee","0","0","0.00","2022","Logisch","00","Nee",,,"2022-07-04T00:00:00.000","2022-07-04T00:00:00.000",,,,,,,,,,,"143",,,,,,,,,,"A","20220627","2022-06-27T00:00:00.000",,,,,"https://opendata.rdw.nl/resource/3huj-srit.json","https://opendata.rdw.nl/resource/8ys7-d773.json","https://opendata.rdw.nl/resource/vezc-m2t6.json","https://opendata.rdw.nl/resource/jhie-znh9.json","https://opendata.rdw.nl/resource/kmfi-hrps.json"
"PK130D","Personenauto","PORSCHE","PANAMERA TURBO S E-HYBRID","20250714","20240304","7200","hatchback","4","GRIJS","Niet geregistreerd","8","3996","2385","2885","2485",,,"20170714","20170714","Geen verstrekking in Open Data","248815","Ja",,,,,,,"4","4","0","0",,"520","194","M1",,,"onder r. voorzitting","2885","971",,"e13*2007/46*0971*04","GF22","2654100","0","0.16","310","Ja","Nee",,"Nee","0","0","0.00","2024","Logisch","00","Nee","2025-07-14T00:00:00.000","2024-03-04T00:00:00.000","2017-07-14T00:00:00.000","2017-07-14T00:00:00.000",,,,,,,,,,,"142",,,,,,,,,,"A",,,,,,,"https://opendata.rdw.nl/resource/3huj-srit.json","https://opendata.rdw.nl/resource/8ys7-d773.json","https://opendata.rdw.nl/resource/vezc-m2t6.json","https://opendata.rdw.nl/resource/jhie-znh9.json","https://opendata.rdw.nl/resource/kmfi-hrps.json"
"PK763J","Personenauto","PORSCHE","PANAMERA TURBO S E-HYBRID","20250605","20240206","7200","hatchback","4","ZWART","Niet geregistreerd","8","3996","2285","2795","2385",,,"20170717","20170717","Geen verstrekking in Open Data","235671","Nee",,,,,,,"4","4","0","0",,"505","194","M1",,,"onder r. voorzitting","2795","971",,"e13*2007/46*0971*04","GF22","1654100","0","0.17","295","Ja","Nee",,"Nee","0","0","0.00","2024","Logisch","00","Nee","2025-06-05T00:00:00.000","2024-02-06T00:00:00.000","2017-07-17T00:00:00.000","2017-07-17T00:00:00.000",,,,,,,,,,,"142",,,,,,,,,,"A",,,,,,,"https://opendata.rdw.nl/resource/3huj-srit.json","https://opendata.rdw.nl/resource/8ys7-d773.json","https://opendata.rdw.nl/resource/vezc-m2t6.json","https://opendata.rdw.nl/resource/jhie-znh9.json","https://opendata.rdw.nl/resource/kmfi-hrps.json"
"PP114J","Personenauto","PORSCHE","PANAMERA TURBO S E-HYBRID","20250602","20240207","7200","hatchback","4","GRIJS","Niet geregistreerd","8","3996","2285","2795","2385",,,"20170817","20170817","Geen verstrekking in Open Data","221647","Ja",,,,,,,"4","4","0","0",,"505","194","M1",,,"onder r. voorzitting","2795","971",,"e13*2007/46*0971*04","GF22","1654100","0","0.17","295","Ja","Nee",,"Nee","0","0","0.00","2024","Logisch","00","Nee","2025-06-02T00:00:00.000","2024-02-07T00:00:00.000","2017-08-17T00:00:00.000","2017-08-17T00:00:00.000",,,,,,,,,,,"142",,,,,,,,,,"A",,,,,,,"https://opendata.rdw.nl/resource/3huj-srit.json","https://opendata.rdw.nl/resource/8ys7-d773.json","https://opendata.rdw.nl/resource/vezc-m2t6.json","https://opendata.rdw.nl/resource/jhie-znh9.json","https://opendata.rdw.nl/resource/kmfi-hrps.json"
"PS609S","Personenauto","PORSCHE","PANAMERA TURBO S E-HYBRID","20250303",,"7200","hatchback","4","GRIJS","Niet geregistreerd","8","3996","2285","2795","2385",,,"20170908","20170908","Geen verstrekking in Open Data","210450","Nee",,,,,,,"4","4","0","0",,"505","194","M1",,,"onder r. voorzitting","2795","971",,"e13*2007/46*0971*04","GF22","1654100","0","0.17","295","Ja","Nee",,"Nee","0","0","0.00","2023","Logisch","00","Nee","2025-03-03T00:00:00.000",,"2017-09-08T00:00:00.000","2017-09-08T00:00:00.000",,,,,,,,,,,"142",,,,,,,,,,"A",,,,,,,"https://opendata.rdw.nl/resource/3huj-srit.json","https://opendata.rdw.nl/resource/8ys7-d773.json","https://opendata.rdw.nl/resource/vezc-m2t6.json","https://opendata.rdw.nl/resource/jhie-znh9.json","https://opendata.rdw.nl/resource/kmfi-hrps.json"
"R566SP","Personenauto","PORSCHE","PANAMERA TURBO S E-HYBRID","20241202","20231127","6885","hatchback","4","GRIJS","Niet geregistreerd","8","3996","2285","2795","2385",,,"20180125","20221202","Geen verstrekking in Open Data","231085","Ja","310",,,,,,"4","4","0","0",,"505","194","M1",,,,"2795","971",,"e13*2007/46*0971*04","GF22","1654100","0","0.03","295","Ja","Nee",,"Nee","0","0","0.00","2024","Geen oordeel","05","Nee","2024-12-02T00:00:00.000","2023-11-27T00:00:00.000","2018-01-25T00:00:00.000","2022-12-02T00:00:00.000",,,,,,,,,,,"142",,,,,,,,,,,"20221109","2022-11-09T00:00:00.000",,,,,"https://opendata.rdw.nl/resource/3huj-srit.json","https://opendata.rdw.nl/resource/8ys7-d773.json","https://opendata.rdw.nl/resource/vezc-m2t6.json","https://opendata.rdw.nl/resource/jhie-znh9.json","https://opendata.rdw.nl/resource/kmfi-hrps.json"
"R589LR","Personenauto","PORSCHE","PANAMERA TURBO S E-HYBRID","20241010",,"6934","hatchback","4","GRIJS","Niet geregistreerd","8","3996","2285","2795","2385",,,"20180103","20221010","Geen verstrekking in Open Data","229517","Nee","310",,,,,,"4","4","0","0",,"0","0","M1",,,"r. voorzitting","2795","971",,"e13*2007/46*0971*04","GF22","1654100","0","0.03","295","Ja","Nee",,"Nee","0","0","0.00","2023","Geen oordeel","05","Nee","2024-10-10T00:00:00.000",,"2018-01-03T00:00:00.000","2022-10-10T00:00:00.000",,,,,,,,,,,,,,,,,,,,,,"20221005","2022-10-05T00:00:00.000",,,,,"https://opendata.rdw.nl/resource/3huj-srit.json","https://opendata.rdw.nl/resource/8ys7-d773.json","https://opendata.rdw.nl/resource/vezc-m2t6.json","https://opendata.rdw.nl/resource/jhie-znh9.json","https://opendata.rdw.nl/resource/kmfi-hrps.json"
"RR070N","Personenauto","PORSCHE","PANAMERA TURBO S E-HYBRID","20240106",,"7200","hatchback","4","ZWART","Niet geregistreerd","8","3996","2285","2795","2385",,,"20180106","20180106","Geen verstrekking in Open Data","245379","Nee",,,,,,,"4","4","0","0",,"505","194","M1",,,"onder r. voorzitting","2795","971",,"e13*2007/46*0971*04","GF22","1654100","0","0.17","295","Ja","Nee",,"Nee","0","0","0.00","2022","Logisch","00","Nee","2024-01-06T00:00:00.000",,"2018-01-06T00:00:00.000","2018-01-06T00:00:00.000",,,,,,,,,,,"142",,,,,,,,,,"A",,,,,,,"https://opendata.rdw.nl/resource/3huj-srit.json","https://opendata.rdw.nl/resource/8ys7-d773.json","https://opendata.rdw.nl/resource/vezc-m2t6.json","https://opendata.rdw.nl/resource/jhie-znh9.json","https://opendata.rdw.nl/resource/kmfi-hrps.json"
"S998NG","Personenauto","PORSCHE","PANAMERA TURBO S E-HYBRID",,,"4552","stationwagen","5","GRIJS","Niet geregistreerd","8","3996","2340","2890","2440",,,"20230303","20230303","Geen verstrekking in Open Data","255021","Nee","315",,,,,,"4","4","0","0",,"505","194","M1",,,,"2890","971",,"e13*2007/46*0971*16","HT22","1501100","0","0.17","295","Ja","Nee",,"Nee","0","0","0.00","2023","Logisch","00","Nee",,,"2023-03-03T00:00:00.000","2023-03-03T00:00:00.000",,,,,,,,,,,"143",,,,,,,,,,"A","20230228","2023-02-28T00:00:00.000",,,,,"https://opendata.rdw.nl/resource/3huj-srit.json","https://opendata.rdw.nl/resource/8ys7-d773.json","https://opendata.rdw.nl/resource/vezc-m2t6.json","https://opendata.rdw.nl/resource/jhie-znh9.json","https://opendata.rdw.nl/resource/kmfi-hrps.json"
"SF715T","Personenauto","PORSCHE","PANAMERA TURBO S E-HYBRID","20260125","20240221","6934","hatchback","4","BLAUW","Niet geregistreerd","8","3996","2285","2795","2385",,,"20180326","20180326","Geen verstrekking in Open Data","213165","Ja",,,,,,,"4","4","0","0",,"505","194","M1",,,"onder r. voorzitting","2795","971",,"e13*2007/46*0971*04","GF22","1654100","0","0.17","295","Ja","Nee",,"Nee","0","0","0.00","2024","Logisch","00","Nee","2026-01-25T00:00:00.000","2024-02-21T00:00:00.000","2018-03-26T00:00:00.000","2018-03-26T00:00:00.000",,,,,,,,,,,"142",,,,,,,,,,"A",,,,,,,"https://opendata.rdw.nl/resource/3huj-srit.json","https://opendata.rdw.nl/resource/8ys7-d773.json","https://opendata.rdw.nl/resource/vezc-m2t6.json","https://opendata.rdw.nl/resource/jhie-znh9.json","https://opendata.rdw.nl/resource/kmfi-hrps.json"
"SJ323V","Personenauto","PORSCHE","PANAMERA TURBO S E-HYBRID","20240418","20231219","7801","stationwagen","4","BLAUW","Niet geregistreerd","8","3996","2300","2840","2400","750","2200","20180418","20180418","Geen verstrekking in Open Data","229008","Ja",,,,,,,"4","4","0","0",,"505","194","M1",,,,"2840","971",,"e13*2007/46*0971*05","HF22","1654100","0","0.17","295","Ja","Nee",,"Nee","0","0","0.00","2024","Logisch","00","Nee","2024-04-18T00:00:00.000","2023-12-19T00:00:00.000","2018-04-18T00:00:00.000","2018-04-18T00:00:00.000",,,,,,,,,,,"142",,,,,,,,,,"A",,,,,,,"https://opendata.rdw.nl/resource/3huj-srit.json","https://opendata.rdw.nl/resource/8ys7-d773.json","https://opendata.rdw.nl/resource/vezc-m2t6.json","https://opendata.rdw.nl/resource/jhie-znh9.json","https://opendata.rdw.nl/resource/kmfi-hrps.json"
"SN575F","Personenauto","PORSCHE","PANAMERA TURBO S E-HYBRID","20240508","20240217","6934","hatchback","4","ZWART","Niet geregistreerd","8","3996","2285","2795","2385",,,"20180508","20180508","Geen verstrekking in Open Data","244223","Ja",,,,,,,"4","4","0","0",,"505","194","M1",,,,"2795","971",,"e13*2007/46*0971*04","GF22","1654100","0","0.17","295","Ja","Nee",,"Nee","0","0","0.00","2024","Logisch","00","Nee","2024-05-08T00:00:00.000","2024-02-17T00:00:00.000","2018-05-08T00:00:00.000","2018-05-08T00:00:00.000",,,,,,,,,,,"142",,,,,,,,,,"A",,,,,,,"https://opendata.rdw.nl/resource/3huj-srit.json","https://opendata.rdw.nl/resource/8ys7-d773.json","https://opendata.rdw.nl/resource/vezc-m2t6.json","https://opendata.rdw.nl/resource/jhie-znh9.json","https://opendata.rdw.nl/resource/kmfi-hrps.json"
"SV741V","Personenauto","PORSCHE","PANAMERA TURBO S E-HYBRID","20240723",,"7801","stationwagen","4","GRIJS","Niet geregistreerd","8","3996","2300","2840","2400","750","2200","20180723","20180723","Geen verstrekking in Open Data","238007","Nee",,,,,,,"4","4","0","0",,"505","194","M1",,,,"2840","971",,"e13*2007/46*0971*05","HF22","1654100","0","0.17","295","Ja","Nee",,"Nee","0","0","0.00","2023","Logisch","00","Nee","2024-07-23T00:00:00.000",,"2018-07-23T00:00:00.000","2018-07-23T00:00:00.000",,,,,,,,,,,"142",,,,,,,,,,"A",,,,,,,"https://opendata.rdw.nl/resource/3huj-srit.json","https://opendata.rdw.nl/resource/8ys7-d773.json","https://opendata.rdw.nl/resource/vezc-m2t6.json","https://opendata.rdw.nl/resource/jhie-znh9.json","https://opendata.rdw.nl/resource/kmfi-hrps.json"
"TH414S","Personenauto","PORSCHE","PANAMERA TURBO S E-HYBRID","20250310",,"7801","stationwagen","5","GRIJS","Niet geregistreerd","8","3996","2300","2900","2400","750","2200","20180804","20180804","Geen verstrekking in Open Data","240263","Ja",,,,,,,"4","4","0","0",,"505","194","M1",,,,"2900","971",,"e13*2007/46*0971*05","HF22","1655100","0","0.17","295","Ja","Nee",,"Nee","0","0","0.00","2023","Niet geregistreerd","NG","Nee","2025-03-10T00:00:00.000",,"2018-08-04T00:00:00.000","2018-08-04T00:00:00.000",,,,,,,,,,,"142",,,,,,,,,,"A",,,,,,,"https://opendata.rdw.nl/resource/3huj-srit.json","https://opendata.rdw.nl/resource/8ys7-d773.json","https://opendata.rdw.nl/resource/vezc-m2t6.json","https://opendata.rdw.nl/resource/jhie-znh9.json","https://opendata.rdw.nl/resource/kmfi-hrps.json"
"TK993K","Personenauto","PORSCHE","PANAMERA TURBO S E-HYBRID","20240831","20230706","6934","hatchback","4","GRIJS","Niet geregistreerd","8","3996","2285","2795","2385",,,"20180822","20180822","Geen verstrekking in Open Data","235201","Nee",,,,,,,"4","4","0","0",,"505","194","M1",,,,"2795","971",,"e13*2007/46*0971*04","GF22","1654100","0","0.17","295","Ja","Nee",,"Nee","0","0","0.00","2022","Logisch","00","Nee","2024-08-31T00:00:00.000","2023-07-06T00:00:00.000","2018-08-22T00:00:00.000","2018-08-22T00:00:00.000",,,,,,,,,,,"142",,,,,,,,,,"A",,,,,,,"https://opendata.rdw.nl/resource/3huj-srit.json","https://opendata.rdw.nl/resource/8ys7-d773.json","https://opendata.rdw.nl/resource/vezc-m2t6.json","https://opendata.rdw.nl/resource/jhie-znh9.json","https://opendata.rdw.nl/resource/kmfi-hrps.json"
"TV520J","Personenauto","PORSCHE","PANAMERA TURBO S E-HYBRID","20240419",,"6642","stationwagen","5","GRIJS","Niet geregistreerd","8","3996","2300","2900","2400",,,"20180419","20181101","Geen verstrekking in Open Data","224907","Nee",,,,,,,"4","4","0","0",,"0","0","M1",,,,"2900","971",,"e13*2007/46*0971*05","HF22","1655100","0","0.03","295","Ja","Nee",,"Nee","0","0","0.00","2023","Geen oordeel","05","Nee","2024-04-19T00:00:00.000",,"2018-04-19T00:00:00.000","2018-11-01T00:00:00.000",,,,,,,,,,,,,,,,,,,,,"A",,,,,,,"https://opendata.rdw.nl/resource/3huj-srit.json","https://opendata.rdw.nl/resource/8ys7-d773.json","https://opendata.rdw.nl/resource/vezc-m2t6.json","https://opendata.rdw.nl/resource/jhie-znh9.json","https://opendata.rdw.nl/resource/kmfi-hrps.json"