"kenteken","voertuigsoort","merk","handelsbenaming","vervaldatum_apk","datum_tenaamstelling","bruto_bpm","inrichting","aantal_zitplaatsen","eerste_kleur","tweede_kleur","aantal_cilinders","cilinderinhoud","massa_ledig_voertuig","toegestane_maximum_massa_voertuig","massa_rijklaar","maximum_massa_trekken_ongeremd","maximum_trekken_massa_geremd","datum_eerste_toelating","datum_eerste_tenaamstelling_in_nederland","wacht_op_keuren","catalogusprijs","wam_verzekerd","maximale_constructiesnelheid","laadvermogen","oplegger_geremd","aanhangwagen_autonoom_geremd","aanhangwagen_middenas_geremd","aantal_staanplaatsen","aantal_deuren","aantal_wielen","afstand_hart_koppeling_tot_achterzijde_voertuig","afstand_voorzijde_voertuig_tot_hart_koppeling","afwijkende_maximum_snelheid","lengte","breedte","europese_voertuigcategorie","europese_voertuigcategorie_toevoeging","europese_uitvoeringcategorie_toevoeging","plaats_chassisnummer","technische_max_massa_voertuig","type","type_gasinstallatie","typegoedkeuringsnummer","variant","uitvoering","volgnummer_wijziging_eu_typegoedkeuring","vermogen_massarijklaar","wielbasis","export_indicator","openstaande_terugroepactie_indicator","vervaldatum_tachograaf","taxi_indicator","maximum_massa_samenstelling","aantal_rolstoelplaatsen","maximum_ondersteunende_snelheid","jaar_laatste_registratie_tellerstand","tellerstandoordeel","code_toelichting_tellerstandoordeel","tenaamstellen_mogelijk","vervaldatum_apk_dt","datum_tenaamstelling_dt","datum_eerste_toelating_dt","datum_eerste_tenaamstelling_in_nederland_dt","vervaldatum_tachograaf_dt","maximum_last_onder_de_vooras_sen_tezamen_koppeling","type_remsysteem_voertuig_code","rupsonderstelconfiguratiecode","wielbasis_voertuig_minimum","wielbasis_voertuig_maximum","lengte_voertuig_minimum","lengte_voertuig_maximum","breedte_voertuig_minimum","breedte_voertuig_maximum","hoogte_voertuig","hoogte_voertuig_minimum","hoogte_voertuig_maximum","massa_bedrijfsklaar_minimaal","massa_bedrijfsklaar_maximaal","technisch_toelaatbaar_massa_koppelpunt","maximum_massa_technisch_maximaal","maximum_massa_technisch_minimaal","subcategorie_nederland","verticale_belasting_koppelpunt_getrokken_voertuig","zuinigheidsclassificatie","registratie_datum_goedkeuring_afschrijvingsmoment_bpm","registratie_datum_goedkeuring_afschrijvingsmoment_bpm_dt","gem_lading_wrde","aerodyn_voorz","massa_alt_aandr","verl_cab_ind","api_gekentekende_voertuigen_assen","api_gekentekende_voertuigen_brandstof","api_gekentekende_voertuigen_carrosserie","api_gekentekende_voertuigen_carrosserie_specifiek","api_gekentekende_voertuigen_voertuigklasse"
"G797FN","Personenauto","PORSCHE","PANAMERA 4S DIESEL",,"20240222","19949","hatchback","4","GRIJS","Niet geregistreerd","8","3956","2025","2635","2125","750","2200","20170125","20190910","Geen verstrekking in Open Data","198934","Ja","285",,,,,,"4","4","0","0",,"0","0","M1",,,,"2635","971",,"e13*2007/46*0971*01","GJ22","1644100","0","0.15","295","Ja","Nee",,"Nee","4835","0","0.00","2024","Geen oordeel","05","Nee",,"2024-02-22T00:00:00.000","2017-01-25T00:00:00.000","2019-09-10T00:00:00.000",,,,,,,,,,,,,,,,,,,,,"E",,,,,,,"https://opendata.rdw.nl/resource/3huj-srit.json","https://opendata.rdw.nl/resource/8ys7-d773.json","https://opendata.rdw.nl/resource/vezc-m2t6.json","https://opendata.rdw.nl/resource/jhie-znh9.json","https://opendata.rdw.nl/resource/kmfi-hrps.json"
"J543VD","Personenauto","PORSCHE","PANAMERA 4S DIESEL","20231022",,"18815","hatchback","4","GRIJS","Niet geregistreerd","8","3956","2025","2635","2125","750","2200","20170530","20201020","Geen verstrekking in Open Data","193979","Nee","285",,,,,,"4","4","0","0",,"0","0","M1",,,"r. voorzitting","2635","971",,"e13*2007/46*0971*03","GJ22","1644100","0","0.15","295","Ja","Nee",,"Nee","4835","0","0.00","2023","Geen oordeel","05","Nee","2023-10-22T00:00:00.000",,"2017-05-30T00:00:00.000","2020-10-20T00:00:00.000",,,,,,,,,,,,,,,,,,,,,"E",,,,,,,"https://opendata.rdw.nl/resource/3huj-srit.json","https://opendata.rdw.nl/resource/8ys7-d773.json","https://opendata.rdw.nl/resource/vezc-m2t6.json","https://opendata.rdw.nl/resource/jhie-znh9.json","https://opendata.rdw.nl/resource/kmfi-hrps.json"
"NB408H","Personenauto","PORSCHE","PANAMERA 4S DIESEL","20230106",,"24634","hatchback","4","GRIJS","Niet geregistreerd","8","3956","2025","2635","2125","750","2200","20170102","20170102","Geen verstrekking in Open Data","185587","Nee",,,,,,,"4","4","0","0",,"0","0","M1",,,"onder r. voorzitting","2635","971",,"e13*2007/46*0971*01","GJ22","1644100","0","0.15","295","Ja","Nee",,"Nee","4835","0","0.00","2022","Logisch","00","Nee","2023-01-06T00:00:00.000",,"2017-01-02T00:00:00.000","2017-01-02T00:00:00.000",,,,,,,,,,,,,,,,,,,,,"E",,,,,,,"https://opendata.rdw.nl/resource/3huj-srit.json","https://opendata.rdw.nl/resource/8ys7-d773.json","https://opendata.rdw.nl/resource/vezc-m2t6.json","https://opendata.rdw.nl/resource/jhie-znh9.json","https://opendata.rdw.nl/resource/kmfi-hrps.json"
"NB431H","Personenauto","PORSCHE","PANAMERA 4S DIESEL","20250111","20240417","24634","hatchback","4","BLAUW","Niet geregistreerd","8","3956","2025","2635","2125","750","2200","20170106","20170106","Geen verstrekking in Open Data","180974","Ja",,,,,,,"4","4","0","0",,"505","194","M1",,,"onder r. voorzitting","2635","971",,"e13*2007/46*0971*01","GJ22","1644100","0","0.15","295","Ja","Nee",,"Nee","4835","0","0.00","2024","Logisch","00","Nee","2025-01-11T00:00:00.000","2024-04-17T00:00:00.000","2017-01-06T00:00:00.000","2017-01-06T00:00:00.000",,,,,,,,,,,"142",,,,,,,,,,"E",,,,,,,"https://opendata.rdw.nl/resource/3huj-srit.json","https://opendata.rdw.nl/resource/8ys7-d773.json","https://opendata.rdw.nl/resource/vezc-m2t6.json","https://opendata.rdw.nl/resource/jhie-znh9.json","https://opendata.rdw.nl/resource/kmfi-hrps.json"
"NB944F","Personenauto","PORSCHE","PANAMERA 4S DIESEL","20240706","20240420","24634","hatchback","4","ZWART","Niet geregistreerd","8","3956","2025","2635","2125","750","2200","20170102","20170102","Geen verstrekking in Open Data","172210","Ja",,,,,,,"4","4","0","0",,"505","194","M1",,,"onder r. voorzitting","2635","971",,"e13*2007/46*0971*01","GJ22","1644100","0","0.15","295","Ja","Nee",,"Nee","4835","0","0.00","2024","Logisch","00","Nee","2024-07-06T00:00:00.000","2024-04-20T00:00:00.000","2017-01-02T00:00:00.000","2017-01-02T00:00:00.000",,,,,,,,,,,"142",,,,,,,,,,"E",,,,,,,"https://opendata.rdw.nl/resource/3huj-srit.json","https://opendata.rdw.nl/resource/8ys7-d773.json","https://opendata.rdw.nl/resource/vezc-m2t6.json","https://opendata.rdw.nl/resource/jhie-znh9.json","https://opendata.rdw.nl/resource/kmfi-hrps.json"
"ND022B","Personenauto","PORSCHE","PANAMERA 4S DIESEL","20240309",,"24634","hatchback","4","BLAUW","Niet geregistreerd","8","3956","2025","2635","2125","750","2200","20170102","20170102","Geen verstrekking in Open Data","164621","Nee",,,,,,,"4","4","0","0",,"505","194","M1",,,"onder r. voorzitting","2635","971",,"e13*2007/46*0971*01","GJ22","1644100","0","0.15","295","Ja","Nee",,"Nee","4835","0","0.00","2023","Logisch","00","Nee","2024-03-09T00:00:00.000",,"2017-01-02T00:00:00.000","2017-01-02T00:00:00.000",,,,,,,,,,,"142",,,,,,,,,,"E",,,,,,,"https://opendata.rdw.nl/resource/3huj-srit.json","https://opendata.rdw.nl/resource/8ys7-d773.json","https://opendata.rdw.nl/resource/vezc-m2t6.json","https://opendata.rdw.nl/resource/jhie-znh9.json","https://opendata.rdw.nl/resource/kmfi-hrps.json"
"ND314K","Personenauto","PORSCHE","PANAMERA 4S DIESEL","20240323","20231110","24634","hatchback","4","BLAUW","Niet geregistreerd","8","3956","2025","2635","2125","750","2200","20170103","20170103","Geen verstrekking in Open Data","199120","Ja",,,,,,,"4","4","0","0",,"505","194","M1",,,"onder r. voorzitting","2635","971",,"e13*2007/46*0971*01","GJ22","1644100","0","0.15","295","Ja","Nee",,"Nee","4835","0","0.00","2024","Logisch","00","Nee","2024-03-23T00:00:00.000","2023-11-10T00:00:00.000","2017-01-03T00:00:00.000","2017-01-03T00:00:00.000",,,,,,,,,,,"142",,,,,,,,,,"E",,,,,,,"https://opendata.rdw.nl/resource/3huj-srit.json","https://opendata.rdw.nl/resource/8ys7-d773.json","https://opendata.rdw.nl/resource/vezc-m2t6.json","https://opendata.rdw.nl/resource/jhie-znh9.json","https://opendata.rdw.nl/resource/kmfi-hrps.json"
"ND316K","Personenauto","PORSCHE","PANAMERA 4S DIESEL","20240516",,"24634","hatchback","4","GRIJS","Niet geregistreerd","8","3956","2025","2635","2125","750","2200","20170105","20170105","Geen verstrekking in Open Data","180752","Nee",,,,,,,"4","4","0","0",,"505","194","M1",,,"onder r. voorzitting","2635","971",,"e13*2007/46*0971*01","GJ22","1644100","0","0.15","295","Ja","Nee",,"Nee","4835","0","0.00","2023","Logisch","00","Nee","2024-05-16T00:00:00.000",,"2017-01-05T00:00:00.000","2017-01-05T00:00:00.000",,,,,,,,,,,"142",,,,,,,,,,"E",,,,,,,"https://opendata.rdw.nl/resource/3huj-srit.json","https://opendata.rdw.nl/resource/8ys7-d773.json","https://opendata.rdw.nl/resource/vezc-m2t6.json","https://opendata.rdw.nl/resource/jhie-znh9.json","https://opendata.rdw.nl/resource/kmfi-hrps.json"
"NG099J","Personenauto","PORSCHE","PANAMERA 4S DIESEL","20230307",,"18969","hatchback","4","GRIJS","Niet geregistreerd","8","3956","2025","2635","2125","750","2200","20170105","20170119","Geen verstrekking in Open Data","171541","Nee",,,,,,,"4","4","0","0",,"0","0","M1",,,"r. voorzitting","2635","971",,"e13*2007/46*0971*01","GJ22","1644100","0","0.15","295","Ja","Nee",,"Nee","4835","0","0.00","2022","Logisch","00","Nee","2023-03-07T00:00:00.000",,"2017-01-05T00:00:00.000","2017-01-19T00:00:00.000",,,,,,,,,,,,,,,,,,,,,"E",,,,,,,"https://opendata.rdw.nl/resource/3huj-srit.json","https://opendata.rdw.nl/resource/8ys7-d773.json","https://opendata.rdw.nl/resource/vezc-m2t6.json","https://opendata.rdw.nl/resource/jhie-znh9.json","https://opendata.rdw.nl/resource/kmfi-hrps.json"
"NJ315R","Personenauto","PORSCHE","PANAMERA 4S DIESEL","20240123",,"13957","hatchback","4","ZWART","Niet geregistreerd","8","3956","2025","2635","2125","750","2200","20170102","20170210","Geen verstrekking in Open Data","172713","Nee",,,,,,,"4","4","0","0",,"0","0","M1",,,"r. voorzitting","2635","971",,"e13*2007/46*0971*01","GJ22","1644100","0","0.15","295","Ja","Nee",,"Nee","4835","0","0.00","2023","Geen oordeel","05","Nee","2024-01-23T00:00:00.000",,"2017-01-02T00:00:00.000","2017-02-10T00:00:00.000",,,,,,,,,,,,,,,,,,,,,"E",,,,,,,"https://opendata.rdw.nl/resource/3huj-srit.json","https://opendata.rdw.nl/resource/8ys7-d773.json","https://opendata.rdw.nl/resource/vezc-m2t6.json","https://opendata.rdw.nl/resource/jhie-znh9.json","https://opendata.rdw.nl/resource/kmfi-hrps.json"
"NJ325N","Personenauto","PORSCHE","PANAMERA 4S DIESEL","20240302",,"17101","hatchback","4","ZWART","Niet geregistreerd","8","3956","2025","2635","2125","750","2200","20161104","20170217","Geen verstrekking in Open Data","155263","Nee",,,,,,,"4","4","0","0",,"0","0","M1",,,"r. voorzitting","2635","971",,"e13*2007/46*0971*01","GJ22","1644100","0","0.15","295","Ja","Nee",,"Nee","4835","0","0.00","2023","Geen oordeel","05","Nee","2024-03-02T00:00:00.000",,"2016-11-04T00:00:00.000","2017-02-17T00:00:00.000",,,,,,,,,,,,,,,,,,,,,"E",,,,,,,"https://opendata.rdw.nl/resource/3huj-srit.json","https://opendata.rdw.nl/resource/8ys7-d773.json","https://opendata.rdw.nl/resource/vezc-m2t6.json","https://opendata.rdw.nl/resource/jhie-znh9.json","https://opendata.rdw.nl/resource/kmfi-hrps.json"
"NJ410T","Personenauto","PORSCHE","PANAMERA 4S DIESEL","20241004",,"28010","hatchback","4","GRIJS","Niet geregistreerd","8","3956","2025","2635","2125","750","2200","20170216","20170216","Geen verstrekking in Open Data","175626","Nee",,,,,,,"4","4","0","0",,"505","194","M1",,,"onder r. voorzitting","2635","971",,"e13*2007/46*0971*02","GJ22","1644100","0","0.15","295","Ja","Nee",,"Nee","4835","0","0.00","2023","Logisch","00","Nee","2024-10-04T00:00:00.000",,"2017-02-16T00:00:00.000","2017-02-16T00:00:00.000",,,,,,,,,,,"142",,,,,,,,,,"E",,,,,,,"https://opendata.rdw.nl/resource/3huj-srit.json","https://opendata.rdw.nl/resource/8ys7-d773.json","https://opendata.rdw.nl/resource/vezc-m2t6.json","https://opendata.rdw.nl/resource/jhie-znh9.json","https://opendata.rdw.nl/resource/kmfi-hrps.json"
"NJ524H","Personenauto","PORSCHE","PANAMERA 4S DIESEL","20230920",,"18181","hatchback","4","ZWART","Niet geregistreerd","8","3956","2025","2635","2125","750","2200","20170110","20170216","Geen verstrekking in Open Data","200493","Nee",,,,,,,"4","4","0","0",,"0","0","M1",,,"r. voorzitting","2635","971",,"e13*2007/46*0971*01","GJ22","1644100","0","0.15","295","Ja","Nee",,"Nee","4835","0","0.00","2023","Logisch","00","Nee","2023-09-20T00:00:00.000",,"2017-01-10T00:00:00.000","2017-02-16T00:00:00.000",,,,,,,,,,,,,,,,,,,,,"E",,,,,,,"https://opendata.rdw.nl/resource/3huj-srit.json","https://opendata.rdw.nl/resource/8ys7-d773.json","https://opendata.rdw.nl/resource/vezc-m2t6.json","https://opendata.rdw.nl/resource/jhie-znh9.json","https://opendata.rdw.nl/resource/kmfi-hrps.json"
"NL709Z","Personenauto","PORSCHE","PANAMERA 4S DIESEL","20221215",,"28010","hatchback","4","GRIJS","Niet geregistreerd","8","3956","2025","2635","2125","750","2200","20170307","20170307","Geen verstrekking in Open Data","206412","Nee",,,,,,,"4","4","0","0",,"0","0","M1",,,"onder r. voorzitting","2635","971",,"e13*2007/46*0971*02","GJ22","1644100","0","0.15","295","Ja","Nee",,"Nee","4835","0","0.00","2022","Logisch","00","Nee","2022-12-15T00:00:00.000",,"2017-03-07T00:00:00.000","2017-03-07T00:00:00.000",,,,,,,,,,,,,,,,,,,,,"E",,,,,,,"https://opendata.rdw.nl/resource/3huj-srit.json","https://opendata.rdw.nl/resource/8ys7-d773.json","https://opendata.rdw.nl/resource/vezc-m2t6.json","https://opendata.rdw.nl/resource/jhie-znh9.json","https://opendata.rdw.nl/resource/kmfi-hrps.json"
"NN869X","Personenauto","PORSCHE","PANAMERA 4S DIESEL","20240519",,"28010","hatchback","4","ZWART","Niet geregistreerd","8","3956","2025","2635","2125","750","2200","20170316","20170316","Geen verstrekking in Open Data","232983","Nee",,,,,,,"4","4","0","0",,"505","194","M1",,,"onder r. voorzitting","2635","971",,"e13*2007/46*0971*02","GJ22","1644100","0","0.15","295","Ja","Nee",,"Nee","4835","0","0.00","2023","Logisch","00","Nee","2024-05-19T00:00:00.000",,"2017-03-16T00:00:00.000","2017-03-16T00:00:00.000",,,,,,,,,,,"142",,,,,,,,,,"E",,,,,,,"https://opendata.rdw.nl/resource/3huj-srit.json","https://opendata.rdw.nl/resource/8ys7-d773.json","https://opendata.rdw.nl/resource/vezc-m2t6.json","https://opendata.rdw.nl/resource/jhie-znh9.json","https://opendata.rdw.nl/resource/kmfi-hrps.json"
"NP519F","Personenauto","PORSCHE","PANAMERA 4S DIESEL","20231125",,"26887","hatchback","4","GRIJS","Niet geregistreerd","8","3956","2025","2635","2125","750","2200","20170323","20170323","Geen verstrekking in Open Data","169558","Nee",,,,,,,"4","4","0","0",,"505","194","M1",,,"onder r. voorzitting","2635","971",,"e13*2007/46*0971*02","GJ22","1634100","0","0.15","295","Ja","Nee",,"Nee","4835","0","0.00","2023","Logisch","00","Nee","2023-11-25T00:00:00.000",,"2017-03-23T00:00:00.000","2017-03-23T00:00:00.000",,,,,,,,,,,"142",,,,,,,,,,"D",,,,,,,"https://opendata.rdw.nl/resource/3huj-srit.json","https://opendata.rdw.nl/resource/8ys7-d773.json","https://opendata.rdw.nl/resource/vezc-m2t6.json","https://opendata.rdw.nl/resource/jhie-znh9.json","https://opendata.rdw.nl/resource/kmfi-hrps.json"
"NP814K","Personenauto","PORSCHE","PANAMERA 4S DIESEL","20230706",,"28010","hatchback","4","GRIJS","Niet geregistreerd","8","3956","2025","2635","2125","750","2200","20170329","20170329","Geen verstrekking in Open Data","187144","Nee",,,,,,,"4","4","0","0",,"505","194","M1",,,"onder r. voorzitting","2635","971",,"e13*2007/46*0971*02","GJ22","1644100","0","0.15","295","Ja","Nee",,"Nee","4835","0","0.00","2023","Logisch","00","Nee","2023-07-06T00:00:00.000",,"2017-03-29T00:00:00.000","2017-03-29T00:00:00.000",,,,,,,,,,,"142",,,,,,,,,,"E",,,,,,,"https://opendata.rdw.nl/resource/3huj-srit.json","https://opendata.rdw.nl/resource/8ys7-d773.json","https://opendata.rdw.nl/resource/vezc-m2t6.json","https://opendata.rdw.nl/resource/jhie-znh9.json","https://opendata.rdw.nl/resource/kmfi-hrps.json"
"NT474S","Personenauto","PORSCHE","PANAMERA 4S DIESEL","20230421",,"28010","hatchback","4","ZWART","Niet geregistreerd","8","3956","2025","2635","2125","750","2200","20170421","20170421","Geen verstrekking in Open Data","183902","Nee",,,,,,,"4","4","0","0",,"505","194","M1",,,"onder r. voorzitting","2635","971",,"e13*2007/46*0971*01","GJ22","1644100","0","0.15","295","Ja","Nee",,"Nee","4835","0","0.00","2023","Logisch","00","Nee","2023-04-21T00:00:00.000",,"2017-04-21T00:00:00.000","2017-04-21T00:00:00.000",,,,,,,,,,,"142",,,,,,,,,,"E",,,,,,,"https://opendata.rdw.nl/resource/3huj-srit.json","https://opendata.rdw.nl/resource/8ys7-d773.json","https://opendata.rdw.nl/resource/vezc-m2t6.json","https://opendata.rdw.nl/resource/jhie-znh9.json","https://opendata.rdw.nl/resource/kmfi-hrps.json"
"PD429P","Personenauto","PORSCHE","PANAMERA 4S DIESEL","20240912","20240306","28010","hatchback","4","GRIJS","Niet geregistreerd","8","3956","2025","2635","2125","750","2200","20170609","20170609","Geen verstrekking in Open Data","187997","Ja",,,,,,,"4","4","0","0",,"505","194","M1",,,"onder r. voorzitting","2635","971",,"e13*2007/46*0971*02","GJ22","1644100","0","0.15","295","Ja","Nee",,"Nee","4835","0","0.00","2024","Logisch","00","Nee","2024-09-12T00:00:00.000","2024-03-06T00:00:00.000","2017-06-09T00:00:00.000","2017-06-09T00:00:00.000",,,,,,,,,,,"142",,,,,,,,,,"E",,,,,,,"https://opendata.rdw.nl/resource/3huj-srit.json","https://opendata.rdw.nl/resource/8ys7-d773.json","https://opendata.rdw.nl/resource/vezc-m2t6.json","https://opendata.rdw.nl/resource/jhie-znh9.json","https://opendata.rdw.nl/resource/kmfi-hrps.json"
"PG869B","Personenauto","PORSCHE","PANAMERA 4S DIESEL",,,"15651","hatchback","4","GRIJS","Niet geregistreerd","8","3956","2025","2635","2125","750","2200","20170601","20170619","Geen verstrekking in Open Data","201119","Nee",,,,,,,"4","4","0","0",,"0","0","M1",,,"r. voorzitting","2635","971",,"e13*2007/46*0971*03","GJ22","1644100","0","0.15","295","Ja","Nee",,"Nee","4835","0","0.00","2022","Logisch","00","Nee",,,"2017-06-01T00:00:00.000","2017-06-19T00:00:00.000",,,,,,,,,,,,,,,,,,,,,"E",,,,,,,"https://opendata.rdw.nl/resource/3huj-srit.json","https://opendata.rdw.nl/resource/8ys7-d773.json","https://opendata.rdw.nl/resource/vezc-m2t6.json","https://opendata.rdw.nl/resource/jhie-znh9.json","https://opendata.rdw.nl/resource/kmfi-hrps.json"
"PL637H","Personenauto","PORSCHE","PANAMERA 4S DIESEL","20240301",,"20487","hatchback","4","GRIJS","Niet geregistreerd","8","3956","2025","2635","2125","750","2200","20170301","20170913","Geen verstrekking in Open Data","185020","Nee",,,,,,,"4","4","0","0",,"0","0","M1",,,"r. voorzitting","2635","971",,"e13*2007/46*0971*01","GJ22","1644100","0","0.15","295","Ja","Nee",,"Nee","4835","0","0.00","2023","Geen oordeel","05","Nee","2024-03-01T00:00:00.000",,"2017-03-01T00:00:00.000","2017-09-13T00:00:00.000",,,,,,,,,,,,,,,,,,,,,"E",,,,,,,"https://opendata.rdw.nl/resource/3huj-srit.json","https://opendata.rdw.nl/resource/8ys7-d773.json","https://opendata.rdw.nl/resource/vezc-m2t6.json","https://opendata.rdw.nl/resource/jhie-znh9.json","https://opendata.rdw.nl/resource/kmfi-hrps.json"
"PN504S","Personenauto","PORSCHE","PANAMERA 4S DIESEL","20250417","20240423","19694","hatchback","4","GRIJS","Niet geregistreerd","8","3956","2025","2635","2125","750","2200","20170118","20170803","Geen verstrekking in Open Data","195083","Ja",,,,,,,"4","4","0","0",,"0","0","M1",,,"r. voorzitting","2635","971",,"e13*2007/46*0971*01","GJ22","1644100","0","0.15","295","Ja","Nee",,"Nee","4835","0","0.00","2024","Geen oordeel","05","Nee","2025-04-17T00:00:00.000","2024-04-23T00:00:00.000","2017-01-18T00:00:00.000","2017-08-03T00:00:00.000",,,,,,,,,,,,,,,,,,,,,"E",,,,,,,"https://opendata.rdw.nl/resource/3huj-srit.json","https://opendata.rdw.nl/resource/8ys7-d773.json","https://opendata.rdw.nl/resource/vezc-m2t6.json","https://opendata.rdw.nl/resource/jhie-znh9.json","https://opendata.rdw.nl/resource/kmfi-hrps.json"
"RK136B","Personenauto","PORSCHE","PANAMERA 4S DIESEL","20230626",,"19075","hatchback","4","GRIJS","Niet geregistreerd","8","3956","2025","2635","2125","750","2200","20170524","20180108","Geen verstrekking in Open Data","192648","Nee",,,,,,,"4","4","0","0",,"0","0","M1",,,"r. voorzitting","2635","971",,"e13*2007/46*0971*03","GJ22","1644100","0","0.15","295","Ja","Nee",,"Nee","4835","0","0.00","2023","Geen oordeel","05","Nee","2023-06-26T00:00:00.000",,"2017-05-24T00:00:00.000","2018-01-08T00:00:00.000",,,,,,,,,,,,,,,,,,,,,"E",,,,,,,"https://opendata.rdw.nl/resource/3huj-srit.json","https://opendata.rdw.nl/resource/8ys7-d773.json","https://opendata.rdw.nl/resource/vezc-m2t6.json","https://opendata.rdw.nl/resource/jhie-znh9.json","https://opendata.rdw.nl/resource/kmfi-hrps.json"
"RS177B","Personenauto","PORSCHE","PANAMERA 4S DIESEL","20230831",,"20045","hatchback","4","GRIJS","Niet geregistreerd","8","3956","2025","2635","2125","750","2200","20170815","20181128","Geen verstrekking in Open Data","185300","Nee",,,,,,,"4","4","0","0",,"0","0","M1",,,"r. voorzitting","2635","971",,"e13*2007/46*0971*03","GJ22","1644100","0","0.15","295","Ja","Nee",,"Nee","4835","0","0.00","2023","Geen oordeel","05","Nee","2023-08-31T00:00:00.000",,"2017-08-15T00:00:00.000","2018-11-28T00:00:00.000",,,,,,,,,,,,,,,,,,,,,"E",,,,,,,"https://opendata.rdw.nl/resource/3huj-srit.json","https://opendata.rdw.nl/resource/8ys7-d773.json","https://opendata.rdw.nl/resource/vezc-m2t6.json","https://opendata.rdw.nl/resource/jhie-znh9.json","https://opendata.rdw.nl/resource/kmfi-hrps.json"
"RZ029L","Personenauto","PORSCHE","PANAMERA 4S DIESEL","20231102",,"21288","hatchback","4","GRIJS","Niet geregistreerd","8","3956","2025","2635","2125","750","2200","20161102","20180301","Geen verstrekking in Open Data","175004","Nee",,,,,,,"4","4","0","0",,"0","0","M1",,,"r. voorzitting","2635","971",,"e13*2007/46*0971*01","GJ22","1644100","0","0.15","295","Ja","Nee",,"Nee","4835","0","0.00","2023","Geen oordeel","05","Nee","2023-11-02T00:00:00.000",,"2016-11-02T00:00:00.000","2018-03-01T00:00:00.000",,,,,,,,,,,,,,,,,,,,,"E",,,,,,,"https://opendata.rdw.nl/resource/3huj-srit.json","https://opendata.rdw.nl/resource/8ys7-d773.json","https://opendata.rdw.nl/resource/vezc-m2t6.json","https://opendata.rdw.nl/resource/jhie-znh9.json","https://opendata.rdw.nl/resource/kmfi-hrps.json"
"SF276G","Personenauto","PORSCHE","PANAMERA 4S DIESEL","20230823",,"20257","hatchback","4","ZWART","Niet geregistreerd","8","3956","2025","2635","2125","750","2200","20170815","20180313","Geen verstrekking in Open Data","186542","Nee",,,,,,,"4","4","0","0",,"0","0","M1",,,"r. voorzitting","2635","971",,"e13*2007/46*0971*04","GJ22","1644100","0","0.15","295","Ja","Nee",,"Nee","4835","0","0.00","2023","Geen oordeel","05","Nee","2023-08-23T00:00:00.000",,"2017-08-15T00:00:00.000","2018-03-13T00:00:00.000",,,,,,,,,,,,,,,,,,,,,"E",,,,,,,"https://opendata.rdw.nl/resource/3huj-srit.json","https://opendata.rdw.nl/resource/8ys7-d773.json","https://opendata.rdw.nl/resource/vezc-m2t6.json","https://opendata.rdw.nl/resource/jhie-znh9.json","https://opendata.rdw.nl/resource/kmfi-hrps.json"